carbondata-commits mailing list archives

Site index · List index
Message view « Date » · « Thread »
Top « Date » · « Thread »
From Apache Jenkins Server <jenk...@builds.apache.org>
Subject Build failed in Jenkins: carbondata-master-spark-2.1 » Apache CarbonData :: Examples #3573
Date Sun, 09 Jun 2019 09:59:49 GMT
See <https://builds.apache.org/job/carbondata-master-spark-2.1/org.apache.carbondata$carbondata-examples/3573/display/redirect>

------------------------------------------
[...truncated 277.11 KB...]
+------------------+--------------------+
| 28.91235059760956|2019-01-01 00:00:...|
|30.677824267782427|2006-01-01 00:00:...|
|27.392857142857142|2010-01-01 00:00:...|
|              30.5|                null|
|29.384615384615383|2018-01-01 00:00:...|
| 29.48068669527897|2017-01-01 00:00:...|
|              29.9|2003-01-01 00:00:...|
|29.817021276595746|2005-01-01 00:00:...|
|28.804081632653062|2014-01-01 00:00:...|
|29.929961089494164|2016-01-01 00:00:...|
|29.650862068965516|2015-01-01 00:00:...|
|29.995744680851065|2011-01-01 00:00:...|
|            29.304|2009-01-01 00:00:...|
|27.865168539325843|2002-01-01 00:00:...|
| 30.17509727626459|2004-01-01 00:00:...|
|30.984313725490196|2000-01-01 00:00:...|
| 30.16296296296296|2008-01-01 00:00:...|
| 29.11934156378601|2012-01-01 00:00:...|
|28.467432950191572|2007-01-01 00:00:...|
|29.415254237288135|2013-01-01 00:00:...|
+------------------+--------------------+
only showing top 20 rows

2019-06-09 09:58:23 AUDIT audit:72 - {"time":"June 9, 2019 2:58:23 AM PDT","username":"jenkins","opName":"DROP
TABLE","opId":"4851257016739153","opStatus":"START"}
2019-06-09 09:58:25 AUDIT audit:93 - {"time":"June 9, 2019 2:58:25 AM PDT","username":"jenkins","opName":"DROP
TABLE","opId":"4851257016739153","opStatus":"SUCCESS","opTime":"1359 ms","table":"default.timeseriestable","extraInfo":{}}
- TimeSeriesPreAggregateTableExample
2019-06-09 09:58:25 AUDIT audit:72 - {"time":"June 9, 2019 2:58:25 AM PDT","username":"jenkins","opName":"CREATE
TABLE","opId":"4851258524170648","opStatus":"START"}
2019-06-09 09:58:25 AUDIT audit:93 - {"time":"June 9, 2019 2:58:25 AM PDT","username":"jenkins","opName":"CREATE
TABLE","opId":"4851258524170648","opStatus":"SUCCESS","opTime":"91 ms","table":"default.persontable","extraInfo":{"bad_record_path":"","streaming":"false","local_dictionary_enable":"true","external":"false","sort_columns":"","comment":""}}
2019-06-09 09:58:25 AUDIT audit:72 - {"time":"June 9, 2019 2:58:25 AM PDT","username":"jenkins","opName":"LOAD
DATA OVERWRITE","opId":"4851258617976962","opStatus":"START"}
2019-06-09 09:58:26 AUDIT audit:93 - {"time":"June 9, 2019 2:58:26 AM PDT","username":"jenkins","opName":"LOAD
DATA OVERWRITE","opId":"4851258617976962","opStatus":"SUCCESS","opTime":"918 ms","table":"default.personTable","extraInfo":{"SegmentId":"0","DataSize":"771.27KB","IndexSize":"720.0B"}}
2019-06-09 09:58:26 AUDIT audit:72 - {"time":"June 9, 2019 2:58:26 AM PDT","username":"jenkins","opName":"CREATE
DATAMAP","opId":"4851259548138414","opStatus":"START"}
2019-06-09 09:58:29 AUDIT audit:93 - {"time":"June 9, 2019 2:58:29 AM PDT","username":"jenkins","opName":"CREATE
DATAMAP","opId":"4851259548138414","opStatus":"SUCCESS","opTime":"2702 ms","table":"default.persontable","extraInfo":{"provider":"lucene","dmName":"dm","index_columns":"id
, name"}}
+--------+
|count(1)|
+--------+
|       4|
+--------+

+--------+
|count(1)|
+--------+
|       4|
+--------+

time for query on table with lucene datamap table:0.285
time for query on table without lucene datamap table:0.231
+-----------------+-------------+
|               id|         name|
+-----------------+-------------+
|which test1 good4|who and name5|
|which test1 good2|who and name6|
|which test1 good4|who and name5|
|which test1 good2|who and name6|
+-----------------+-------------+

+-----------------+-------------+
|               id|         name|
+-----------------+-------------+
|which test1 good4|who and name5|
|which test1 good2|who and name6|
|which test1 good4|who and name5|
|which test1 good2|who and name6|
+-----------------+-------------+

2019-06-09 09:58:30 AUDIT audit:72 - {"time":"June 9, 2019 2:58:30 AM PDT","username":"jenkins","opName":"DROP
TABLE","opId":"4851263150942518","opStatus":"START"}
2019-06-09 09:58:30 AUDIT audit:93 - {"time":"June 9, 2019 2:58:30 AM PDT","username":"jenkins","opName":"DROP
TABLE","opId":"4851263150942518","opStatus":"SUCCESS","opTime":"146 ms","table":"default.persontable","extraInfo":{}}
- LuceneDataMapExample
2019-06-09 09:58:30 AUDIT audit:72 - {"time":"June 9, 2019 2:58:30 AM PDT","username":"jenkins","opName":"CREATE
TABLE","opId":"4851263315722885","opStatus":"START"}
2019-06-09 09:58:30 AUDIT audit:93 - {"time":"June 9, 2019 2:58:30 AM PDT","username":"jenkins","opName":"CREATE
TABLE","opId":"4851263315722885","opStatus":"SUCCESS","opTime":"73 ms","table":"default.origin_table","extraInfo":{"bad_record_path":"","local_dictionary_enable":"true","external":"false","sort_columns":"","comment":""}}
2019-06-09 09:58:30 AUDIT audit:72 - {"time":"June 9, 2019 2:58:30 AM PDT","username":"jenkins","opName":"LOAD
DATA","opId":"4851263395343264","opStatus":"START"}
2019-06-09 09:58:30 ERROR DataLoadExecutor:55 - Data Load is partially success for table origin_table
2019-06-09 09:58:30 AUDIT audit:93 - {"time":"June 9, 2019 2:58:30 AM PDT","username":"jenkins","opName":"LOAD
DATA","opId":"4851263395343264","opStatus":"SUCCESS","opTime":"209 ms","table":"default.origin_table","extraInfo":{"SegmentId":"0","DataSize":"2.85KB","IndexSize":"1.43KB"}}
2019-06-09 09:58:30 AUDIT audit:72 - {"time":"June 9, 2019 2:58:30 AM PDT","username":"jenkins","opName":"LOAD
DATA","opId":"4851263611863297","opStatus":"START"}
2019-06-09 09:58:30 ERROR DataLoadExecutor:55 - Data Load is partially success for table origin_table
2019-06-09 09:58:30 AUDIT audit:93 - {"time":"June 9, 2019 2:58:30 AM PDT","username":"jenkins","opName":"LOAD
DATA","opId":"4851263611863297","opStatus":"SUCCESS","opTime":"205 ms","table":"default.origin_table","extraInfo":{"SegmentId":"1","DataSize":"2.85KB","IndexSize":"1.43KB"}}
2019-06-09 09:58:30 AUDIT audit:72 - {"time":"June 9, 2019 2:58:30 AM PDT","username":"jenkins","opName":"LOAD
DATA","opId":"4851263822715985","opStatus":"START"}
2019-06-09 09:58:30 ERROR DataLoadExecutor:55 - Data Load is partially success for table origin_table
2019-06-09 09:58:30 AUDIT audit:93 - {"time":"June 9, 2019 2:58:30 AM PDT","username":"jenkins","opName":"LOAD
DATA","opId":"4851263822715985","opStatus":"SUCCESS","opTime":"190 ms","table":"default.origin_table","extraInfo":{"SegmentId":"2","DataSize":"2.85KB","IndexSize":"1.43KB"}}
2019-06-09 09:58:30 AUDIT audit:72 - {"time":"June 9, 2019 2:58:30 AM PDT","username":"jenkins","opName":"LOAD
DATA","opId":"4851264017602787","opStatus":"START"}
2019-06-09 09:58:31 ERROR DataLoadExecutor:55 - Data Load is partially success for table origin_table
2019-06-09 09:58:31 AUDIT audit:93 - {"time":"June 9, 2019 2:58:31 AM PDT","username":"jenkins","opName":"LOAD
DATA","opId":"4851264017602787","opStatus":"SUCCESS","opTime":"182 ms","table":"default.origin_table","extraInfo":{"SegmentId":"3","DataSize":"2.85KB","IndexSize":"1.43KB"}}
+--------+
|count(1)|
+--------+
|      40|
+--------+

2019-06-09 09:58:31 AUDIT audit:72 - {"time":"June 9, 2019 2:58:31 AM PDT","username":"jenkins","opName":"CREATE
TABLE","opId":"4851264271427531","opStatus":"START"}
2019-06-09 09:58:31 AUDIT audit:93 - {"time":"June 9, 2019 2:58:31 AM PDT","username":"jenkins","opName":"CREATE
TABLE","opId":"4851264271427531","opStatus":"SUCCESS","opTime":"68 ms","table":"default.external_table","extraInfo":{"bad_record_path":"","_filelevelformat":"false","local_dictionary_enable":"true","external":"true","_external":"true","sort_columns":"","comment":""}}
+--------+
|count(1)|
+--------+
|      40|
+--------+

2019-06-09 09:58:31 AUDIT audit:72 - {"time":"June 9, 2019 2:58:31 AM PDT","username":"jenkins","opName":"LOAD
DATA","opId":"4851264413158262","opStatus":"START"}
2019-06-09 09:58:31 ERROR DataLoadExecutor:55 - Data Load is partially success for table origin_table
2019-06-09 09:58:31 AUDIT audit:93 - {"time":"June 9, 2019 2:58:31 AM PDT","username":"jenkins","opName":"LOAD
DATA","opId":"4851264413158262","opStatus":"SUCCESS","opTime":"174 ms","table":"default.origin_table","extraInfo":{"SegmentId":"4","DataSize":"2.85KB","IndexSize":"1.43KB"}}
2019-06-09 09:58:31 AUDIT audit:72 - {"time":"June 9, 2019 2:58:31 AM PDT","username":"jenkins","opName":"LOAD
DATA","opId":"4851264592910810","opStatus":"START"}
2019-06-09 09:58:31 ERROR DataLoadExecutor:55 - Data Load is partially success for table origin_table
2019-06-09 09:58:31 AUDIT audit:93 - {"time":"June 9, 2019 2:58:31 AM PDT","username":"jenkins","opName":"LOAD
DATA","opId":"4851264592910810","opStatus":"SUCCESS","opTime":"229 ms","table":"default.origin_table","extraInfo":{"SegmentId":"5","DataSize":"2.85KB","IndexSize":"1.43KB"}}
+--------+
|count(1)|
+--------+
|      60|
+--------+

2019-06-09 09:58:31 AUDIT audit:72 - {"time":"June 9, 2019 2:58:31 AM PDT","username":"jenkins","opName":"DROP
TABLE","opId":"4851264895045031","opStatus":"START"}
2019-06-09 09:58:31 AUDIT audit:93 - {"time":"June 9, 2019 2:58:31 AM PDT","username":"jenkins","opName":"DROP
TABLE","opId":"4851264895045031","opStatus":"SUCCESS","opTime":"111 ms","table":"default.origin_table","extraInfo":{}}
- ExternalTableExample

Data:
0	robot0	0	0	9223372036854775807	0.0	true	2019-03-01	2019-02-12 03:03:34.0	12.35	varchar	
Hello World From Carbon 
1	robot1	1	1	9223372036854775806	0.5	true	2019-03-01	2019-02-12 03:03:34.0	12.35	varchar	
Hello World From Carbon 
2	robot2	2	2	9223372036854775805	1.0	true	2019-03-01	2019-02-12 03:03:34.0	12.35	varchar	
Hello World From Carbon 
3	robot3	3	3	9223372036854775804	1.5	true	2019-03-01	2019-02-12 03:03:34.0	12.35	varchar	
Hello World From Carbon 
4	robot4	4	4	9223372036854775803	2.0	true	2019-03-01	2019-02-12 03:03:34.0	12.35	varchar	
Hello World From Carbon 
5	robot5	5	5	9223372036854775802	2.5	true	2019-03-01	2019-02-12 03:03:34.0	12.35	varchar	
Hello World From Carbon 
6	robot6	6	6	9223372036854775801	3.0	true	2019-03-01	2019-02-12 03:03:34.0	12.35	varchar	
Hello World From Carbon 
7	robot7	7	7	9223372036854775800	3.5	true	2019-03-01	2019-02-12 03:03:34.0	12.35	varchar	
Hello World From Carbon 
8	robot8	8	8	9223372036854775799	4.0	true	2019-03-01	2019-02-12 03:03:34.0	12.35	varchar	
Hello World From Carbon 
9	robot9	9	9	9223372036854775798	4.5	true	2019-03-01	2019-02-12 03:03:34.0	12.35	varchar	
Hello World From Carbon 

Data:
0	robot0	2019-03-01	2019-02-12 03:03:34.0	varchar	Hello World From Carbon 	0	0	9223372036854775807
0.0	true	12.35	
1	robot1	2019-03-01	2019-02-12 03:03:34.0	varchar	Hello World From Carbon 	1	1	9223372036854775806
0.5	true	12.35	
2	robot2	2019-03-01	2019-02-12 03:03:34.0	varchar	Hello World From Carbon 	2	2	9223372036854775805
1.0	true	12.35	
3	robot3	2019-03-01	2019-02-12 03:03:34.0	varchar	Hello World From Carbon 	3	3	9223372036854775804
1.5	true	12.35	
4	robot4	2019-03-01	2019-02-12 03:03:34.0	varchar	Hello World From Carbon 	4	4	9223372036854775803
2.0	true	12.35	
5	robot5	2019-03-01	2019-02-12 03:03:34.0	varchar	Hello World From Carbon 	5	5	9223372036854775802
2.5	true	12.35	
6	robot6	2019-03-01	2019-02-12 03:03:34.0	varchar	Hello World From Carbon 	6	6	9223372036854775801
3.0	true	12.35	
7	robot7	2019-03-01	2019-02-12 03:03:34.0	varchar	Hello World From Carbon 	7	7	9223372036854775800
3.5	true	12.35	
8	robot8	2019-03-01	2019-02-12 03:03:34.0	varchar	Hello World From Carbon 	8	8	9223372036854775799
4.0	true	12.35	
9	robot9	2019-03-01	2019-02-12 03:03:34.0	varchar	Hello World From Carbon 	9	9	9223372036854775798
4.5	true	12.35	
- CarbonReaderExample
2019-06-09 09:58:32 AUDIT audit:72 - {"time":"June 9, 2019 2:58:32 AM PDT","username":"jenkins","opName":"CREATE
TABLE","opId":"4851265317322159","opStatus":"START"}
2019-06-09 09:58:32 AUDIT audit:93 - {"time":"June 9, 2019 2:58:32 AM PDT","username":"jenkins","opName":"CREATE
TABLE","opId":"4851265317322159","opStatus":"SUCCESS","opTime":"79 ms","table":"default.hive_carbon_example","extraInfo":{"bad_record_path":"","local_dictionary_enable":"true","external":"false","sort_columns":"","comment":""}}
2019-06-09 09:58:32 AUDIT audit:72 - {"time":"June 9, 2019 2:58:32 AM PDT","username":"jenkins","opName":"LOAD
DATA","opId":"4851265423579754","opStatus":"START"}
2019-06-09 09:58:32 AUDIT audit:93 - {"time":"June 9, 2019 2:58:32 AM PDT","username":"jenkins","opName":"LOAD
DATA","opId":"4851265423579754","opStatus":"SUCCESS","opTime":"190 ms","table":"default.hive_carbon_example","extraInfo":{"SegmentId":"0","DataSize":"924.0B","IndexSize":"551.0B"}}
2019-06-09 09:58:32 AUDIT audit:72 - {"time":"June 9, 2019 2:58:32 AM PDT","username":"jenkins","opName":"LOAD
DATA","opId":"4851265626366041","opStatus":"START"}
2019-06-09 09:58:32 AUDIT audit:93 - {"time":"June 9, 2019 2:58:32 AM PDT","username":"jenkins","opName":"LOAD
DATA","opId":"4851265626366041","opStatus":"SUCCESS","opTime":"190 ms","table":"default.hive_carbon_example","extraInfo":{"SegmentId":"1","DataSize":"924.0B","IndexSize":"551.0B"}}
+---+---------+--------+
| id|     name|  salary|
+---+---------+--------+
|  1|  'liang'|200000.0|
|  2|'anubhav'| 20000.0|
|  1|  'liang'|200000.0|
|  2|'anubhav'| 20000.0|
+---+---------+--------+

OK
******Total Number Of Rows Fetched ****** 0
- HiveExample *** FAILED ***
  java.lang.AssertionError: assertion failed
  at scala.Predef$.assert(Predef.scala:156)
  at org.apache.carbondata.examples.HiveExample$.readFromHive(HiveExample.scala:153)
  at org.apache.carbondata.examplesCI.RunExamples$$anonfun$20.apply$mcV$sp(RunExamples.scala:131)
  at org.apache.carbondata.examplesCI.RunExamples$$anonfun$20.apply(RunExamples.scala:129)
  at org.apache.carbondata.examplesCI.RunExamples$$anonfun$20.apply(RunExamples.scala:129)
  at org.scalatest.Transformer$$anonfun$apply$1.apply$mcV$sp(Transformer.scala:22)
  at org.scalatest.OutcomeOf$class.outcomeOf(OutcomeOf.scala:85)
  at org.scalatest.OutcomeOf$.outcomeOf(OutcomeOf.scala:104)
  at org.scalatest.Transformer.apply(Transformer.scala:22)
  at org.scalatest.Transformer.apply(Transformer.scala:20)
  ...
Exception encountered when invoking run on a nested suite - Cannot call methods on a
stopped SparkContext.
This stopped SparkContext was created at:

org.apache.spark.sql.test.util.QueryTest.<init>(QueryTest.scala:115)
org.apache.carbondata.examplesCI.RunExamples.<init>(RunExamples.scala:35)
sun.reflect.NativeConstructorAccessorImpl.newInstance0(Native Method)
sun.reflect.NativeConstructorAccessorImpl.newInstance(NativeConstructorAccessorImpl.java:62)
sun.reflect.DelegatingConstructorAccessorImpl.newInstance(DelegatingConstructorAccessorImpl.java:45)
java.lang.reflect.Constructor.newInstance(Constructor.java:423)
java.lang.Class.newInstance(Class.java:442)
org.scalatest.tools.DiscoverySuite$.getSuiteInstance(DiscoverySuite.scala:69)
org.scalatest.tools.DiscoverySuite$$anonfun$1.apply(DiscoverySuite.scala:38)
org.scalatest.tools.DiscoverySuite$$anonfun$1.apply(DiscoverySuite.scala:37)
scala.collection.TraversableLike$$anonfun$map$1.apply(TraversableLike.scala:234)
scala.collection.TraversableLike$$anonfun$map$1.apply(TraversableLike.scala:234)
scala.collection.Iterator$class.foreach(Iterator.scala:893)
scala.collection.AbstractIterator.foreach(Iterator.scala:1336)
scala.collection.IterableLike$class.foreach(IterableLike.scala:72)
scala.collection.AbstractIterable.foreach(Iterable.scala:54)
scala.collection.TraversableLike$class.map(TraversableLike.scala:234)
scala.collection.AbstractTraversable.map(Traversable.scala:104)
org.scalatest.tools.DiscoverySuite.<init>(DiscoverySuite.scala:37)
org.scalatest.tools.Runner$.genDiscoSuites$1(Runner.scala:2390)

The currently active SparkContext was created at:

(No active SparkContext.)
          *** ABORTED ***
  java.lang.IllegalStateException: Cannot call methods on a stopped SparkContext.
This stopped SparkContext was created at:

org.apache.spark.sql.test.util.QueryTest.<init>(QueryTest.scala:115)
org.apache.carbondata.examplesCI.RunExamples.<init>(RunExamples.scala:35)
sun.reflect.NativeConstructorAccessorImpl.newInstance0(Native Method)
sun.reflect.NativeConstructorAccessorImpl.newInstance(NativeConstructorAccessorImpl.java:62)
sun.reflect.DelegatingConstructorAccessorImpl.newInstance(DelegatingConstructorAccessorImpl.java:45)
java.lang.reflect.Constructor.newInstance(Constructor.java:423)
java.lang.Class.newInstance(Class.java:442)
org.scalatest.tools.DiscoverySuite$.getSuiteInstance(DiscoverySuite.scala:69)
org.scalatest.tools.DiscoverySuite$$anonfun$1.apply(DiscoverySuite.scala:38)
org.scalatest.tools.DiscoverySuite$$anonfun$1.apply(DiscoverySuite.scala:37)
scala.collection.TraversableLike$$anonfun$map$1.apply(TraversableLike.scala:234)
scala.collection.TraversableLike$$anonfun$map$1.apply(TraversableLike.scala:234)
scala.collection.Iterator$class.foreach(Iterator.scala:893)
scala.collection.AbstractIterator.foreach(Iterator.scala:1336)
scala.collection.IterableLike$class.foreach(IterableLike.scala:72)
scala.collection.AbstractIterable.foreach(Iterable.scala:54)
scala.collection.TraversableLike$class.map(TraversableLike.scala:234)
scala.collection.AbstractTraversable.map(Traversable.scala:104)
org.scalatest.tools.DiscoverySuite.<init>(DiscoverySuite.scala:37)
org.scalatest.tools.Runner$.genDiscoSuites$1(Runner.scala:2390)

The currently active SparkContext was created at:

(No active SparkContext.)
  at org.apache.spark.SparkContext.assertNotStopped(SparkContext.scala:100)
  at org.apache.spark.SparkContext$$anonfun$parallelize$1.apply(SparkContext.scala:716)
  at org.apache.spark.SparkContext$$anonfun$parallelize$1.apply(SparkContext.scala:715)
  at org.apache.spark.rdd.RDDOperationScope$.withScope(RDDOperationScope.scala:151)
  at org.apache.spark.rdd.RDDOperationScope$.withScope(RDDOperationScope.scala:112)
  at org.apache.spark.SparkContext.withScope(SparkContext.scala:701)
  at org.apache.spark.SparkContext.parallelize(SparkContext.scala:715)
  at org.apache.spark.sql.execution.command.ExecutedCommandExec.doExecute(commands.scala:74)
  at org.apache.spark.sql.execution.SparkPlan$$anonfun$execute$1.apply(SparkPlan.scala:114)
  at org.apache.spark.sql.execution.SparkPlan$$anonfun$execute$1.apply(SparkPlan.scala:114)
  ...
Run completed in 3 minutes, 5 seconds.
Total number of tests run: 20
Suites: completed 1, aborted 1
Tests: succeeded 19, failed 1, canceled 0, ignored 0, pending 0
*** 1 SUITE ABORTED ***
*** 1 TEST FAILED ***
[JENKINS] Recording test results

Mime
View raw message