carbondata-commits mailing list archives

Site index · List index
Message view « Date » · « Thread »
Top « Date » · « Thread »
From Apache Jenkins Server <jenk...@builds.apache.org>
Subject Build failed in Jenkins: carbondata-master-spark-2.1 » Apache CarbonData :: Examples #3567
Date Tue, 04 Jun 2019 10:06:04 GMT
See <https://builds.apache.org/job/carbondata-master-spark-2.1/org.apache.carbondata$carbondata-examples/3567/display/redirect>

------------------------------------------
[...truncated 282.93 KB...]
|29.054945054945055|2005-01-01 00:00:...|
| 29.08502024291498|2014-01-01 00:00:...|
|31.819277108433734|2016-01-01 00:00:...|
|28.717842323651453|2015-01-01 00:00:...|
|            28.888|2011-01-01 00:00:...|
|28.711111111111112|2009-01-01 00:00:...|
|29.103448275862068|2002-01-01 00:00:...|
|29.130252100840337|2004-01-01 00:00:...|
| 29.96825396825397|2000-01-01 00:00:...|
| 29.67680608365019|2008-01-01 00:00:...|
| 31.52742616033755|2012-01-01 00:00:...|
|27.873015873015873|2007-01-01 00:00:...|
| 30.46153846153846|2013-01-01 00:00:...|
+------------------+--------------------+
only showing top 20 rows

2019-06-04 10:04:41 AUDIT audit:72 - {"time":"June 4, 2019 3:04:41 AM PDT","username":"jenkins","opName":"DROP
TABLE","opId":"16390392978818226","opStatus":"START"}
2019-06-04 10:04:41 AUDIT audit:93 - {"time":"June 4, 2019 3:04:41 AM PDT","username":"jenkins","opName":"DROP
TABLE","opId":"16390392978818226","opStatus":"SUCCESS","opTime":"260 ms","table":"default.timeseriestable","extraInfo":{}}
- TimeSeriesPreAggregateTableExample
2019-06-04 10:04:41 AUDIT audit:72 - {"time":"June 4, 2019 3:04:41 AM PDT","username":"jenkins","opName":"CREATE
TABLE","opId":"16390393290214353","opStatus":"START"}
2019-06-04 10:04:41 AUDIT audit:93 - {"time":"June 4, 2019 3:04:41 AM PDT","username":"jenkins","opName":"CREATE
TABLE","opId":"16390393290214353","opStatus":"SUCCESS","opTime":"81 ms","table":"default.persontable","extraInfo":{"bad_record_path":"","streaming":"false","local_dictionary_enable":"true","external":"false","sort_columns":"","comment":""}}
2019-06-04 10:04:41 AUDIT audit:72 - {"time":"June 4, 2019 3:04:41 AM PDT","username":"jenkins","opName":"LOAD
DATA OVERWRITE","opId":"16390393374425774","opStatus":"START"}
2019-06-04 10:04:42 AUDIT audit:93 - {"time":"June 4, 2019 3:04:42 AM PDT","username":"jenkins","opName":"LOAD
DATA OVERWRITE","opId":"16390393374425774","opStatus":"SUCCESS","opTime":"671 ms","table":"default.personTable","extraInfo":{"SegmentId":"0","DataSize":"771.43KB","IndexSize":"720.0B"}}
2019-06-04 10:04:42 AUDIT audit:72 - {"time":"June 4, 2019 3:04:42 AM PDT","username":"jenkins","opName":"CREATE
DATAMAP","opId":"16390394050963025","opStatus":"START"}
2019-06-04 10:04:45 AUDIT audit:93 - {"time":"June 4, 2019 3:04:45 AM PDT","username":"jenkins","opName":"CREATE
DATAMAP","opId":"16390394050963025","opStatus":"SUCCESS","opTime":"2700 ms","table":"default.persontable","extraInfo":{"provider":"lucene","dmName":"dm","index_columns":"id
, name"}}
+--------+
|count(1)|
+--------+
|       8|
+--------+

+--------+
|count(1)|
+--------+
|       8|
+--------+

time for query on table with lucene datamap table:0.306
time for query on table without lucene datamap table:0.272
+-----------------+-------------+
|               id|         name|
+-----------------+-------------+
|which test1 good4|who and name6|
|which test1 good5|who and name7|
|which test1 good8|who and name3|
|which test1 good0|who and name0|
|which test1 good4|who and name6|
|which test1 good5|who and name7|
|which test1 good8|who and name3|
|which test1 good0|who and name0|
+-----------------+-------------+

+-----------------+-------------+
|               id|         name|
+-----------------+-------------+
|which test1 good4|who and name6|
|which test1 good5|who and name7|
|which test1 good8|who and name3|
|which test1 good0|who and name0|
|which test1 good4|who and name6|
|which test1 good5|who and name7|
|which test1 good8|who and name3|
|which test1 good0|who and name0|
+-----------------+-------------+

2019-06-04 10:04:46 AUDIT audit:72 - {"time":"June 4, 2019 3:04:46 AM PDT","username":"jenkins","opName":"DROP
TABLE","opId":"16390397698350223","opStatus":"START"}
2019-06-04 10:04:46 AUDIT audit:93 - {"time":"June 4, 2019 3:04:46 AM PDT","username":"jenkins","opName":"DROP
TABLE","opId":"16390397698350223","opStatus":"SUCCESS","opTime":"123 ms","table":"default.persontable","extraInfo":{}}
- LuceneDataMapExample
2019-06-04 10:04:46 AUDIT audit:72 - {"time":"June 4, 2019 3:04:46 AM PDT","username":"jenkins","opName":"CREATE
TABLE","opId":"16390397842791261","opStatus":"START"}
2019-06-04 10:04:46 AUDIT audit:93 - {"time":"June 4, 2019 3:04:46 AM PDT","username":"jenkins","opName":"CREATE
TABLE","opId":"16390397842791261","opStatus":"SUCCESS","opTime":"78 ms","table":"default.origin_table","extraInfo":{"bad_record_path":"","local_dictionary_enable":"true","external":"false","sort_columns":"","comment":""}}
2019-06-04 10:04:46 AUDIT audit:72 - {"time":"June 4, 2019 3:04:46 AM PDT","username":"jenkins","opName":"LOAD
DATA","opId":"16390397927951389","opStatus":"START"}
2019-06-04 10:04:46 ERROR DataLoadExecutor:55 - Data Load is partially success for table origin_table
2019-06-04 10:04:46 AUDIT audit:93 - {"time":"June 4, 2019 3:04:46 AM PDT","username":"jenkins","opName":"LOAD
DATA","opId":"16390397927951389","opStatus":"SUCCESS","opTime":"234 ms","table":"default.origin_table","extraInfo":{"SegmentId":"0","DataSize":"2.85KB","IndexSize":"1.43KB"}}
2019-06-04 10:04:46 AUDIT audit:72 - {"time":"June 4, 2019 3:04:46 AM PDT","username":"jenkins","opName":"LOAD
DATA","opId":"16390398168281825","opStatus":"START"}
2019-06-04 10:04:46 ERROR DataLoadExecutor:55 - Data Load is partially success for table origin_table
2019-06-04 10:04:46 AUDIT audit:93 - {"time":"June 4, 2019 3:04:46 AM PDT","username":"jenkins","opName":"LOAD
DATA","opId":"16390398168281825","opStatus":"SUCCESS","opTime":"201 ms","table":"default.origin_table","extraInfo":{"SegmentId":"1","DataSize":"2.85KB","IndexSize":"1.43KB"}}
2019-06-04 10:04:46 AUDIT audit:72 - {"time":"June 4, 2019 3:04:46 AM PDT","username":"jenkins","opName":"LOAD
DATA","opId":"16390398375870313","opStatus":"START"}
2019-06-04 10:04:47 ERROR DataLoadExecutor:55 - Data Load is partially success for table origin_table
2019-06-04 10:04:47 AUDIT audit:93 - {"time":"June 4, 2019 3:04:47 AM PDT","username":"jenkins","opName":"LOAD
DATA","opId":"16390398375870313","opStatus":"SUCCESS","opTime":"204 ms","table":"default.origin_table","extraInfo":{"SegmentId":"2","DataSize":"2.85KB","IndexSize":"1.43KB"}}
2019-06-04 10:04:47 AUDIT audit:72 - {"time":"June 4, 2019 3:04:47 AM PDT","username":"jenkins","opName":"LOAD
DATA","opId":"16390398585747451","opStatus":"START"}
2019-06-04 10:04:47 ERROR DataLoadExecutor:55 - Data Load is partially success for table origin_table
2019-06-04 10:04:47 AUDIT audit:93 - {"time":"June 4, 2019 3:04:47 AM PDT","username":"jenkins","opName":"LOAD
DATA","opId":"16390398585747451","opStatus":"SUCCESS","opTime":"205 ms","table":"default.origin_table","extraInfo":{"SegmentId":"3","DataSize":"2.85KB","IndexSize":"1.43KB"}}
+--------+
|count(1)|
+--------+
|      40|
+--------+

2019-06-04 10:04:47 AUDIT audit:72 - {"time":"June 4, 2019 3:04:47 AM PDT","username":"jenkins","opName":"CREATE
TABLE","opId":"16390398866207921","opStatus":"START"}
2019-06-04 10:04:47 AUDIT audit:93 - {"time":"June 4, 2019 3:04:47 AM PDT","username":"jenkins","opName":"CREATE
TABLE","opId":"16390398866207921","opStatus":"SUCCESS","opTime":"63 ms","table":"default.external_table","extraInfo":{"bad_record_path":"","_filelevelformat":"false","local_dictionary_enable":"true","external":"true","_external":"true","sort_columns":"","comment":""}}
+--------+
|count(1)|
+--------+
|      40|
+--------+

2019-06-04 10:04:47 AUDIT audit:72 - {"time":"June 4, 2019 3:04:47 AM PDT","username":"jenkins","opName":"LOAD
DATA","opId":"16390399027677188","opStatus":"START"}
2019-06-04 10:04:47 ERROR DataLoadExecutor:55 - Data Load is partially success for table origin_table
2019-06-04 10:04:47 AUDIT audit:93 - {"time":"June 4, 2019 3:04:47 AM PDT","username":"jenkins","opName":"LOAD
DATA","opId":"16390399027677188","opStatus":"SUCCESS","opTime":"222 ms","table":"default.origin_table","extraInfo":{"SegmentId":"4","DataSize":"2.85KB","IndexSize":"1.43KB"}}
2019-06-04 10:04:47 AUDIT audit:72 - {"time":"June 4, 2019 3:04:47 AM PDT","username":"jenkins","opName":"LOAD
DATA","opId":"16390399255102590","opStatus":"START"}
2019-06-04 10:04:47 ERROR DataLoadExecutor:55 - Data Load is partially success for table origin_table
2019-06-04 10:04:48 AUDIT audit:93 - {"time":"June 4, 2019 3:04:48 AM PDT","username":"jenkins","opName":"LOAD
DATA","opId":"16390399255102590","opStatus":"SUCCESS","opTime":"202 ms","table":"default.origin_table","extraInfo":{"SegmentId":"5","DataSize":"2.85KB","IndexSize":"1.43KB"}}
+--------+
|count(1)|
+--------+
|      60|
+--------+

2019-06-04 10:04:48 AUDIT audit:72 - {"time":"June 4, 2019 3:04:48 AM PDT","username":"jenkins","opName":"DROP
TABLE","opId":"16390399525008820","opStatus":"START"}
2019-06-04 10:04:48 AUDIT audit:93 - {"time":"June 4, 2019 3:04:48 AM PDT","username":"jenkins","opName":"DROP
TABLE","opId":"16390399525008820","opStatus":"SUCCESS","opTime":"93 ms","table":"default.origin_table","extraInfo":{}}
- ExternalTableExample

Data:
0	robot0	0	0	9223372036854775807	0.0	true	2019-03-01	2019-02-12 03:03:34.0	12.35	varchar	
Hello World From Carbon 
1	robot1	1	1	9223372036854775806	0.5	true	2019-03-01	2019-02-12 03:03:34.0	12.35	varchar	
Hello World From Carbon 
2	robot2	2	2	9223372036854775805	1.0	true	2019-03-01	2019-02-12 03:03:34.0	12.35	varchar	
Hello World From Carbon 
3	robot3	3	3	9223372036854775804	1.5	true	2019-03-01	2019-02-12 03:03:34.0	12.35	varchar	
Hello World From Carbon 
4	robot4	4	4	9223372036854775803	2.0	true	2019-03-01	2019-02-12 03:03:34.0	12.35	varchar	
Hello World From Carbon 
5	robot5	5	5	9223372036854775802	2.5	true	2019-03-01	2019-02-12 03:03:34.0	12.35	varchar	
Hello World From Carbon 
6	robot6	6	6	9223372036854775801	3.0	true	2019-03-01	2019-02-12 03:03:34.0	12.35	varchar	
Hello World From Carbon 
7	robot7	7	7	9223372036854775800	3.5	true	2019-03-01	2019-02-12 03:03:34.0	12.35	varchar	
Hello World From Carbon 
8	robot8	8	8	9223372036854775799	4.0	true	2019-03-01	2019-02-12 03:03:34.0	12.35	varchar	
Hello World From Carbon 
9	robot9	9	9	9223372036854775798	4.5	true	2019-03-01	2019-02-12 03:03:34.0	12.35	varchar	
Hello World From Carbon 

Data:
0	robot0	2019-03-01	2019-02-12 03:03:34.0	varchar	Hello World From Carbon 	0	0	9223372036854775807
0.0	true	12.35	
1	robot1	2019-03-01	2019-02-12 03:03:34.0	varchar	Hello World From Carbon 	1	1	9223372036854775806
0.5	true	12.35	
2	robot2	2019-03-01	2019-02-12 03:03:34.0	varchar	Hello World From Carbon 	2	2	9223372036854775805
1.0	true	12.35	
3	robot3	2019-03-01	2019-02-12 03:03:34.0	varchar	Hello World From Carbon 	3	3	9223372036854775804
1.5	true	12.35	
4	robot4	2019-03-01	2019-02-12 03:03:34.0	varchar	Hello World From Carbon 	4	4	9223372036854775803
2.0	true	12.35	
5	robot5	2019-03-01	2019-02-12 03:03:34.0	varchar	Hello World From Carbon 	5	5	9223372036854775802
2.5	true	12.35	
6	robot6	2019-03-01	2019-02-12 03:03:34.0	varchar	Hello World From Carbon 	6	6	9223372036854775801
3.0	true	12.35	
7	robot7	2019-03-01	2019-02-12 03:03:34.0	varchar	Hello World From Carbon 	7	7	9223372036854775800
3.5	true	12.35	
8	robot8	2019-03-01	2019-02-12 03:03:34.0	varchar	Hello World From Carbon 	8	8	9223372036854775799
4.0	true	12.35	
9	robot9	2019-03-01	2019-02-12 03:03:34.0	varchar	Hello World From Carbon 	9	9	9223372036854775798
4.5	true	12.35	
- CarbonReaderExample
2019-06-04 10:04:48 AUDIT audit:72 - {"time":"June 4, 2019 3:04:48 AM PDT","username":"jenkins","opName":"CREATE
TABLE","opId":"16390399927169105","opStatus":"START"}
2019-06-04 10:04:48 AUDIT audit:93 - {"time":"June 4, 2019 3:04:48 AM PDT","username":"jenkins","opName":"CREATE
TABLE","opId":"16390399927169105","opStatus":"SUCCESS","opTime":"77 ms","table":"default.hive_carbon_example","extraInfo":{"bad_record_path":"","local_dictionary_enable":"true","external":"false","sort_columns":"","comment":""}}
2019-06-04 10:04:48 AUDIT audit:72 - {"time":"June 4, 2019 3:04:48 AM PDT","username":"jenkins","opName":"LOAD
DATA","opId":"16390400021362062","opStatus":"START"}
2019-06-04 10:04:48 AUDIT audit:93 - {"time":"June 4, 2019 3:04:48 AM PDT","username":"jenkins","opName":"LOAD
DATA","opId":"16390400021362062","opStatus":"SUCCESS","opTime":"198 ms","table":"default.hive_carbon_example","extraInfo":{"SegmentId":"0","DataSize":"924.0B","IndexSize":"551.0B"}}
2019-06-04 10:04:48 AUDIT audit:72 - {"time":"June 4, 2019 3:04:48 AM PDT","username":"jenkins","opName":"LOAD
DATA","opId":"16390400229870094","opStatus":"START"}
2019-06-04 10:04:48 AUDIT audit:93 - {"time":"June 4, 2019 3:04:48 AM PDT","username":"jenkins","opName":"LOAD
DATA","opId":"16390400229870094","opStatus":"SUCCESS","opTime":"209 ms","table":"default.hive_carbon_example","extraInfo":{"SegmentId":"1","DataSize":"924.0B","IndexSize":"551.0B"}}
+---+---------+--------+
| id|     name|  salary|
+---+---------+--------+
|  1|  'liang'|200000.0|
|  2|'anubhav'| 20000.0|
|  1|  'liang'|200000.0|
|  2|'anubhav'| 20000.0|
+---+---------+--------+

OK
******Total Number Of Rows Fetched ****** 0
- HiveExample *** FAILED ***
  java.lang.AssertionError: assertion failed
  at scala.Predef$.assert(Predef.scala:156)
  at org.apache.carbondata.examples.HiveExample$.readFromHive(HiveExample.scala:153)
  at org.apache.carbondata.examplesCI.RunExamples$$anonfun$20.apply$mcV$sp(RunExamples.scala:131)
  at org.apache.carbondata.examplesCI.RunExamples$$anonfun$20.apply(RunExamples.scala:129)
  at org.apache.carbondata.examplesCI.RunExamples$$anonfun$20.apply(RunExamples.scala:129)
  at org.scalatest.Transformer$$anonfun$apply$1.apply$mcV$sp(Transformer.scala:22)
  at org.scalatest.OutcomeOf$class.outcomeOf(OutcomeOf.scala:85)
  at org.scalatest.OutcomeOf$.outcomeOf(OutcomeOf.scala:104)
  at org.scalatest.Transformer.apply(Transformer.scala:22)
  at org.scalatest.Transformer.apply(Transformer.scala:20)
  ...
Exception encountered when invoking run on a nested suite - Cannot call methods on a
stopped SparkContext.
This stopped SparkContext was created at:

org.apache.spark.sql.test.util.QueryTest.<init>(QueryTest.scala:115)
org.apache.carbondata.examplesCI.RunExamples.<init>(RunExamples.scala:35)
sun.reflect.NativeConstructorAccessorImpl.newInstance0(Native Method)
sun.reflect.NativeConstructorAccessorImpl.newInstance(NativeConstructorAccessorImpl.java:62)
sun.reflect.DelegatingConstructorAccessorImpl.newInstance(DelegatingConstructorAccessorImpl.java:45)
java.lang.reflect.Constructor.newInstance(Constructor.java:423)
java.lang.Class.newInstance(Class.java:442)
org.scalatest.tools.DiscoverySuite$.getSuiteInstance(DiscoverySuite.scala:69)
org.scalatest.tools.DiscoverySuite$$anonfun$1.apply(DiscoverySuite.scala:38)
org.scalatest.tools.DiscoverySuite$$anonfun$1.apply(DiscoverySuite.scala:37)
scala.collection.TraversableLike$$anonfun$map$1.apply(TraversableLike.scala:234)
scala.collection.TraversableLike$$anonfun$map$1.apply(TraversableLike.scala:234)
scala.collection.Iterator$class.foreach(Iterator.scala:893)
scala.collection.AbstractIterator.foreach(Iterator.scala:1336)
scala.collection.IterableLike$class.foreach(IterableLike.scala:72)
scala.collection.AbstractIterable.foreach(Iterable.scala:54)
scala.collection.TraversableLike$class.map(TraversableLike.scala:234)
scala.collection.AbstractTraversable.map(Traversable.scala:104)
org.scalatest.tools.DiscoverySuite.<init>(DiscoverySuite.scala:37)
org.scalatest.tools.Runner$.genDiscoSuites$1(Runner.scala:2390)

The currently active SparkContext was created at:

(No active SparkContext.)
          *** ABORTED ***
  java.lang.IllegalStateException: Cannot call methods on a stopped SparkContext.
This stopped SparkContext was created at:

org.apache.spark.sql.test.util.QueryTest.<init>(QueryTest.scala:115)
org.apache.carbondata.examplesCI.RunExamples.<init>(RunExamples.scala:35)
sun.reflect.NativeConstructorAccessorImpl.newInstance0(Native Method)
sun.reflect.NativeConstructorAccessorImpl.newInstance(NativeConstructorAccessorImpl.java:62)
sun.reflect.DelegatingConstructorAccessorImpl.newInstance(DelegatingConstructorAccessorImpl.java:45)
java.lang.reflect.Constructor.newInstance(Constructor.java:423)
java.lang.Class.newInstance(Class.java:442)
org.scalatest.tools.DiscoverySuite$.getSuiteInstance(DiscoverySuite.scala:69)
org.scalatest.tools.DiscoverySuite$$anonfun$1.apply(DiscoverySuite.scala:38)
org.scalatest.tools.DiscoverySuite$$anonfun$1.apply(DiscoverySuite.scala:37)
scala.collection.TraversableLike$$anonfun$map$1.apply(TraversableLike.scala:234)
scala.collection.TraversableLike$$anonfun$map$1.apply(TraversableLike.scala:234)
scala.collection.Iterator$class.foreach(Iterator.scala:893)
scala.collection.AbstractIterator.foreach(Iterator.scala:1336)
scala.collection.IterableLike$class.foreach(IterableLike.scala:72)
scala.collection.AbstractIterable.foreach(Iterable.scala:54)
scala.collection.TraversableLike$class.map(TraversableLike.scala:234)
scala.collection.AbstractTraversable.map(Traversable.scala:104)
org.scalatest.tools.DiscoverySuite.<init>(DiscoverySuite.scala:37)
org.scalatest.tools.Runner$.genDiscoSuites$1(Runner.scala:2390)

The currently active SparkContext was created at:

(No active SparkContext.)
  at org.apache.spark.SparkContext.assertNotStopped(SparkContext.scala:100)
  at org.apache.spark.SparkContext$$anonfun$parallelize$1.apply(SparkContext.scala:716)
  at org.apache.spark.SparkContext$$anonfun$parallelize$1.apply(SparkContext.scala:715)
  at org.apache.spark.rdd.RDDOperationScope$.withScope(RDDOperationScope.scala:151)
  at org.apache.spark.rdd.RDDOperationScope$.withScope(RDDOperationScope.scala:112)
  at org.apache.spark.SparkContext.withScope(SparkContext.scala:701)
  at org.apache.spark.SparkContext.parallelize(SparkContext.scala:715)
  at org.apache.spark.sql.execution.command.ExecutedCommandExec.doExecute(commands.scala:74)
  at org.apache.spark.sql.execution.SparkPlan$$anonfun$execute$1.apply(SparkPlan.scala:114)
  at org.apache.spark.sql.execution.SparkPlan$$anonfun$execute$1.apply(SparkPlan.scala:114)
  ...
Run completed in 2 minutes, 50 seconds.
Total number of tests run: 20
Suites: completed 1, aborted 1
Tests: succeeded 19, failed 1, canceled 0, ignored 0, pending 0
*** 1 SUITE ABORTED ***
*** 1 TEST FAILED ***
[JENKINS] Recording test results

Mime
View raw message