carbondata-commits mailing list archives

Site index · List index
Message view « Date » · « Thread »
Top « Date » · « Thread »
From Apache Jenkins Server <jenk...@builds.apache.org>
Subject Build failed in Jenkins: carbondata-master-spark-2.1 #3743
Date Wed, 18 Sep 2019 09:54:53 GMT
See <https://builds.apache.org/job/carbondata-master-spark-2.1/3743/display/redirect>

------------------------------------------
[...truncated 12.29 MB...]
	at org.apache.spark.scheduler.ShuffleMapTask.runTask(ShuffleMapTask.scala:53)
	at org.apache.spark.scheduler.Task.run(Task.scala:99)
	at org.apache.spark.executor.Executor$TaskRunner.run(Executor.scala:282)
	at java.util.concurrent.ThreadPoolExecutor.runWorker(ThreadPoolExecutor.java:1149)
	at java.util.concurrent.ThreadPoolExecutor$Worker.run(ThreadPoolExecutor.java:624)
	at java.lang.Thread.run(Thread.java:748)

Driver stacktrace:
2019-09-18 09:53:51 ERROR CarbonLoadDataCommand:390 - java.lang.Exception: DataLoad failure:
/tmp/blockmgr-48537cf5-914e-41ff-b459-4b2381cdacf8/39/temp_shuffle_535b0a6c-21a5-42e3-9b28-30ab7c4f3073
(No such file or directory)
2019-09-18 09:53:51 ERROR CarbonLoadDataCommand:166 - Got exception java.lang.Exception: DataLoad
failure: /tmp/blockmgr-48537cf5-914e-41ff-b459-4b2381cdacf8/39/temp_shuffle_535b0a6c-21a5-42e3-9b28-30ab7c4f3073
(No such file or directory) when processing data. But this command does not support undo yet,
skipping the undo part.
2019-09-18 09:53:51 AUDIT audit:93 - {"time":"September 18, 2019 2:53:51 AM PDT","username":"jenkins","opName":"LOAD
DATA","opId":"25436665611734266","opStatus":"FAILED","opTime":"224 ms","table":"default.dm1_table","extraInfo":{"Exception":"java.lang.Exception","Message":"DataLoad
failure: /tmp/blockmgr-48537cf5-914e-41ff-b459-4b2381cdacf8/39/temp_shuffle_535b0a6c-21a5-42e3-9b28-30ab7c4f3073
(No such file or directory)"}}
2019-09-18 09:53:51 ERROR MVDataMapProvider:166 - Data Load failed for DataMap: 
java.lang.Exception: DataLoad failure: /tmp/blockmgr-48537cf5-914e-41ff-b459-4b2381cdacf8/39/temp_shuffle_535b0a6c-21a5-42e3-9b28-30ab7c4f3073
(No such file or directory)
	at org.apache.carbondata.spark.rdd.CarbonDataRDDFactory$.loadCarbonData(CarbonDataRDDFactory.scala:501)
	at org.apache.spark.sql.execution.command.management.CarbonLoadDataCommand.loadData(CarbonLoadDataCommand.scala:627)
	at org.apache.spark.sql.execution.command.management.CarbonLoadDataCommand.processData(CarbonLoadDataCommand.scala:356)
	at org.apache.spark.sql.execution.command.AtomicRunnableCommand$$anonfun$run$3.apply(package.scala:148)
	at org.apache.spark.sql.execution.command.AtomicRunnableCommand$$anonfun$run$3.apply(package.scala:145)
	at org.apache.spark.sql.execution.command.Auditable$class.runWithAudit(package.scala:104)
	at org.apache.spark.sql.execution.command.AtomicRunnableCommand.runWithAudit(package.scala:141)
	at org.apache.spark.sql.execution.command.AtomicRunnableCommand.run(package.scala:145)
	at org.apache.spark.sql.execution.command.ExecutedCommandExec.sideEffectResult$lzycompute(commands.scala:58)
	at org.apache.spark.sql.execution.command.ExecutedCommandExec.sideEffectResult(commands.scala:56)
	at org.apache.spark.sql.execution.command.ExecutedCommandExec.doExecute(commands.scala:74)
	at org.apache.spark.sql.execution.SparkPlan$$anonfun$execute$1.apply(SparkPlan.scala:114)
	at org.apache.spark.sql.execution.SparkPlan$$anonfun$execute$1.apply(SparkPlan.scala:114)
	at org.apache.spark.sql.execution.SparkPlan$$anonfun$executeQuery$1.apply(SparkPlan.scala:135)
	at org.apache.spark.rdd.RDDOperationScope$.withScope(RDDOperationScope.scala:151)
	at org.apache.spark.sql.execution.SparkPlan.executeQuery(SparkPlan.scala:132)
	at org.apache.spark.sql.execution.SparkPlan.execute(SparkPlan.scala:113)
	at org.apache.spark.sql.execution.QueryExecution.toRdd$lzycompute(QueryExecution.scala:87)
	at org.apache.spark.sql.execution.QueryExecution.toRdd(QueryExecution.scala:87)
	at org.apache.spark.sql.Dataset.<init>(Dataset.scala:185)
	at org.apache.spark.sql.Dataset$.ofRows(Dataset.scala:64)
	at org.apache.spark.sql.util.SparkSQLUtil$.execute(SparkSQLUtil.scala:38)
	at org.apache.carbondata.mv.datamap.MVDataMapProvider.rebuildInternal(MVDataMapProvider.scala:160)
	at org.apache.carbondata.core.datamap.DataMapProvider.rebuild(DataMapProvider.java:240)
	at org.apache.spark.sql.execution.command.datamap.CarbonDataMapRebuildCommand.processData(CarbonDataMapRebuildCommand.scala:74)
	at org.apache.spark.sql.execution.command.DataCommand$$anonfun$run$2.apply(package.scala:132)
	at org.apache.spark.sql.execution.command.DataCommand$$anonfun$run$2.apply(package.scala:132)
	at org.apache.spark.sql.execution.command.Auditable$class.runWithAudit(package.scala:104)
	at org.apache.spark.sql.execution.command.DataCommand.runWithAudit(package.scala:130)
	at org.apache.spark.sql.execution.command.DataCommand.run(package.scala:132)
	at org.apache.spark.sql.execution.command.ExecutedCommandExec.sideEffectResult$lzycompute(commands.scala:58)
	at org.apache.spark.sql.execution.command.ExecutedCommandExec.sideEffectResult(commands.scala:56)
	at org.apache.spark.sql.execution.command.ExecutedCommandExec.doExecute(commands.scala:74)
	at org.apache.spark.sql.execution.SparkPlan$$anonfun$execute$1.apply(SparkPlan.scala:114)
	at org.apache.spark.sql.execution.SparkPlan$$anonfun$execute$1.apply(SparkPlan.scala:114)
	at org.apache.spark.sql.execution.SparkPlan$$anonfun$executeQuery$1.apply(SparkPlan.scala:135)
	at org.apache.spark.rdd.RDDOperationScope$.withScope(RDDOperationScope.scala:151)
	at org.apache.spark.sql.execution.SparkPlan.executeQuery(SparkPlan.scala:132)
	at org.apache.spark.sql.execution.SparkPlan.execute(SparkPlan.scala:113)
	at org.apache.spark.sql.execution.QueryExecution.toRdd$lzycompute(QueryExecution.scala:87)
	at org.apache.spark.sql.execution.QueryExecution.toRdd(QueryExecution.scala:87)
	at org.apache.spark.sql.Dataset.<init>(Dataset.scala:185)
	at org.apache.spark.sql.CarbonSession$$anonfun$sql$1.apply(CarbonSession.scala:91)
	at org.apache.spark.sql.CarbonSession$$anonfun$sql$1.apply(CarbonSession.scala:90)
	at org.apache.spark.sql.CarbonSession.withProfiler(CarbonSession.scala:136)
	at org.apache.spark.sql.CarbonSession.sql(CarbonSession.scala:88)
	at org.apache.spark.sql.test.Spark2TestQueryExecutor.sql(Spark2TestQueryExecutor.scala:35)
	at org.apache.spark.sql.test.util.QueryTest.sql(QueryTest.scala:113)
	at org.apache.carbondata.mv.rewrite.TestAllOperationsOnMV.beforeEach(TestAllOperationsOnMV.scala:49)
	at org.scalatest.BeforeAndAfterEach$class.beforeEach(BeforeAndAfterEach.scala:154)
	at org.apache.carbondata.mv.rewrite.TestAllOperationsOnMV.beforeEach(TestAllOperationsOnMV.scala:37)
	at org.scalatest.BeforeAndAfterEach$class.beforeEach(BeforeAndAfterEach.scala:173)
	at org.apache.carbondata.mv.rewrite.TestAllOperationsOnMV.beforeEach(TestAllOperationsOnMV.scala:37)
	at org.scalatest.BeforeAndAfterEach$class.runTest(BeforeAndAfterEach.scala:253)
	at org.apache.carbondata.mv.rewrite.TestAllOperationsOnMV.runTest(TestAllOperationsOnMV.scala:37)
	at org.scalatest.FunSuiteLike$$anonfun$runTests$1.apply(FunSuiteLike.scala:208)
	at org.scalatest.FunSuiteLike$$anonfun$runTests$1.apply(FunSuiteLike.scala:208)
	at org.scalatest.SuperEngine$$anonfun$traverseSubNodes$1$1.apply(Engine.scala:413)
	at org.scalatest.SuperEngine$$anonfun$traverseSubNodes$1$1.apply(Engine.scala:401)
	at scala.collection.immutable.List.foreach(List.scala:381)
	at org.scalatest.SuperEngine.traverseSubNodes$1(Engine.scala:401)
	at org.scalatest.SuperEngine.org$scalatest$SuperEngine$$runTestsInBranch(Engine.scala:396)
	at org.scalatest.SuperEngine.runTestsImpl(Engine.scala:483)
	at org.scalatest.FunSuiteLike$class.runTests(FunSuiteLike.scala:208)
	at org.scalatest.FunSuite.runTests(FunSuite.scala:1555)
	at org.scalatest.Suite$class.run(Suite.scala:1424)
	at org.scalatest.FunSuite.org$scalatest$FunSuiteLike$$super$run(FunSuite.scala:1555)
	at org.scalatest.FunSuiteLike$$anonfun$run$1.apply(FunSuiteLike.scala:212)
	at org.scalatest.FunSuiteLike$$anonfun$run$1.apply(FunSuiteLike.scala:212)
	at org.scalatest.SuperEngine.runImpl(Engine.scala:545)
	at org.scalatest.FunSuiteLike$class.run(FunSuiteLike.scala:212)
	at org.scalatest.FunSuite.run(FunSuite.scala:1555)
	at org.scalatest.Suite$class.callExecuteOnSuite$1(Suite.scala:1492)
	at org.scalatest.Suite$$anonfun$runNestedSuites$1.apply(Suite.scala:1528)
	at org.scalatest.Suite$$anonfun$runNestedSuites$1.apply(Suite.scala:1526)
	at scala.collection.IndexedSeqOptimized$class.foreach(IndexedSeqOptimized.scala:33)
	at scala.collection.mutable.ArrayOps$ofRef.foreach(ArrayOps.scala:186)
	at org.scalatest.Suite$class.runNestedSuites(Suite.scala:1526)
	at org.scalatest.tools.DiscoverySuite.runNestedSuites(DiscoverySuite.scala:29)
	at org.scalatest.Suite$class.run(Suite.scala:1421)
	at org.scalatest.tools.DiscoverySuite.run(DiscoverySuite.scala:29)
	at org.scalatest.tools.SuiteRunner.run(SuiteRunner.scala:55)
	at org.scalatest.tools.Runner$$anonfun$doRunRunRunDaDoRunRun$3.apply(Runner.scala:2563)
	at org.scalatest.tools.Runner$$anonfun$doRunRunRunDaDoRunRun$3.apply(Runner.scala:2557)
	at scala.collection.immutable.List.foreach(List.scala:381)
	at org.scalatest.tools.Runner$.doRunRunRunDaDoRunRun(Runner.scala:2557)
	at org.scalatest.tools.Runner$$anonfun$runOptionallyWithPassFailReporter$2.apply(Runner.scala:1044)
	at org.scalatest.tools.Runner$$anonfun$runOptionallyWithPassFailReporter$2.apply(Runner.scala:1043)
	at org.scalatest.tools.Runner$.withClassLoaderAndDispatchReporter(Runner.scala:2722)
	at org.scalatest.tools.Runner$.runOptionallyWithPassFailReporter(Runner.scala:1043)
	at org.scalatest.tools.Runner$.main(Runner.scala:860)
	at org.scalatest.tools.Runner.main(Runner.scala)
2019-09-18 09:53:51 AUDIT audit:93 - {"time":"September 18, 2019 2:53:51 AM PDT","username":"jenkins","opName":"REBUILD
DATAMAP","opId":"25436665582370936","opStatus":"FAILED","opTime":"259 ms","table":"default.dm1_table","extraInfo":{"Exception":"java.lang.Exception","Message":"DataLoad
failure: /tmp/blockmgr-48537cf5-914e-41ff-b459-4b2381cdacf8/39/temp_shuffle_535b0a6c-21a5-42e3-9b28-30ab7c4f3073
(No such file or directory)"}}
*** RUN ABORTED ***
  java.lang.Exception: DataLoad failure: /tmp/blockmgr-48537cf5-914e-41ff-b459-4b2381cdacf8/39/temp_shuffle_535b0a6c-21a5-42e3-9b28-30ab7c4f3073
(No such file or directory)
  at org.apache.carbondata.spark.rdd.CarbonDataRDDFactory$.loadCarbonData(CarbonDataRDDFactory.scala:501)
  at org.apache.spark.sql.execution.command.management.CarbonLoadDataCommand.loadData(CarbonLoadDataCommand.scala:627)
  at org.apache.spark.sql.execution.command.management.CarbonLoadDataCommand.processData(CarbonLoadDataCommand.scala:356)
  at org.apache.spark.sql.execution.command.AtomicRunnableCommand$$anonfun$run$3.apply(package.scala:148)
  at org.apache.spark.sql.execution.command.AtomicRunnableCommand$$anonfun$run$3.apply(package.scala:145)
  at org.apache.spark.sql.execution.command.Auditable$class.runWithAudit(package.scala:104)
  at org.apache.spark.sql.execution.command.AtomicRunnableCommand.runWithAudit(package.scala:141)
  at org.apache.spark.sql.execution.command.AtomicRunnableCommand.run(package.scala:145)
  at org.apache.spark.sql.execution.command.ExecutedCommandExec.sideEffectResult$lzycompute(commands.scala:58)
  at org.apache.spark.sql.execution.command.ExecutedCommandExec.sideEffectResult(commands.scala:56)
  ...
[JENKINS] Recording test results
[INFO] ------------------------------------------------------------------------
[INFO] Reactor Summary:
[INFO] 
[INFO] Apache CarbonData :: Parent ........................ SUCCESS [ 11.303 s]
[INFO] Apache CarbonData :: Common ........................ SUCCESS [ 15.829 s]
[INFO] Apache CarbonData :: Core .......................... SUCCESS [02:58 min]
[INFO] Apache CarbonData :: Processing .................... SUCCESS [ 33.061 s]
[INFO] Apache CarbonData :: Hadoop ........................ SUCCESS [ 25.594 s]
[INFO] Apache CarbonData :: Hive .......................... SUCCESS [ 34.375 s]
[INFO] Apache CarbonData :: Streaming ..................... SUCCESS [ 28.011 s]
[INFO] Apache CarbonData :: Store SDK ..................... SUCCESS [01:08 min]
[INFO] Apache CarbonData :: Spark Datasource .............. SUCCESS [03:35 min]
[INFO] Apache CarbonData :: Spark Common .................. SUCCESS [01:30 min]
[INFO] Apache CarbonData :: CLI ........................... SUCCESS [05:59 min]
[INFO] Apache CarbonData :: Lucene Index DataMap .......... SUCCESS [ 18.355 s]
[INFO] Apache CarbonData :: Bloom Index DataMap ........... SUCCESS [ 15.504 s]
[INFO] Apache CarbonData :: Spark2 ........................ SUCCESS [23:49 min]
[INFO] Apache CarbonData :: Spark Common Test ............. SUCCESS [  01:26 h]
[INFO] Apache CarbonData :: DataMap Examples .............. SUCCESS [ 14.144 s]
[INFO] Apache CarbonData :: Materialized View Plan ........ SUCCESS [01:33 min]
[INFO] Apache CarbonData :: Materialized View Core ........ FAILURE [11:29 min]
[INFO] Apache CarbonData :: Assembly ...................... SKIPPED
[INFO] Apache CarbonData :: Examples ...................... SKIPPED
[INFO] Apache CarbonData :: presto ........................ SKIPPED
[INFO] Apache CarbonData :: Flink Examples ................ SKIPPED
[INFO] ------------------------------------------------------------------------
[INFO] BUILD FAILURE
[INFO] ------------------------------------------------------------------------
[INFO] Total time: 02:23 h
[INFO] Finished at: 2019-09-18T09:54:15+00:00
[INFO] Final Memory: 160M/2189M
[INFO] ------------------------------------------------------------------------
Waiting for Jenkins to finish collecting data
[ERROR] Failed to execute goal org.scalatest:scalatest-maven-plugin:1.0:test (test) on project
carbondata-mv-core: There are test failures -> [Help 1]
org.apache.maven.lifecycle.LifecycleExecutionException: Failed to execute goal org.scalatest:scalatest-maven-plugin:1.0:test
(test) on project carbondata-mv-core: There are test failures
	at org.apache.maven.lifecycle.internal.MojoExecutor.execute(MojoExecutor.java:212)
	at org.apache.maven.lifecycle.internal.MojoExecutor.execute(MojoExecutor.java:153)
	at org.apache.maven.lifecycle.internal.MojoExecutor.execute(MojoExecutor.java:145)
	at org.apache.maven.lifecycle.internal.LifecycleModuleBuilder.buildProject(LifecycleModuleBuilder.java:116)
	at org.apache.maven.lifecycle.internal.LifecycleModuleBuilder.buildProject(LifecycleModuleBuilder.java:80)
	at org.apache.maven.lifecycle.internal.builder.singlethreaded.SingleThreadedBuilder.build(SingleThreadedBuilder.java:51)
	at org.apache.maven.lifecycle.internal.LifecycleStarter.execute(LifecycleStarter.java:128)
	at org.apache.maven.DefaultMaven.doExecute(DefaultMaven.java:307)
	at org.apache.maven.DefaultMaven.doExecute(DefaultMaven.java:193)
	at org.apache.maven.DefaultMaven.execute(DefaultMaven.java:106)
	at org.jvnet.hudson.maven3.launcher.Maven33Launcher.main(Maven33Launcher.java:129)
	at sun.reflect.NativeMethodAccessorImpl.invoke0(Native Method)
	at sun.reflect.NativeMethodAccessorImpl.invoke(NativeMethodAccessorImpl.java:62)
	at sun.reflect.DelegatingMethodAccessorImpl.invoke(DelegatingMethodAccessorImpl.java:43)
	at java.lang.reflect.Method.invoke(Method.java:498)
	at org.codehaus.plexus.classworlds.launcher.Launcher.launchStandard(Launcher.java:330)
	at org.codehaus.plexus.classworlds.launcher.Launcher.launch(Launcher.java:238)
	at jenkins.maven3.agent.Maven33Main.launch(Maven33Main.java:176)
	at sun.reflect.NativeMethodAccessorImpl.invoke0(Native Method)
	at sun.reflect.NativeMethodAccessorImpl.invoke(NativeMethodAccessorImpl.java:62)
	at sun.reflect.DelegatingMethodAccessorImpl.invoke(DelegatingMethodAccessorImpl.java:43)
	at java.lang.reflect.Method.invoke(Method.java:498)
	at hudson.maven.Maven3Builder.call(Maven3Builder.java:139)
	at hudson.maven.Maven3Builder.call(Maven3Builder.java:70)
	at hudson.remoting.UserRequest.perform(UserRequest.java:212)
	at hudson.remoting.UserRequest.perform(UserRequest.java:54)
	at hudson.remoting.Request$2.run(Request.java:369)
	at hudson.remoting.InterceptingExecutorService$1.call(InterceptingExecutorService.java:72)
	at java.util.concurrent.FutureTask.run(FutureTask.java:266)
	at java.util.concurrent.ThreadPoolExecutor.runWorker(ThreadPoolExecutor.java:1149)
	at java.util.concurrent.ThreadPoolExecutor$Worker.run(ThreadPoolExecutor.java:624)
	at java.lang.Thread.run(Thread.java:748)
Caused by: org.apache.maven.plugin.MojoFailureException: There are test failures
	at org.scalatest.tools.maven.TestMojo.execute(TestMojo.java:107)
	at org.apache.maven.plugin.DefaultBuildPluginManager.executeMojo(DefaultBuildPluginManager.java:134)
	at org.apache.maven.lifecycle.internal.MojoExecutor.execute(MojoExecutor.java:207)
	... 31 more
[ERROR] 
[ERROR] Re-run Maven using the -X switch to enable full debug logging.
[ERROR] 
[ERROR] For more information about the errors and possible solutions, please read the following
articles:
[ERROR] [Help 1] http://cwiki.apache.org/confluence/display/MAVEN/MojoFailureException
[ERROR] 
[ERROR] After correcting the problems, you can resume the build with the command
[ERROR]   mvn <goals> -rf :carbondata-mv-core
[JENKINS] Archiving <https://builds.apache.org/job/carbondata-master-spark-2.1/ws/processing/pom.xml>
to org.apache.carbondata/carbondata-processing/1.6.0-SNAPSHOT/carbondata-processing-1.6.0-SNAPSHOT.pom
[JENKINS] Archiving <https://builds.apache.org/job/carbondata-master-spark-2.1/ws/processing/target/carbondata-processing-1.6.0-SNAPSHOT.jar>
to org.apache.carbondata/carbondata-processing/1.6.0-SNAPSHOT/carbondata-processing-1.6.0-SNAPSHOT.jar
[JENKINS] Archiving <https://builds.apache.org/job/carbondata-master-spark-2.1/ws/datamap/examples/pom.xml>
to org.apache.carbondata/carbondata-datamap-examples/1.6.0-SNAPSHOT/carbondata-datamap-examples-1.6.0-SNAPSHOT.pom
[JENKINS] Archiving <https://builds.apache.org/job/carbondata-master-spark-2.1/ws/datamap/examples/target/carbondata-datamap-examples-1.6.0-SNAPSHOT.jar>
to org.apache.carbondata/carbondata-datamap-examples/1.6.0-SNAPSHOT/carbondata-datamap-examples-1.6.0-SNAPSHOT.jar
[JENKINS] Archiving <https://builds.apache.org/job/carbondata-master-spark-2.1/ws/datamap/mv/core/pom.xml>
to org.apache.carbondata/carbondata-mv-core/1.6.0-SNAPSHOT/carbondata-mv-core-1.6.0-SNAPSHOT.pom
[JENKINS] Archiving <https://builds.apache.org/job/carbondata-master-spark-2.1/ws/streaming/pom.xml>
to org.apache.carbondata/carbondata-streaming/1.6.0-SNAPSHOT/carbondata-streaming-1.6.0-SNAPSHOT.pom
[JENKINS] Archiving <https://builds.apache.org/job/carbondata-master-spark-2.1/ws/streaming/target/carbondata-streaming-1.6.0-SNAPSHOT.jar>
to org.apache.carbondata/carbondata-streaming/1.6.0-SNAPSHOT/carbondata-streaming-1.6.0-SNAPSHOT.jar
[JENKINS] Archiving <https://builds.apache.org/job/carbondata-master-spark-2.1/ws/integration/spark-common/pom.xml>
to org.apache.carbondata/carbondata-spark-common/1.6.0-SNAPSHOT/carbondata-spark-common-1.6.0-SNAPSHOT.pom
[JENKINS] Archiving <https://builds.apache.org/job/carbondata-master-spark-2.1/ws/integration/spark-common/target/carbondata-spark-common-1.6.0-SNAPSHOT.jar>
to org.apache.carbondata/carbondata-spark-common/1.6.0-SNAPSHOT/carbondata-spark-common-1.6.0-SNAPSHOT.jar
[JENKINS] Archiving <https://builds.apache.org/job/carbondata-master-spark-2.1/ws/datamap/lucene/pom.xml>
to org.apache.carbondata/carbondata-lucene/1.6.0-SNAPSHOT/carbondata-lucene-1.6.0-SNAPSHOT.pom
[JENKINS] Archiving <https://builds.apache.org/job/carbondata-master-spark-2.1/ws/datamap/lucene/target/carbondata-lucene-1.6.0-SNAPSHOT.jar>
to org.apache.carbondata/carbondata-lucene/1.6.0-SNAPSHOT/carbondata-lucene-1.6.0-SNAPSHOT.jar
[JENKINS] Archiving <https://builds.apache.org/job/carbondata-master-spark-2.1/ws/examples/spark2/pom.xml>
to org.apache.carbondata/carbondata-examples/1.6.0-SNAPSHOT/carbondata-examples-1.6.0-SNAPSHOT.pom
[JENKINS] Archiving <https://builds.apache.org/job/carbondata-master-spark-2.1/ws/integration/hive/pom.xml>
to org.apache.carbondata/carbondata-hive/1.6.0-SNAPSHOT/carbondata-hive-1.6.0-SNAPSHOT.pom
[JENKINS] Archiving <https://builds.apache.org/job/carbondata-master-spark-2.1/ws/integration/hive/target/carbondata-hive-1.6.0-SNAPSHOT.jar>
to org.apache.carbondata/carbondata-hive/1.6.0-SNAPSHOT/carbondata-hive-1.6.0-SNAPSHOT.jar
[JENKINS] Archiving <https://builds.apache.org/job/carbondata-master-spark-2.1/ws/common/pom.xml>
to org.apache.carbondata/carbondata-common/1.6.0-SNAPSHOT/carbondata-common-1.6.0-SNAPSHOT.pom
[JENKINS] Archiving <https://builds.apache.org/job/carbondata-master-spark-2.1/ws/common/target/carbondata-common-1.6.0-SNAPSHOT.jar>
to org.apache.carbondata/carbondata-common/1.6.0-SNAPSHOT/carbondata-common-1.6.0-SNAPSHOT.jar
[JENKINS] Archiving <https://builds.apache.org/job/carbondata-master-spark-2.1/ws/datamap/mv/plan/pom.xml>
to org.apache.carbondata/carbondata-mv-plan/1.6.0-SNAPSHOT/carbondata-mv-plan-1.6.0-SNAPSHOT.pom
[JENKINS] Archiving <https://builds.apache.org/job/carbondata-master-spark-2.1/ws/datamap/mv/plan/target/carbondata-mv-plan-1.6.0-SNAPSHOT.jar>
to org.apache.carbondata/carbondata-mv-plan/1.6.0-SNAPSHOT/carbondata-mv-plan-1.6.0-SNAPSHOT.jar
[JENKINS] Archiving <https://builds.apache.org/job/carbondata-master-spark-2.1/ws/integration/spark2/pom.xml>
to org.apache.carbondata/carbondata-spark2/1.6.0-SNAPSHOT/carbondata-spark2-1.6.0-SNAPSHOT.pom
[JENKINS] Archiving <https://builds.apache.org/job/carbondata-master-spark-2.1/ws/integration/spark2/target/carbondata-spark2-1.6.0-SNAPSHOT.jar>
to org.apache.carbondata/carbondata-spark2/1.6.0-SNAPSHOT/carbondata-spark2-1.6.0-SNAPSHOT.jar
[JENKINS] Archiving <https://builds.apache.org/job/carbondata-master-spark-2.1/ws/tools/cli/pom.xml>
to org.apache.carbondata/carbondata-cli/1.6.0-SNAPSHOT/carbondata-cli-1.6.0-SNAPSHOT.pom
[JENKINS] Archiving <https://builds.apache.org/job/carbondata-master-spark-2.1/ws/tools/cli/target/carbondata-cli-1.6.0-SNAPSHOT.jar>
to org.apache.carbondata/carbondata-cli/1.6.0-SNAPSHOT/carbondata-cli-1.6.0-SNAPSHOT.jar
[JENKINS] Archiving <https://builds.apache.org/job/carbondata-master-spark-2.1/ws/datamap/bloom/pom.xml>
to org.apache.carbondata/carbondata-bloom/1.6.0-SNAPSHOT/carbondata-bloom-1.6.0-SNAPSHOT.pom
[JENKINS] Archiving <https://builds.apache.org/job/carbondata-master-spark-2.1/ws/datamap/bloom/target/carbondata-bloom-1.6.0-SNAPSHOT.jar>
to org.apache.carbondata/carbondata-bloom/1.6.0-SNAPSHOT/carbondata-bloom-1.6.0-SNAPSHOT.jar
[JENKINS] Archiving <https://builds.apache.org/job/carbondata-master-spark-2.1/ws/assembly/pom.xml>
to org.apache.carbondata/carbondata-assembly/1.6.0-SNAPSHOT/carbondata-assembly-1.6.0-SNAPSHOT.pom
[JENKINS] Archiving <https://builds.apache.org/job/carbondata-master-spark-2.1/ws/pom.xml>
to org.apache.carbondata/carbondata-parent/1.6.0-SNAPSHOT/carbondata-parent-1.6.0-SNAPSHOT.pom
[JENKINS] Archiving <https://builds.apache.org/job/carbondata-master-spark-2.1/ws/examples/flink/pom.xml>
to org.apache.carbondata/carbondata-examples-flink/1.6.0-SNAPSHOT/carbondata-examples-flink-1.6.0-SNAPSHOT.pom
[Fast Archiver] No prior successful build to compare, so performing full copy of artifacts
[JENKINS] Archiving <https://builds.apache.org/job/carbondata-master-spark-2.1/ws/core/pom.xml>
to org.apache.carbondata/carbondata-core/1.6.0-SNAPSHOT/carbondata-core-1.6.0-SNAPSHOT.pom
[JENKINS] Archiving <https://builds.apache.org/job/carbondata-master-spark-2.1/ws/core/target/carbondata-core-1.6.0-SNAPSHOT.jar>
to org.apache.carbondata/carbondata-core/1.6.0-SNAPSHOT/carbondata-core-1.6.0-SNAPSHOT.jar
[JENKINS] Archiving <https://builds.apache.org/job/carbondata-master-spark-2.1/ws/hadoop/pom.xml>
to org.apache.carbondata/carbondata-hadoop/1.6.0-SNAPSHOT/carbondata-hadoop-1.6.0-SNAPSHOT.pom
[JENKINS] Archiving <https://builds.apache.org/job/carbondata-master-spark-2.1/ws/hadoop/target/carbondata-hadoop-1.6.0-SNAPSHOT.jar>
to org.apache.carbondata/carbondata-hadoop/1.6.0-SNAPSHOT/carbondata-hadoop-1.6.0-SNAPSHOT.jar
[JENKINS] Archiving <https://builds.apache.org/job/carbondata-master-spark-2.1/ws/integration/spark-datasource/pom.xml>
to org.apache.carbondata/carbondata-spark-datasource/1.6.0-SNAPSHOT/carbondata-spark-datasource-1.6.0-SNAPSHOT.pom
[JENKINS] Archiving <https://builds.apache.org/job/carbondata-master-spark-2.1/ws/integration/spark-datasource/target/carbondata-spark-datasource-1.6.0-SNAPSHOT.jar>
to org.apache.carbondata/carbondata-spark-datasource/1.6.0-SNAPSHOT/carbondata-spark-datasource-1.6.0-SNAPSHOT.jar
[JENKINS] Archiving <https://builds.apache.org/job/carbondata-master-spark-2.1/ws/integration/presto/pom.xml>
to org.apache.carbondata/carbondata-presto/1.6.0-SNAPSHOT/carbondata-presto-1.6.0-SNAPSHOT.pom
[JENKINS] Archiving <https://builds.apache.org/job/carbondata-master-spark-2.1/ws/integration/spark-common-test/pom.xml>
to org.apache.carbondata/carbondata-spark-common-test/1.6.0-SNAPSHOT/carbondata-spark-common-test-1.6.0-SNAPSHOT.pom
[JENKINS] Archiving <https://builds.apache.org/job/carbondata-master-spark-2.1/ws/integration/spark-common-test/target/carbondata-spark-common-test-1.6.0-SNAPSHOT.jar>
to org.apache.carbondata/carbondata-spark-common-test/1.6.0-SNAPSHOT/carbondata-spark-common-test-1.6.0-SNAPSHOT.jar
[JENKINS] Archiving <https://builds.apache.org/job/carbondata-master-spark-2.1/ws/store/sdk/pom.xml>
to org.apache.carbondata/carbondata-store-sdk/1.6.0-SNAPSHOT/carbondata-store-sdk-1.6.0-SNAPSHOT.pom
[JENKINS] Archiving <https://builds.apache.org/job/carbondata-master-spark-2.1/ws/store/sdk/target/carbondata-store-sdk-1.6.0-SNAPSHOT.jar>
to org.apache.carbondata/carbondata-store-sdk/1.6.0-SNAPSHOT/carbondata-store-sdk-1.6.0-SNAPSHOT.jar
Sending e-mails to: commits@carbondata.apache.org
Sending e-mails to: commits@carbondata.apache.org kumarvishal1802@gmail.com ravi.pesala@gmail.com
Sending e-mails to: commits@carbondata.apache.org
Sending e-mails to: commits@carbondata.apache.org
channel stopped
Not sending mail to unregistered user 441586683@qq.com
Not sending mail to unregistered user carbondatacontributions@gmail.com
Not sending mail to unregistered user jacky.likun@qq.com
Not sending mail to unregistered user kunalkapoor642@gmail.com
Not sending mail to unregistered user vikramahuja8803@gmail.com

Mime
View raw message