carbondata-commits mailing list archives

Site index · List index
Message view « Date » · « Thread »
Top « Date » · « Thread »
From Apache Jenkins Server <jenk...@builds.apache.org>
Subject Build failed in Jenkins: carbondata-master-spark-2.1 #3731
Date Thu, 12 Sep 2019 06:52:20 GMT
See <https://builds.apache.org/job/carbondata-master-spark-2.1/3731/display/redirect?page=changes>

Changes:

[kunalkapoor642] [HOTFIX] Fix NPE on windows

------------------------------------------
[...truncated 12.61 MB...]
+---+---------+--------+
| id|     name|  salary|
+---+---------+--------+
|  1|  'liang'|200000.0|
|  2|'anubhav'| 20000.0|
|  1|  'liang'|200000.0|
|  2|'anubhav'| 20000.0|
+---+---------+--------+

2019-09-12 06:50:56 AUDIT audit:72 - {"time":"September 11, 2019 11:50:56 PM PDT","username":"jenkins","opName":"CREATE
TABLE","opId":"24907266636644763","opStatus":"START"}
2019-09-12 06:50:56 AUDIT audit:93 - {"time":"September 11, 2019 11:50:56 PM PDT","username":"jenkins","opName":"CREATE
TABLE","opId":"24907266636644763","opStatus":"SUCCESS","opTime":"65 ms","table":"default.test_boundary","extraInfo":{"bad_record_path":"","local_dictionary_enable":"true","external":"false","sort_columns":"","comment":"","dictionary_include":"c6_timestamp"}}
2019-09-12 06:50:56 AUDIT audit:72 - {"time":"September 11, 2019 11:50:56 PM PDT","username":"jenkins","opName":"LOAD
DATA","opId":"24907266706993633","opStatus":"START"}
2019-09-12 06:50:56 ERROR DataLoadExecutor:55 - Data Load is partially success for table test_boundary
2019-09-12 06:50:56 AUDIT audit:93 - {"time":"September 11, 2019 11:50:56 PM PDT","username":"jenkins","opName":"LOAD
DATA","opId":"24907266706993633","opStatus":"SUCCESS","opTime":"282 ms","table":"default.test_boundary","extraInfo":{"SegmentId":"0","DataSize":"4.03KB","IndexSize":"1.06KB"}}
OK
******Total Number Of Rows Fetched ****** 0
- HiveExample *** FAILED ***
  java.lang.AssertionError: assertion failed
  at scala.Predef$.assert(Predef.scala:156)
  at org.apache.carbondata.examples.HiveExample$.readFromHive(HiveExample.scala:171)
  at org.apache.carbondata.examplesCI.RunExamples$$anonfun$21.apply$mcV$sp(RunExamples.scala:135)
  at org.apache.carbondata.examplesCI.RunExamples$$anonfun$21.apply(RunExamples.scala:133)
  at org.apache.carbondata.examplesCI.RunExamples$$anonfun$21.apply(RunExamples.scala:133)
  at org.scalatest.Transformer$$anonfun$apply$1.apply$mcV$sp(Transformer.scala:22)
  at org.scalatest.OutcomeOf$class.outcomeOf(OutcomeOf.scala:85)
  at org.scalatest.OutcomeOf$.outcomeOf(OutcomeOf.scala:104)
  at org.scalatest.Transformer.apply(Transformer.scala:22)
  at org.scalatest.Transformer.apply(Transformer.scala:20)
  ...
Exception encountered when invoking run on a nested suite - Cannot call methods on a
stopped SparkContext.
This stopped SparkContext was created at:

org.apache.spark.sql.test.util.QueryTest.<init>(QueryTest.scala:115)
org.apache.carbondata.examplesCI.RunExamples.<init>(RunExamples.scala:35)
sun.reflect.NativeConstructorAccessorImpl.newInstance0(Native Method)
sun.reflect.NativeConstructorAccessorImpl.newInstance(NativeConstructorAccessorImpl.java:62)
sun.reflect.DelegatingConstructorAccessorImpl.newInstance(DelegatingConstructorAccessorImpl.java:45)
java.lang.reflect.Constructor.newInstance(Constructor.java:423)
java.lang.Class.newInstance(Class.java:442)
org.scalatest.tools.DiscoverySuite$.getSuiteInstance(DiscoverySuite.scala:69)
org.scalatest.tools.DiscoverySuite$$anonfun$1.apply(DiscoverySuite.scala:38)
org.scalatest.tools.DiscoverySuite$$anonfun$1.apply(DiscoverySuite.scala:37)
scala.collection.TraversableLike$$anonfun$map$1.apply(TraversableLike.scala:234)
scala.collection.TraversableLike$$anonfun$map$1.apply(TraversableLike.scala:234)
scala.collection.Iterator$class.foreach(Iterator.scala:893)
scala.collection.AbstractIterator.foreach(Iterator.scala:1336)
scala.collection.IterableLike$class.foreach(IterableLike.scala:72)
scala.collection.AbstractIterable.foreach(Iterable.scala:54)
scala.collection.TraversableLike$class.map(TraversableLike.scala:234)
scala.collection.AbstractTraversable.map(Traversable.scala:104)
org.scalatest.tools.DiscoverySuite.<init>(DiscoverySuite.scala:37)
org.scalatest.tools.Runner$.genDiscoSuites$1(Runner.scala:2390)

The currently active SparkContext was created at:

(No active SparkContext.)
          *** ABORTED ***
  java.lang.IllegalStateException: Cannot call methods on a stopped SparkContext.
This stopped SparkContext was created at:

org.apache.spark.sql.test.util.QueryTest.<init>(QueryTest.scala:115)
org.apache.carbondata.examplesCI.RunExamples.<init>(RunExamples.scala:35)
sun.reflect.NativeConstructorAccessorImpl.newInstance0(Native Method)
sun.reflect.NativeConstructorAccessorImpl.newInstance(NativeConstructorAccessorImpl.java:62)
sun.reflect.DelegatingConstructorAccessorImpl.newInstance(DelegatingConstructorAccessorImpl.java:45)
java.lang.reflect.Constructor.newInstance(Constructor.java:423)
java.lang.Class.newInstance(Class.java:442)
org.scalatest.tools.DiscoverySuite$.getSuiteInstance(DiscoverySuite.scala:69)
org.scalatest.tools.DiscoverySuite$$anonfun$1.apply(DiscoverySuite.scala:38)
org.scalatest.tools.DiscoverySuite$$anonfun$1.apply(DiscoverySuite.scala:37)
scala.collection.TraversableLike$$anonfun$map$1.apply(TraversableLike.scala:234)
scala.collection.TraversableLike$$anonfun$map$1.apply(TraversableLike.scala:234)
scala.collection.Iterator$class.foreach(Iterator.scala:893)
scala.collection.AbstractIterator.foreach(Iterator.scala:1336)
scala.collection.IterableLike$class.foreach(IterableLike.scala:72)
scala.collection.AbstractIterable.foreach(Iterable.scala:54)
scala.collection.TraversableLike$class.map(TraversableLike.scala:234)
scala.collection.AbstractTraversable.map(Traversable.scala:104)
org.scalatest.tools.DiscoverySuite.<init>(DiscoverySuite.scala:37)
org.scalatest.tools.Runner$.genDiscoSuites$1(Runner.scala:2390)

The currently active SparkContext was created at:

(No active SparkContext.)
  at org.apache.spark.SparkContext.assertNotStopped(SparkContext.scala:100)
  at org.apache.spark.SparkContext$$anonfun$parallelize$1.apply(SparkContext.scala:716)
  at org.apache.spark.SparkContext$$anonfun$parallelize$1.apply(SparkContext.scala:715)
  at org.apache.spark.rdd.RDDOperationScope$.withScope(RDDOperationScope.scala:151)
  at org.apache.spark.rdd.RDDOperationScope$.withScope(RDDOperationScope.scala:112)
  at org.apache.spark.SparkContext.withScope(SparkContext.scala:701)
  at org.apache.spark.SparkContext.parallelize(SparkContext.scala:715)
  at org.apache.spark.sql.execution.command.ExecutedCommandExec.doExecute(commands.scala:74)
  at org.apache.spark.sql.execution.SparkPlan$$anonfun$execute$1.apply(SparkPlan.scala:114)
  at org.apache.spark.sql.execution.SparkPlan$$anonfun$execute$1.apply(SparkPlan.scala:114)
  ...
Run completed in 2 minutes, 29 seconds.
Total number of tests run: 21
Suites: completed 1, aborted 1
Tests: succeeded 20, failed 1, canceled 0, ignored 0, pending 0
*** 1 SUITE ABORTED ***
*** 1 TEST FAILED ***
[JENKINS] Recording test results
[INFO] ------------------------------------------------------------------------
[INFO] Reactor Summary:
[INFO] 
[INFO] Apache CarbonData :: Parent ........................ SUCCESS [ 20.724 s]
[INFO] Apache CarbonData :: Common ........................ SUCCESS [ 22.030 s]
[INFO] Apache CarbonData :: Core .......................... SUCCESS [03:15 min]
[INFO] Apache CarbonData :: Processing .................... SUCCESS [ 35.865 s]
[INFO] Apache CarbonData :: Hadoop ........................ SUCCESS [ 26.084 s]
[INFO] Apache CarbonData :: Hive .......................... SUCCESS [ 47.030 s]
[INFO] Apache CarbonData :: Streaming ..................... SUCCESS [ 32.235 s]
[INFO] Apache CarbonData :: Store SDK ..................... SUCCESS [01:10 min]
[INFO] Apache CarbonData :: Spark Datasource .............. SUCCESS [03:56 min]
[INFO] Apache CarbonData :: Spark Common .................. SUCCESS [01:31 min]
[INFO] Apache CarbonData :: CLI ........................... SUCCESS [05:03 min]
[INFO] Apache CarbonData :: Lucene Index DataMap .......... SUCCESS [ 17.860 s]
[INFO] Apache CarbonData :: Bloom Index DataMap ........... SUCCESS [ 14.794 s]
[INFO] Apache CarbonData :: Spark2 ........................ SUCCESS [22:57 min]
[INFO] Apache CarbonData :: Spark Common Test ............. SUCCESS [  01:17 h]
[INFO] Apache CarbonData :: DataMap Examples .............. SUCCESS [ 23.014 s]
[INFO] Apache CarbonData :: Materialized View Plan ........ SUCCESS [01:43 min]
[INFO] Apache CarbonData :: Materialized View Core ........ SUCCESS [13:50 min]
[INFO] Apache CarbonData :: Assembly ...................... SUCCESS [ 26.469 s]
[INFO] Apache CarbonData :: Examples ...................... FAILURE [03:36 min]
[INFO] Apache CarbonData :: presto ........................ SKIPPED
[INFO] Apache CarbonData :: Flink Examples ................ SKIPPED
[INFO] ------------------------------------------------------------------------
[INFO] BUILD FAILURE
[INFO] ------------------------------------------------------------------------
[INFO] Total time: 02:20 h
[INFO] Finished at: 2019-09-12T06:51:48+00:00
[INFO] Final Memory: 158M/1829M
[INFO] ------------------------------------------------------------------------
Waiting for Jenkins to finish collecting data
[ERROR] Failed to execute goal org.scalatest:scalatest-maven-plugin:1.0:test (test) on project
carbondata-examples: There are test failures -> [Help 1]
org.apache.maven.lifecycle.LifecycleExecutionException: Failed to execute goal org.scalatest:scalatest-maven-plugin:1.0:test
(test) on project carbondata-examples: There are test failures
	at org.apache.maven.lifecycle.internal.MojoExecutor.execute(MojoExecutor.java:212)
	at org.apache.maven.lifecycle.internal.MojoExecutor.execute(MojoExecutor.java:153)
	at org.apache.maven.lifecycle.internal.MojoExecutor.execute(MojoExecutor.java:145)
	at org.apache.maven.lifecycle.internal.LifecycleModuleBuilder.buildProject(LifecycleModuleBuilder.java:116)
	at org.apache.maven.lifecycle.internal.LifecycleModuleBuilder.buildProject(LifecycleModuleBuilder.java:80)
	at org.apache.maven.lifecycle.internal.builder.singlethreaded.SingleThreadedBuilder.build(SingleThreadedBuilder.java:51)
	at org.apache.maven.lifecycle.internal.LifecycleStarter.execute(LifecycleStarter.java:128)
	at org.apache.maven.DefaultMaven.doExecute(DefaultMaven.java:307)
	at org.apache.maven.DefaultMaven.doExecute(DefaultMaven.java:193)
	at org.apache.maven.DefaultMaven.execute(DefaultMaven.java:106)
	at org.jvnet.hudson.maven3.launcher.Maven33Launcher.main(Maven33Launcher.java:129)
	at sun.reflect.NativeMethodAccessorImpl.invoke0(Native Method)
	at sun.reflect.NativeMethodAccessorImpl.invoke(NativeMethodAccessorImpl.java:62)
	at sun.reflect.DelegatingMethodAccessorImpl.invoke(DelegatingMethodAccessorImpl.java:43)
	at java.lang.reflect.Method.invoke(Method.java:498)
	at org.codehaus.plexus.classworlds.launcher.Launcher.launchStandard(Launcher.java:330)
	at org.codehaus.plexus.classworlds.launcher.Launcher.launch(Launcher.java:238)
	at jenkins.maven3.agent.Maven33Main.launch(Maven33Main.java:176)
	at sun.reflect.NativeMethodAccessorImpl.invoke0(Native Method)
	at sun.reflect.NativeMethodAccessorImpl.invoke(NativeMethodAccessorImpl.java:62)
	at sun.reflect.DelegatingMethodAccessorImpl.invoke(DelegatingMethodAccessorImpl.java:43)
	at java.lang.reflect.Method.invoke(Method.java:498)
	at hudson.maven.Maven3Builder.call(Maven3Builder.java:139)
	at hudson.maven.Maven3Builder.call(Maven3Builder.java:70)
	at hudson.remoting.UserRequest.perform(UserRequest.java:212)
	at hudson.remoting.UserRequest.perform(UserRequest.java:54)
	at hudson.remoting.Request$2.run(Request.java:369)
	at hudson.remoting.InterceptingExecutorService$1.call(InterceptingExecutorService.java:72)
	at java.util.concurrent.FutureTask.run(FutureTask.java:266)
	at java.util.concurrent.ThreadPoolExecutor.runWorker(ThreadPoolExecutor.java:1149)
	at java.util.concurrent.ThreadPoolExecutor$Worker.run(ThreadPoolExecutor.java:624)
	at java.lang.Thread.run(Thread.java:748)
Caused by: org.apache.maven.plugin.MojoFailureException: There are test failures
	at org.scalatest.tools.maven.TestMojo.execute(TestMojo.java:107)
	at org.apache.maven.plugin.DefaultBuildPluginManager.executeMojo(DefaultBuildPluginManager.java:134)
	at org.apache.maven.lifecycle.internal.MojoExecutor.execute(MojoExecutor.java:207)
	... 31 more
[ERROR] 
[ERROR] Re-run Maven using the -X switch to enable full debug logging.
[ERROR] 
[ERROR] For more information about the errors and possible solutions, please read the following
articles:
[ERROR] [Help 1] http://cwiki.apache.org/confluence/display/MAVEN/MojoFailureException
[ERROR] 
[ERROR] After correcting the problems, you can resume the build with the command
[ERROR]   mvn <goals> -rf :carbondata-examples
[JENKINS] Archiving <https://builds.apache.org/job/carbondata-master-spark-2.1/ws/processing/pom.xml>
to org.apache.carbondata/carbondata-processing/1.6.0-SNAPSHOT/carbondata-processing-1.6.0-SNAPSHOT.pom
[JENKINS] Archiving <https://builds.apache.org/job/carbondata-master-spark-2.1/ws/processing/target/carbondata-processing-1.6.0-SNAPSHOT.jar>
to org.apache.carbondata/carbondata-processing/1.6.0-SNAPSHOT/carbondata-processing-1.6.0-SNAPSHOT.jar
[Fast Archiver] No artifacts from carbondata-master-spark-2.1 » Apache CarbonData :: Processing
#3730 to compare, so performing full copy of artifacts
[JENKINS] Archiving <https://builds.apache.org/job/carbondata-master-spark-2.1/ws/datamap/examples/pom.xml>
to org.apache.carbondata/carbondata-datamap-examples/1.6.0-SNAPSHOT/carbondata-datamap-examples-1.6.0-SNAPSHOT.pom
[JENKINS] Archiving <https://builds.apache.org/job/carbondata-master-spark-2.1/ws/datamap/examples/target/carbondata-datamap-examples-1.6.0-SNAPSHOT.jar>
to org.apache.carbondata/carbondata-datamap-examples/1.6.0-SNAPSHOT/carbondata-datamap-examples-1.6.0-SNAPSHOT.jar
[JENKINS] Archiving <https://builds.apache.org/job/carbondata-master-spark-2.1/ws/datamap/mv/core/pom.xml>
to org.apache.carbondata/carbondata-mv-core/1.6.0-SNAPSHOT/carbondata-mv-core-1.6.0-SNAPSHOT.pom
[JENKINS] Archiving <https://builds.apache.org/job/carbondata-master-spark-2.1/ws/datamap/mv/core/target/carbondata-mv-core-1.6.0-SNAPSHOT.jar>
to org.apache.carbondata/carbondata-mv-core/1.6.0-SNAPSHOT/carbondata-mv-core-1.6.0-SNAPSHOT.jar
[JENKINS] Archiving <https://builds.apache.org/job/carbondata-master-spark-2.1/ws/streaming/pom.xml>
to org.apache.carbondata/carbondata-streaming/1.6.0-SNAPSHOT/carbondata-streaming-1.6.0-SNAPSHOT.pom
[JENKINS] Archiving <https://builds.apache.org/job/carbondata-master-spark-2.1/ws/streaming/target/carbondata-streaming-1.6.0-SNAPSHOT.jar>
to org.apache.carbondata/carbondata-streaming/1.6.0-SNAPSHOT/carbondata-streaming-1.6.0-SNAPSHOT.jar
[Fast Archiver] No artifacts from carbondata-master-spark-2.1 » Apache CarbonData :: Streaming
#3730 to compare, so performing full copy of artifacts
[JENKINS] Archiving <https://builds.apache.org/job/carbondata-master-spark-2.1/ws/integration/spark-common/pom.xml>
to org.apache.carbondata/carbondata-spark-common/1.6.0-SNAPSHOT/carbondata-spark-common-1.6.0-SNAPSHOT.pom
[JENKINS] Archiving <https://builds.apache.org/job/carbondata-master-spark-2.1/ws/integration/spark-common/target/carbondata-spark-common-1.6.0-SNAPSHOT.jar>
to org.apache.carbondata/carbondata-spark-common/1.6.0-SNAPSHOT/carbondata-spark-common-1.6.0-SNAPSHOT.jar
[Fast Archiver] No artifacts from carbondata-master-spark-2.1 » Apache CarbonData :: Spark
Common #3730 to compare, so performing full copy of artifacts
[JENKINS] Archiving <https://builds.apache.org/job/carbondata-master-spark-2.1/ws/datamap/lucene/pom.xml>
to org.apache.carbondata/carbondata-lucene/1.6.0-SNAPSHOT/carbondata-lucene-1.6.0-SNAPSHOT.pom
[JENKINS] Archiving <https://builds.apache.org/job/carbondata-master-spark-2.1/ws/datamap/lucene/target/carbondata-lucene-1.6.0-SNAPSHOT.jar>
to org.apache.carbondata/carbondata-lucene/1.6.0-SNAPSHOT/carbondata-lucene-1.6.0-SNAPSHOT.jar
[Fast Archiver] No artifacts from carbondata-master-spark-2.1 » Apache CarbonData :: Lucene
Index DataMap #3730 to compare, so performing full copy of artifacts
[JENKINS] Archiving <https://builds.apache.org/job/carbondata-master-spark-2.1/ws/examples/spark2/pom.xml>
to org.apache.carbondata/carbondata-examples/1.6.0-SNAPSHOT/carbondata-examples-1.6.0-SNAPSHOT.pom
[JENKINS] Archiving <https://builds.apache.org/job/carbondata-master-spark-2.1/ws/integration/hive/pom.xml>
to org.apache.carbondata/carbondata-hive/1.6.0-SNAPSHOT/carbondata-hive-1.6.0-SNAPSHOT.pom
[JENKINS] Archiving <https://builds.apache.org/job/carbondata-master-spark-2.1/ws/integration/hive/target/carbondata-hive-1.6.0-SNAPSHOT.jar>
to org.apache.carbondata/carbondata-hive/1.6.0-SNAPSHOT/carbondata-hive-1.6.0-SNAPSHOT.jar
[Fast Archiver] No artifacts from carbondata-master-spark-2.1 » Apache CarbonData :: Hive
#3730 to compare, so performing full copy of artifacts
[JENKINS] Archiving <https://builds.apache.org/job/carbondata-master-spark-2.1/ws/common/pom.xml>
to org.apache.carbondata/carbondata-common/1.6.0-SNAPSHOT/carbondata-common-1.6.0-SNAPSHOT.pom
[JENKINS] Archiving <https://builds.apache.org/job/carbondata-master-spark-2.1/ws/common/target/carbondata-common-1.6.0-SNAPSHOT.jar>
to org.apache.carbondata/carbondata-common/1.6.0-SNAPSHOT/carbondata-common-1.6.0-SNAPSHOT.jar
[Fast Archiver] No artifacts from carbondata-master-spark-2.1 » Apache CarbonData :: Common
#3730 to compare, so performing full copy of artifacts
[JENKINS] Archiving <https://builds.apache.org/job/carbondata-master-spark-2.1/ws/datamap/mv/plan/pom.xml>
to org.apache.carbondata/carbondata-mv-plan/1.6.0-SNAPSHOT/carbondata-mv-plan-1.6.0-SNAPSHOT.pom
[JENKINS] Archiving <https://builds.apache.org/job/carbondata-master-spark-2.1/ws/datamap/mv/plan/target/carbondata-mv-plan-1.6.0-SNAPSHOT.jar>
to org.apache.carbondata/carbondata-mv-plan/1.6.0-SNAPSHOT/carbondata-mv-plan-1.6.0-SNAPSHOT.jar
[JENKINS] Archiving <https://builds.apache.org/job/carbondata-master-spark-2.1/ws/integration/spark2/pom.xml>
to org.apache.carbondata/carbondata-spark2/1.6.0-SNAPSHOT/carbondata-spark2-1.6.0-SNAPSHOT.pom
[JENKINS] Archiving <https://builds.apache.org/job/carbondata-master-spark-2.1/ws/integration/spark2/target/carbondata-spark2-1.6.0-SNAPSHOT.jar>
to org.apache.carbondata/carbondata-spark2/1.6.0-SNAPSHOT/carbondata-spark2-1.6.0-SNAPSHOT.jar
[Fast Archiver] No artifacts from carbondata-master-spark-2.1 » Apache CarbonData :: Spark2
#3730 to compare, so performing full copy of artifacts
[JENKINS] Archiving <https://builds.apache.org/job/carbondata-master-spark-2.1/ws/tools/cli/pom.xml>
to org.apache.carbondata/carbondata-cli/1.6.0-SNAPSHOT/carbondata-cli-1.6.0-SNAPSHOT.pom
[JENKINS] Archiving <https://builds.apache.org/job/carbondata-master-spark-2.1/ws/tools/cli/target/carbondata-cli-1.6.0-SNAPSHOT.jar>
to org.apache.carbondata/carbondata-cli/1.6.0-SNAPSHOT/carbondata-cli-1.6.0-SNAPSHOT.jar
[Fast Archiver] No artifacts from carbondata-master-spark-2.1 » Apache CarbonData :: CLI
#3730 to compare, so performing full copy of artifacts
[JENKINS] Archiving <https://builds.apache.org/job/carbondata-master-spark-2.1/ws/datamap/bloom/pom.xml>
to org.apache.carbondata/carbondata-bloom/1.6.0-SNAPSHOT/carbondata-bloom-1.6.0-SNAPSHOT.pom
[JENKINS] Archiving <https://builds.apache.org/job/carbondata-master-spark-2.1/ws/datamap/bloom/target/carbondata-bloom-1.6.0-SNAPSHOT.jar>
to org.apache.carbondata/carbondata-bloom/1.6.0-SNAPSHOT/carbondata-bloom-1.6.0-SNAPSHOT.jar
[Fast Archiver] No artifacts from carbondata-master-spark-2.1 » Apache CarbonData :: Bloom
Index DataMap #3730 to compare, so performing full copy of artifacts
[JENKINS] Archiving <https://builds.apache.org/job/carbondata-master-spark-2.1/ws/assembly/pom.xml>
to org.apache.carbondata/carbondata-assembly/1.6.0-SNAPSHOT/carbondata-assembly-1.6.0-SNAPSHOT.pom
[JENKINS] Archiving <https://builds.apache.org/job/carbondata-master-spark-2.1/ws/pom.xml>
to org.apache.carbondata/carbondata-parent/1.6.0-SNAPSHOT/carbondata-parent-1.6.0-SNAPSHOT.pom
[Fast Archiver] No artifacts from carbondata-master-spark-2.1 » Apache CarbonData :: Parent
#3730 to compare, so performing full copy of artifacts
[JENKINS] Archiving <https://builds.apache.org/job/carbondata-master-spark-2.1/ws/examples/flink/pom.xml>
to org.apache.carbondata/carbondata-examples-flink/1.6.0-SNAPSHOT/carbondata-examples-flink-1.6.0-SNAPSHOT.pom
[Fast Archiver] No prior successful build to compare, so performing full copy of artifacts
[JENKINS] Archiving <https://builds.apache.org/job/carbondata-master-spark-2.1/ws/core/pom.xml>
to org.apache.carbondata/carbondata-core/1.6.0-SNAPSHOT/carbondata-core-1.6.0-SNAPSHOT.pom
[JENKINS] Archiving <https://builds.apache.org/job/carbondata-master-spark-2.1/ws/core/target/carbondata-core-1.6.0-SNAPSHOT.jar>
to org.apache.carbondata/carbondata-core/1.6.0-SNAPSHOT/carbondata-core-1.6.0-SNAPSHOT.jar
[Fast Archiver] No artifacts from carbondata-master-spark-2.1 » Apache CarbonData :: Core
#3730 to compare, so performing full copy of artifacts
[JENKINS] Archiving <https://builds.apache.org/job/carbondata-master-spark-2.1/ws/hadoop/pom.xml>
to org.apache.carbondata/carbondata-hadoop/1.6.0-SNAPSHOT/carbondata-hadoop-1.6.0-SNAPSHOT.pom
[JENKINS] Archiving <https://builds.apache.org/job/carbondata-master-spark-2.1/ws/hadoop/target/carbondata-hadoop-1.6.0-SNAPSHOT.jar>
to org.apache.carbondata/carbondata-hadoop/1.6.0-SNAPSHOT/carbondata-hadoop-1.6.0-SNAPSHOT.jar
[Fast Archiver] No artifacts from carbondata-master-spark-2.1 » Apache CarbonData :: Hadoop
#3730 to compare, so performing full copy of artifacts
[JENKINS] Archiving <https://builds.apache.org/job/carbondata-master-spark-2.1/ws/integration/spark-datasource/pom.xml>
to org.apache.carbondata/carbondata-spark-datasource/1.6.0-SNAPSHOT/carbondata-spark-datasource-1.6.0-SNAPSHOT.pom
[JENKINS] Archiving <https://builds.apache.org/job/carbondata-master-spark-2.1/ws/integration/spark-datasource/target/carbondata-spark-datasource-1.6.0-SNAPSHOT.jar>
to org.apache.carbondata/carbondata-spark-datasource/1.6.0-SNAPSHOT/carbondata-spark-datasource-1.6.0-SNAPSHOT.jar
[Fast Archiver] No artifacts from carbondata-master-spark-2.1 » Apache CarbonData :: Spark
Datasource #3730 to compare, so performing full copy of artifacts
[JENKINS] Archiving <https://builds.apache.org/job/carbondata-master-spark-2.1/ws/integration/presto/pom.xml>
to org.apache.carbondata/carbondata-presto/1.6.0-SNAPSHOT/carbondata-presto-1.6.0-SNAPSHOT.pom
[JENKINS] Archiving <https://builds.apache.org/job/carbondata-master-spark-2.1/ws/integration/spark-common-test/pom.xml>
to org.apache.carbondata/carbondata-spark-common-test/1.6.0-SNAPSHOT/carbondata-spark-common-test-1.6.0-SNAPSHOT.pom
[JENKINS] Archiving <https://builds.apache.org/job/carbondata-master-spark-2.1/ws/integration/spark-common-test/target/carbondata-spark-common-test-1.6.0-SNAPSHOT.jar>
to org.apache.carbondata/carbondata-spark-common-test/1.6.0-SNAPSHOT/carbondata-spark-common-test-1.6.0-SNAPSHOT.jar
[JENKINS] Archiving <https://builds.apache.org/job/carbondata-master-spark-2.1/ws/store/sdk/pom.xml>
to org.apache.carbondata/carbondata-store-sdk/1.6.0-SNAPSHOT/carbondata-store-sdk-1.6.0-SNAPSHOT.pom
[JENKINS] Archiving <https://builds.apache.org/job/carbondata-master-spark-2.1/ws/store/sdk/target/carbondata-store-sdk-1.6.0-SNAPSHOT.jar>
to org.apache.carbondata/carbondata-store-sdk/1.6.0-SNAPSHOT/carbondata-store-sdk-1.6.0-SNAPSHOT.jar
[Fast Archiver] No artifacts from carbondata-master-spark-2.1 » Apache CarbonData :: Store
SDK #3730 to compare, so performing full copy of artifacts
Sending e-mails to: commits@carbondata.apache.org
Not sending mail to unregistered user kunalkapoor642@gmail.com
Sending e-mails to: commits@carbondata.apache.org ravi.pesala@gmail.com
Not sending mail to unregistered user kunalkapoor642@gmail.com
Sending e-mails to: commits@carbondata.apache.org
Not sending mail to unregistered user kunalkapoor642@gmail.com
Sending e-mails to: commits@carbondata.apache.org
channel stopped
Not sending mail to unregistered user 441586683@qq.com
Not sending mail to unregistered user carbondatacontributions@gmail.com
Not sending mail to unregistered user jacky.likun@qq.com
Not sending mail to unregistered user kunalkapoor642@gmail.com
Not sending mail to unregistered user vikramahuja8803@gmail.com

Mime
View raw message