carbondata-commits mailing list archives

Site index · List index
Message view « Date » · « Thread »
Top « Date » · « Thread »
From Apache Jenkins Server <jenk...@builds.apache.org>
Subject Build failed in Jenkins: carbondata-master-spark-2.2 #2105
Date Tue, 03 Dec 2019 07:13:14 GMT
See <https://builds.apache.org/job/carbondata-master-spark-2.2/2105/display/redirect>

Changes:


------------------------------------------
[...truncated 15.77 KB...]
[INFO] --- jacoco-maven-plugin:0.7.9:prepare-agent (default-prepare-agent) @ carbondata-common
---
[INFO] argLine set to -javaagent:/home/jenkins/jenkins-slave/maven-repositories/0/org/jacoco/org.jacoco.agent/0.7.9/org.jacoco.agent-0.7.9-runtime.jar=destfile=<https://builds.apache.org/job/carbondata-master-spark-2.2/ws/common/target/jacoco.exec>
[INFO] 
[INFO] --- maven-remote-resources-plugin:1.5:process (default) @ carbondata-common ---
[INFO] 
[INFO] --- maven-resources-plugin:2.7:resources (default-resources) @ carbondata-common ---
[INFO] Using 'UTF-8' encoding to copy filtered resources.
[INFO] skip non existing resourceDirectory <https://builds.apache.org/job/carbondata-master-spark-2.2/ws/common/src/main/resources>
[INFO] Copying 3 resources
[INFO] 
[INFO] --- maven-compiler-plugin:3.2:compile (default-compile) @ carbondata-common ---
[INFO] Changes detected - recompiling the module!
[INFO] Compiling 19 source files to <https://builds.apache.org/job/carbondata-master-spark-2.2/ws/common/target/classes>
[INFO] 
[INFO] >>> findbugs-maven-plugin:3.0.4:check (analyze-compile) > :findbugs @ carbondata-common
>>>
[INFO] 
[INFO] --- findbugs-maven-plugin:3.0.4:findbugs (findbugs) @ carbondata-common ---
[INFO] Fork Value is true
[INFO] Done FindBugs Analysis....
[INFO] 
[INFO] <<< findbugs-maven-plugin:3.0.4:check (analyze-compile) < :findbugs @ carbondata-common
<<<
[INFO] 
[INFO] --- findbugs-maven-plugin:3.0.4:check (analyze-compile) @ carbondata-common ---
[INFO] BugInstance size is 0
[INFO] Error size is 0
[INFO] No errors/warnings found
[INFO] 
[INFO] --- maven-resources-plugin:2.7:testResources (default-testResources) @ carbondata-common
---
[INFO] Using 'UTF-8' encoding to copy filtered resources.
[INFO] skip non existing resourceDirectory <https://builds.apache.org/job/carbondata-master-spark-2.2/ws/common/src/test/resources>
[INFO] Copying 3 resources
[INFO] 
[INFO] --- maven-compiler-plugin:3.2:testCompile (default-testCompile) @ carbondata-common
---
[INFO] Changes detected - recompiling the module!
[INFO] Compiling 5 source files to <https://builds.apache.org/job/carbondata-master-spark-2.2/ws/common/target/test-classes>
[INFO] 
[INFO] --- maven-surefire-plugin:2.18.1:test (default-test) @ carbondata-common ---
[JENKINS] Recording test results
[INFO] 
[INFO] --- maven-jar-plugin:2.5:jar (default-jar) @ carbondata-common ---
[INFO] Building jar: <https://builds.apache.org/job/carbondata-master-spark-2.2/ws/common/target/carbondata-common-2.0.0-SNAPSHOT.jar>
[INFO] 
[INFO] --- maven-site-plugin:3.4:attach-descriptor (attach-descriptor) @ carbondata-common
---
[INFO] 
[INFO] --- jacoco-maven-plugin:0.7.9:prepare-agent-integration (default-prepare-agent-integration)
@ carbondata-common ---
[INFO] argLine set to -javaagent:/home/jenkins/jenkins-slave/maven-repositories/0/org/jacoco/org.jacoco.agent/0.7.9/org.jacoco.agent-0.7.9-runtime.jar=destfile=<https://builds.apache.org/job/carbondata-master-spark-2.2/ws/common/target/jacoco-it.exec>
[INFO] 
[INFO] --- maven-checkstyle-plugin:2.17:check (default) @ carbondata-common ---
[INFO] Starting audit...
Audit done.
[INFO] 
[INFO] --- scalastyle-maven-plugin:0.8.0:check (default) @ carbondata-common ---
[WARNING] sourceDirectory is not specified or does not exist value=<https://builds.apache.org/job/carbondata-master-spark-2.2/ws/common/src/main/scala>
Saving to outputFile=<https://builds.apache.org/job/carbondata-master-spark-2.2/ws/common/target/scalastyle-output.xml>
Processed 0 file(s)
Found 0 errors
Found 0 warnings
Found 0 infos
Finished in 1 ms
[INFO] 
[INFO] --- jacoco-maven-plugin:0.7.9:report (default-report) @ carbondata-common ---
[INFO] Skipping JaCoCo execution due to missing execution data file.
[INFO] 
[INFO] --- jacoco-maven-plugin:0.7.9:report-integration (default-report-integration) @ carbondata-common
---
[INFO] Skipping JaCoCo execution due to missing execution data file.
[INFO] 
[INFO] --- jacoco-maven-plugin:0.7.9:check (default-check) @ carbondata-common ---
[INFO] Skipping JaCoCo execution due to missing execution data <https://builds.apache.org/job/carbondata-master-spark-2.2/ws/common/target/jacoco.exec>
[INFO] 
[INFO] --- maven-install-plugin:2.5.2:install (default-install) @ carbondata-common ---
[INFO] Installing <https://builds.apache.org/job/carbondata-master-spark-2.2/ws/common/target/carbondata-common-2.0.0-SNAPSHOT.jar>
to /home/jenkins/jenkins-slave/maven-repositories/0/org/apache/carbondata/carbondata-common/2.0.0-SNAPSHOT/carbondata-common-2.0.0-SNAPSHOT.jar
[INFO] Installing <https://builds.apache.org/job/carbondata-master-spark-2.2/ws/common/pom.xml>
to /home/jenkins/jenkins-slave/maven-repositories/0/org/apache/carbondata/carbondata-common/2.0.0-SNAPSHOT/carbondata-common-2.0.0-SNAPSHOT.pom
[INFO]                                                                         
[INFO] ------------------------------------------------------------------------
[INFO] Building Apache CarbonData :: Core 2.0.0-SNAPSHOT
[INFO] ------------------------------------------------------------------------
[INFO] Downloading: http://repo1.maven.org/maven2/org/apache/carbondata/carbondata-format/2.0.0-SNAPSHOT/maven-metadata.xml
[INFO] Downloading: http://repository.apache.org/snapshots/org/apache/carbondata/carbondata-format/2.0.0-SNAPSHOT/maven-metadata.xml
[INFO] Downloading: http://repo1.maven.org/maven2/org/apache/carbondata/carbondata-format/2.0.0-SNAPSHOT/carbondata-format-2.0.0-SNAPSHOT.pom
[INFO] Downloading: http://repository.apache.org/snapshots/org/apache/carbondata/carbondata-format/2.0.0-SNAPSHOT/carbondata-format-2.0.0-SNAPSHOT.pom
[WARNING] The POM for org.apache.carbondata:carbondata-format:jar:2.0.0-SNAPSHOT is missing,
no dependency information available
[INFO] Downloading: http://repo1.maven.org/maven2/org/apache/carbondata/carbondata-format/2.0.0-SNAPSHOT/carbondata-format-2.0.0-SNAPSHOT.jar
[INFO] Downloading: http://repository.apache.org/snapshots/org/apache/carbondata/carbondata-format/2.0.0-SNAPSHOT/carbondata-format-2.0.0-SNAPSHOT.jar
[INFO]                                                                         
[INFO] ------------------------------------------------------------------------
[INFO] Skipping Apache CarbonData :: Parent
[INFO] This project has been banned from the build due to previous failures.
[INFO] ------------------------------------------------------------------------
[INFO] ------------------------------------------------------------------------
[INFO] Reactor Summary:
[INFO] 
[INFO] Apache CarbonData :: Parent ........................ SUCCESS [ 10.801 s]
[INFO] Apache CarbonData :: Common ........................ SUCCESS [ 15.533 s]
[INFO] Apache CarbonData :: Core .......................... FAILURE [  1.894 s]
[INFO] Apache CarbonData :: Processing .................... SKIPPED
[INFO] Apache CarbonData :: Hadoop ........................ SKIPPED
[INFO] Apache CarbonData :: Hive .......................... SKIPPED
[INFO] Apache CarbonData :: Streaming ..................... SKIPPED
[INFO] Apache CarbonData :: Store SDK ..................... SKIPPED
[INFO] Apache CarbonData :: Spark Datasource .............. SKIPPED
[INFO] Apache CarbonData :: Spark Common .................. SKIPPED
[INFO] Apache CarbonData :: CLI ........................... SKIPPED
[INFO] Apache CarbonData :: Lucene Index DataMap .......... SKIPPED
[INFO] Apache CarbonData :: Bloom Index DataMap ........... SKIPPED
[INFO] Apache CarbonData :: Spark2 ........................ SKIPPED
[INFO] Apache CarbonData :: Spark Common Test ............. SKIPPED
[INFO] Apache CarbonData :: DataMap Examples .............. SKIPPED
[INFO] Apache CarbonData :: Materialized View Plan ........ SKIPPED
[INFO] Apache CarbonData :: Materialized View Core ........ SKIPPED
[INFO] Apache CarbonData :: Assembly ...................... SKIPPED
[INFO] Apache CarbonData :: Examples ...................... SKIPPED
[INFO] Apache CarbonData :: Flink Proxy ................... SKIPPED
[INFO] Apache CarbonData :: Flink ......................... SKIPPED
[INFO] Apache CarbonData :: Presto ........................ SKIPPED
[INFO] Apache CarbonData :: Flink Examples ................ SKIPPED
[INFO] ------------------------------------------------------------------------
[INFO] BUILD FAILURE
[INFO] ------------------------------------------------------------------------
[INFO] Total time: 59.428 s
[INFO] Finished at: 2019-12-03T07:12:19+00:00
[INFO] Final Memory: 64M/1517M
[INFO] ------------------------------------------------------------------------
[ERROR] Failed to execute goal on project carbondata-core: Could not resolve dependencies
for project org.apache.carbondata:carbondata-core:jar:2.0.0-SNAPSHOT: Could not find artifact
org.apache.carbondata:carbondata-format:jar:2.0.0-SNAPSHOT in central (http://repo1.maven.org/maven2)
-> [Help 1]
org.apache.maven.lifecycle.LifecycleExecutionException: Failed to execute goal on project
carbondata-core: Could not resolve dependencies for project org.apache.carbondata:carbondata-core:jar:2.0.0-SNAPSHOT:
Could not find artifact org.apache.carbondata:carbondata-format:jar:2.0.0-SNAPSHOT in central
(http://repo1.maven.org/maven2)
	at org.apache.maven.lifecycle.internal.LifecycleDependencyResolver.getDependencies(LifecycleDependencyResolver.java:221)
	at org.apache.maven.lifecycle.internal.LifecycleDependencyResolver.resolveProjectDependencies(LifecycleDependencyResolver.java:127)
	at org.apache.maven.lifecycle.internal.MojoExecutor.ensureDependenciesAreResolved(MojoExecutor.java:245)
	at org.apache.maven.lifecycle.internal.MojoExecutor.execute(MojoExecutor.java:199)
	at org.apache.maven.lifecycle.internal.MojoExecutor.execute(MojoExecutor.java:153)
	at org.apache.maven.lifecycle.internal.MojoExecutor.execute(MojoExecutor.java:145)
	at org.apache.maven.lifecycle.internal.LifecycleModuleBuilder.buildProject(LifecycleModuleBuilder.java:116)
	at org.apache.maven.lifecycle.internal.LifecycleModuleBuilder.buildProject(LifecycleModuleBuilder.java:80)
	at org.apache.maven.lifecycle.internal.builder.singlethreaded.SingleThreadedBuilder.build(SingleThreadedBuilder.java:51)
	at org.apache.maven.lifecycle.internal.LifecycleStarter.execute(LifecycleStarter.java:128)
	at org.apache.maven.DefaultMaven.doExecute(DefaultMaven.java:307)
	at org.apache.maven.DefaultMaven.doExecute(DefaultMaven.java:193)
	at org.apache.maven.DefaultMaven.execute(DefaultMaven.java:106)
	at org.jvnet.hudson.maven3.launcher.Maven33Launcher.main(Maven33Launcher.java:129)
	at sun.reflect.NativeMethodAccessorImpl.invoke0(Native Method)
	at sun.reflect.NativeMethodAccessorImpl.invoke(NativeMethodAccessorImpl.java:62)
	at sun.reflect.DelegatingMethodAccessorImpl.invoke(DelegatingMethodAccessorImpl.java:43)
	at java.lang.reflect.Method.invoke(Method.java:498)
	at org.codehaus.plexus.classworlds.launcher.Launcher.launchStandard(Launcher.java:330)
	at org.codehaus.plexus.classworlds.launcher.Launcher.launch(Launcher.java:238)
	at jenkins.maven3.agent.Maven33Main.launch(Maven33Main.java:178)
	at sun.reflect.NativeMethodAccessorImpl.invoke0(Native Method)
	at sun.reflect.NativeMethodAccessorImpl.invoke(NativeMethodAccessorImpl.java:62)
	at sun.reflect.DelegatingMethodAccessorImpl.invoke(DelegatingMethodAccessorImpl.java:43)
	at java.lang.reflect.Method.invoke(Method.java:498)
	at hudson.maven.Maven3Builder.call(Maven3Builder.java:139)
	at hudson.maven.Maven3Builder.call(Maven3Builder.java:70)
	at hudson.remoting.UserRequest.perform(UserRequest.java:212)
	at hudson.remoting.UserRequest.perform(UserRequest.java:54)
	at hudson.remoting.Request$2.run(Request.java:369)
	at hudson.remoting.InterceptingExecutorService$1.call(InterceptingExecutorService.java:72)
	at java.util.concurrent.FutureTask.run(FutureTask.java:266)
	at java.util.concurrent.ThreadPoolExecutor.runWorker(ThreadPoolExecutor.java:1149)
	at java.util.concurrent.ThreadPoolExecutor$Worker.run(ThreadPoolExecutor.java:624)
	at java.lang.Thread.run(Thread.java:748)
Caused by: org.apache.maven.project.DependencyResolutionException: Could not resolve dependencies
for project org.apache.carbondata:carbondata-core:jar:2.0.0-SNAPSHOT: Could not find artifact
org.apache.carbondata:carbondata-format:jar:2.0.0-SNAPSHOT in central (http://repo1.maven.org/maven2)
	at org.apache.maven.project.DefaultProjectDependenciesResolver.resolve(DefaultProjectDependenciesResolver.java:211)
	at org.apache.maven.lifecycle.internal.LifecycleDependencyResolver.getDependencies(LifecycleDependencyResolver.java:195)
	... 34 more
Caused by: org.eclipse.aether.resolution.DependencyResolutionException: Could not find artifact
org.apache.carbondata:carbondata-format:jar:2.0.0-SNAPSHOT in central (http://repo1.maven.org/maven2)
	at org.eclipse.aether.internal.impl.DefaultRepositorySystem.resolveDependencies(DefaultRepositorySystem.java:384)
	at org.apache.maven.project.DefaultProjectDependenciesResolver.resolve(DefaultProjectDependenciesResolver.java:205)
	... 35 more
Caused by: org.eclipse.aether.resolution.ArtifactResolutionException: Could not find artifact
org.apache.carbondata:carbondata-format:jar:2.0.0-SNAPSHOT in central (http://repo1.maven.org/maven2)
	at org.eclipse.aether.internal.impl.DefaultArtifactResolver.resolve(DefaultArtifactResolver.java:444)
	at org.eclipse.aether.internal.impl.DefaultArtifactResolver.resolveArtifacts(DefaultArtifactResolver.java:246)
	at org.eclipse.aether.internal.impl.DefaultRepositorySystem.resolveDependencies(DefaultRepositorySystem.java:367)
	... 36 more
Caused by: org.eclipse.aether.transfer.ArtifactNotFoundException: Could not find artifact
org.apache.carbondata:carbondata-format:jar:2.0.0-SNAPSHOT in central (http://repo1.maven.org/maven2)
	at org.eclipse.aether.connector.basic.ArtifactTransportListener.transferFailed(ArtifactTransportListener.java:39)
	at org.eclipse.aether.connector.basic.BasicRepositoryConnector$TaskRunner.run(BasicRepositoryConnector.java:355)
	at org.eclipse.aether.util.concurrency.RunnableErrorForwarder$1.run(RunnableErrorForwarder.java:67)
	at org.eclipse.aether.connector.basic.BasicRepositoryConnector$DirectExecutor.execute(BasicRepositoryConnector.java:581)
	at org.eclipse.aether.connector.basic.BasicRepositoryConnector.get(BasicRepositoryConnector.java:249)
	at org.eclipse.aether.internal.impl.DefaultArtifactResolver.performDownloads(DefaultArtifactResolver.java:520)
	at org.eclipse.aether.internal.impl.DefaultArtifactResolver.resolve(DefaultArtifactResolver.java:421)
	... 38 more
[ERROR] 
[ERROR] Re-run Maven using the -X switch to enable full debug logging.
[ERROR] 
[ERROR] For more information about the errors and possible solutions, please read the following
articles:
[ERROR] [Help 1] http://cwiki.apache.org/confluence/display/MAVEN/DependencyResolutionException
[ERROR] 
[ERROR] After correcting the problems, you can resume the build with the command
[ERROR]   mvn <goals> -rf :carbondata-core
[JENKINS] Archiving <https://builds.apache.org/job/carbondata-master-spark-2.2/ws/processing/pom.xml>
to org.apache.carbondata/carbondata-processing/2.0.0-SNAPSHOT/carbondata-processing-2.0.0-SNAPSHOT.pom
[JENKINS] Archiving <https://builds.apache.org/job/carbondata-master-spark-2.2/ws/datamap/examples/pom.xml>
to org.apache.carbondata/carbondata-datamap-examples/2.0.0-SNAPSHOT/carbondata-datamap-examples-2.0.0-SNAPSHOT.pom
[JENKINS] Archiving <https://builds.apache.org/job/carbondata-master-spark-2.2/ws/datamap/mv/core/pom.xml>
to org.apache.carbondata/carbondata-mv-core/2.0.0-SNAPSHOT/carbondata-mv-core-2.0.0-SNAPSHOT.pom
[JENKINS] Archiving <https://builds.apache.org/job/carbondata-master-spark-2.2/ws/streaming/pom.xml>
to org.apache.carbondata/carbondata-streaming/2.0.0-SNAPSHOT/carbondata-streaming-2.0.0-SNAPSHOT.pom
[JENKINS] Archiving <https://builds.apache.org/job/carbondata-master-spark-2.2/ws/integration/spark-common/pom.xml>
to org.apache.carbondata/carbondata-spark-common/2.0.0-SNAPSHOT/carbondata-spark-common-2.0.0-SNAPSHOT.pom
[JENKINS] Archiving <https://builds.apache.org/job/carbondata-master-spark-2.2/ws/datamap/lucene/pom.xml>
to org.apache.carbondata/carbondata-lucene/2.0.0-SNAPSHOT/carbondata-lucene-2.0.0-SNAPSHOT.pom
[JENKINS] Archiving <https://builds.apache.org/job/carbondata-master-spark-2.2/ws/examples/spark2/pom.xml>
to org.apache.carbondata/carbondata-examples/2.0.0-SNAPSHOT/carbondata-examples-2.0.0-SNAPSHOT.pom
[JENKINS] Archiving <https://builds.apache.org/job/carbondata-master-spark-2.2/ws/integration/hive/pom.xml>
to org.apache.carbondata/carbondata-hive/2.0.0-SNAPSHOT/carbondata-hive-2.0.0-SNAPSHOT.pom
[JENKINS] Archiving <https://builds.apache.org/job/carbondata-master-spark-2.2/ws/common/pom.xml>
to org.apache.carbondata/carbondata-common/2.0.0-SNAPSHOT/carbondata-common-2.0.0-SNAPSHOT.pom
[JENKINS] Archiving <https://builds.apache.org/job/carbondata-master-spark-2.2/ws/common/target/carbondata-common-2.0.0-SNAPSHOT.jar>
to org.apache.carbondata/carbondata-common/2.0.0-SNAPSHOT/carbondata-common-2.0.0-SNAPSHOT.jar
[JENKINS] Archiving <https://builds.apache.org/job/carbondata-master-spark-2.2/ws/datamap/mv/plan/pom.xml>
to org.apache.carbondata/carbondata-mv-plan/2.0.0-SNAPSHOT/carbondata-mv-plan-2.0.0-SNAPSHOT.pom
[JENKINS] Archiving <https://builds.apache.org/job/carbondata-master-spark-2.2/ws/integration/flink-proxy/pom.xml>
to org.apache.carbondata/carbondata-flink-proxy/2.0.0-SNAPSHOT/carbondata-flink-proxy-2.0.0-SNAPSHOT.pom
[Fast Archiver] No prior successful build to compare, so performing full copy of artifacts
[JENKINS] Archiving <https://builds.apache.org/job/carbondata-master-spark-2.2/ws/integration/spark2/pom.xml>
to org.apache.carbondata/carbondata-spark2/2.0.0-SNAPSHOT/carbondata-spark2-2.0.0-SNAPSHOT.pom
[JENKINS] Archiving <https://builds.apache.org/job/carbondata-master-spark-2.2/ws/integration/flink/pom.xml>
to org.apache.carbondata/carbondata-flink/2.0.0-SNAPSHOT/carbondata-flink-2.0.0-SNAPSHOT.pom
[Fast Archiver] No prior successful build to compare, so performing full copy of artifacts
[JENKINS] Archiving <https://builds.apache.org/job/carbondata-master-spark-2.2/ws/tools/cli/pom.xml>
to org.apache.carbondata/carbondata-cli/2.0.0-SNAPSHOT/carbondata-cli-2.0.0-SNAPSHOT.pom
[JENKINS] Archiving <https://builds.apache.org/job/carbondata-master-spark-2.2/ws/datamap/bloom/pom.xml>
to org.apache.carbondata/carbondata-bloom/2.0.0-SNAPSHOT/carbondata-bloom-2.0.0-SNAPSHOT.pom
[JENKINS] Archiving <https://builds.apache.org/job/carbondata-master-spark-2.2/ws/assembly/pom.xml>
to org.apache.carbondata/carbondata-assembly/2.0.0-SNAPSHOT/carbondata-assembly-2.0.0-SNAPSHOT.pom
[JENKINS] Archiving <https://builds.apache.org/job/carbondata-master-spark-2.2/ws/pom.xml>
to org.apache.carbondata/carbondata-parent/2.0.0-SNAPSHOT/carbondata-parent-2.0.0-SNAPSHOT.pom
[JENKINS] Archiving <https://builds.apache.org/job/carbondata-master-spark-2.2/ws/examples/flink/pom.xml>
to org.apache.carbondata/carbondata-examples-flink/2.0.0-SNAPSHOT/carbondata-examples-flink-2.0.0-SNAPSHOT.pom
[JENKINS] Archiving <https://builds.apache.org/job/carbondata-master-spark-2.2/ws/core/pom.xml>
to org.apache.carbondata/carbondata-core/2.0.0-SNAPSHOT/carbondata-core-2.0.0-SNAPSHOT.pom
[JENKINS] Archiving <https://builds.apache.org/job/carbondata-master-spark-2.2/ws/hadoop/pom.xml>
to org.apache.carbondata/carbondata-hadoop/2.0.0-SNAPSHOT/carbondata-hadoop-2.0.0-SNAPSHOT.pom
[JENKINS] Archiving <https://builds.apache.org/job/carbondata-master-spark-2.2/ws/integration/spark-datasource/pom.xml>
to org.apache.carbondata/carbondata-spark-datasource/2.0.0-SNAPSHOT/carbondata-spark-datasource-2.0.0-SNAPSHOT.pom
[JENKINS] Archiving <https://builds.apache.org/job/carbondata-master-spark-2.2/ws/integration/presto/pom.xml>
to org.apache.carbondata/carbondata-presto/2.0.0-SNAPSHOT/carbondata-presto-2.0.0-SNAPSHOT.pom
[JENKINS] Archiving <https://builds.apache.org/job/carbondata-master-spark-2.2/ws/integration/spark-common-test/pom.xml>
to org.apache.carbondata/carbondata-spark-common-test/2.0.0-SNAPSHOT/carbondata-spark-common-test-2.0.0-SNAPSHOT.pom
[JENKINS] Archiving <https://builds.apache.org/job/carbondata-master-spark-2.2/ws/store/sdk/pom.xml>
to org.apache.carbondata/carbondata-store-sdk/2.0.0-SNAPSHOT/carbondata-store-sdk-2.0.0-SNAPSHOT.pom
No mail will be sent out, as 'carbondata-master-spark-2.2 » Apache CarbonData :: Processing
#2105' does not have a result yet. Please make sure you set a proper result in case of pipeline/build
scripts.
No mail will be sent out, as 'carbondata-master-spark-2.2 » Apache CarbonData :: Materialized
View Core #2105' does not have a result yet. Please make sure you set a proper result in case
of pipeline/build scripts.
No mail will be sent out, as 'carbondata-master-spark-2.2 » Apache CarbonData :: Streaming
#2105' does not have a result yet. Please make sure you set a proper result in case of pipeline/build
scripts.
No mail will be sent out, as 'carbondata-master-spark-2.2 » Apache CarbonData :: Spark
Common #2105' does not have a result yet. Please make sure you set a proper result in case
of pipeline/build scripts.
No mail will be sent out, as 'carbondata-master-spark-2.2 » Apache CarbonData :: Lucene
Index DataMap #2105' does not have a result yet. Please make sure you set a proper result
in case of pipeline/build scripts.
No mail will be sent out, as 'carbondata-master-spark-2.2 » Apache CarbonData :: Examples
#2105' does not have a result yet. Please make sure you set a proper result in case of pipeline/build
scripts.
No mail will be sent out, as 'carbondata-master-spark-2.2 » Apache CarbonData :: Common
#2105' does not have a result yet. Please make sure you set a proper result in case of pipeline/build
scripts.
No mail will be sent out, as 'carbondata-master-spark-2.2 » Apache CarbonData :: Materialized
View Plan #2105' does not have a result yet. Please make sure you set a proper result in case
of pipeline/build scripts.
No mail will be sent out, as 'carbondata-master-spark-2.2 » Apache CarbonData :: Flink
Proxy #2105' does not have a result yet. Please make sure you set a proper result in case
of pipeline/build scripts.
No mail will be sent out, as 'carbondata-master-spark-2.2 » Apache CarbonData :: CLI #2105'
does not have a result yet. Please make sure you set a proper result in case of pipeline/build
scripts.
No mail will be sent out, as 'carbondata-master-spark-2.2 » Apache CarbonData :: Parent
#2105' does not have a result yet. Please make sure you set a proper result in case of pipeline/build
scripts.
No mail will be sent out, as 'carbondata-master-spark-2.2 » Apache CarbonData :: Hadoop
#2105' does not have a result yet. Please make sure you set a proper result in case of pipeline/build
scripts.
No mail will be sent out, as 'carbondata-master-spark-2.2 » Apache CarbonData :: DataMap
Examples #2105' does not have a result yet. Please make sure you set a proper result in case
of pipeline/build scripts.
No mail will be sent out, as 'carbondata-master-spark-2.2 » Apache CarbonData :: Hive #2105'
does not have a result yet. Please make sure you set a proper result in case of pipeline/build
scripts.
No mail will be sent out, as 'carbondata-master-spark-2.2 » Apache CarbonData :: Spark2
#2105' does not have a result yet. Please make sure you set a proper result in case of pipeline/build
scripts.
No mail will be sent out, as 'carbondata-master-spark-2.2 » Apache CarbonData :: Flink
#2105' does not have a result yet. Please make sure you set a proper result in case of pipeline/build
scripts.
No mail will be sent out, as 'carbondata-master-spark-2.2 » Apache CarbonData :: Bloom
Index DataMap #2105' does not have a result yet. Please make sure you set a proper result
in case of pipeline/build scripts.
No mail will be sent out, as 'carbondata-master-spark-2.2 » Apache CarbonData :: Assembly
#2105' does not have a result yet. Please make sure you set a proper result in case of pipeline/build
scripts.
No mail will be sent out, as 'carbondata-master-spark-2.2 » Apache CarbonData :: Flink
Examples #2105' does not have a result yet. Please make sure you set a proper result in case
of pipeline/build scripts.
Not sending mail to unregistered user 441586683@qq.com
Not sending mail to unregistered user jacky.likun@qq.com
Sending e-mails to: commits@carbondata.apache.org
No mail will be sent out, as 'carbondata-master-spark-2.2 » Apache CarbonData :: Spark
Datasource #2105' does not have a result yet. Please make sure you set a proper result in
case of pipeline/build scripts.
No mail will be sent out, as 'carbondata-master-spark-2.2 » Apache CarbonData :: Presto
#2105' does not have a result yet. Please make sure you set a proper result in case of pipeline/build
scripts.
No mail will be sent out, as 'carbondata-master-spark-2.2 » Apache CarbonData :: Spark
Common Test #2105' does not have a result yet. Please make sure you set a proper result in
case of pipeline/build scripts.
No mail will be sent out, as 'carbondata-master-spark-2.2 » Apache CarbonData :: Store
SDK #2105' does not have a result yet. Please make sure you set a proper result in case of
pipeline/build scripts.
channel stopped
Not sending mail to unregistered user 441586683@qq.com
Not sending mail to unregistered user ajanthabhat@gmail.com
Not sending mail to unregistered user carbondatacontributions@gmail.com
Not sending mail to unregistered user jacky.likun@qq.com
Not sending mail to unregistered user kunalkapoor642@gmail.com
Not sending mail to unregistered user vikramahuja8803@gmail.com

Mime
View raw message