cayenne-commits mailing list archives

Site index · List index
Message view « Date » · « Thread »
Top « Date » · « Thread »
From Apache Hudson Server <hud...@hudson.zones.apache.org>
Subject Build failed in Hudson: Cayenne-30 » JDK 1.5 (latest),Ubuntu #84
Date Fri, 25 Jun 2010 03:12:39 GMT
See <http://hudson.zones.apache.org/hudson/job/Cayenne-30/./jdk=JDK%201.5%20(latest),label=Ubuntu/84/>

------------------------------------------
[...truncated 71868 lines...]
Results :

Tests run: 2130, Failures: 0, Errors: 0, Skipped: 0

[INFO] [jar:jar {execution: default-jar}]
[INFO] Building jar: <http://hudson.zones.apache.org/hudson/job/Cayenne-30/./jdk=JDK%201.5%20(latest),label=Ubuntu/ws/STABLE-3.0/framework/cayenne-jdk1.5-unpublished/target/cayenne-jdk1.5-unpublished-3.0-SNAPSHOT.jar>
[INFO] Preparing source:jar
[WARNING] Removing: jar from forked lifecycle, to prevent recursive invocation.
[INFO] [cayenne-build:date {execution: date}]
[INFO] [javacc:jjtree {execution: jjtree-ejbql}]
[WARNING] This goal has been deprecated. Please update your plugin configuration.
[INFO] Skipping - all parsers are up to date
[INFO] [javacc:javacc {execution: javacc-ejbql}]
[INFO] Skipping - all parsers are up to date
[INFO] [source:jar {execution: bundle-source-jar}]
[INFO] Building jar: <http://hudson.zones.apache.org/hudson/job/Cayenne-30/./jdk=JDK%201.5%20(latest),label=Ubuntu/ws/STABLE-3.0/framework/cayenne-jdk1.5-unpublished/target/cayenne-jdk1.5-unpublished-3.0-SNAPSHOT-sources.jar>
[INFO] [jar:test-jar {execution: default}]
[INFO] Building jar: <http://hudson.zones.apache.org/hudson/job/Cayenne-30/./jdk=JDK%201.5%20(latest),label=Ubuntu/ws/STABLE-3.0/framework/cayenne-jdk1.5-unpublished/target/cayenne-jdk1.5-unpublished-3.0-SNAPSHOT-tests.jar>
[INFO] [install:install {execution: default-install}]
[INFO] Installing <http://hudson.zones.apache.org/hudson/job/Cayenne-30/./jdk=JDK%201.5%20(latest),label=Ubuntu/ws/STABLE-3.0/framework/cayenne-jdk1.5-unpublished/target/cayenne-jdk1.5-unpublished-3.0-SNAPSHOT.jar>
to /home/hudson/.m2/repository/org/apache/cayenne/unpublished/cayenne-jdk1.5-unpublished/3.0-SNAPSHOT/cayenne-jdk1.5-unpublished-3.0-SNAPSHOT.jar
[INFO] Installing <http://hudson.zones.apache.org/hudson/job/Cayenne-30/./jdk=JDK%201.5%20(latest),label=Ubuntu/ws/STABLE-3.0/framework/cayenne-jdk1.5-unpublished/target/cayenne-jdk1.5-unpublished-3.0-SNAPSHOT-sources.jar>
to /home/hudson/.m2/repository/org/apache/cayenne/unpublished/cayenne-jdk1.5-unpublished/3.0-SNAPSHOT/cayenne-jdk1.5-unpublished-3.0-SNAPSHOT-sources.jar
[INFO] Installing <http://hudson.zones.apache.org/hudson/job/Cayenne-30/./jdk=JDK%201.5%20(latest),label=Ubuntu/ws/STABLE-3.0/framework/cayenne-jdk1.5-unpublished/target/cayenne-jdk1.5-unpublished-3.0-SNAPSHOT-tests.jar>
to /home/hudson/.m2/repository/org/apache/cayenne/unpublished/cayenne-jdk1.5-unpublished/3.0-SNAPSHOT/cayenne-jdk1.5-unpublished-3.0-SNAPSHOT-tests.jar
[INFO] ------------------------------------------------------------------------
[INFO] Building Cayenne JPA Unpublished
[INFO]    task-segment: [clean, install]
[INFO] ------------------------------------------------------------------------
[INFO] [clean:clean {execution: default-clean}]
[INFO] Deleting directory <http://hudson.zones.apache.org/hudson/job/Cayenne-30/./jdk=JDK%201.5%20(latest),label=Ubuntu/ws/STABLE-3.0/framework/cayenne-jpa-unpublished/target>
[INFO] [resources:resources {execution: default-resources}]
[WARNING] Using platform encoding (UTF-8 actually) to copy filtered resources, i.e. build
is platform dependent!
[INFO] Copying 4 resources
[INFO] [compiler:compile {execution: default-compile}]
[INFO] Compiling 106 source files to <http://hudson.zones.apache.org/hudson/job/Cayenne-30/./jdk=JDK%201.5%20(latest),label=Ubuntu/ws/STABLE-3.0/framework/cayenne-jpa-unpublished/target/classes>
[INFO] [resources:testResources {execution: default-testResources}]
[WARNING] Using platform encoding (UTF-8 actually) to copy filtered resources, i.e. build
is platform dependent!
[INFO] Copying 9 resources
[INFO] [compiler:testCompile {execution: default-testCompile}]
[INFO] Compiling 77 source files to <http://hudson.zones.apache.org/hudson/job/Cayenne-30/./jdk=JDK%201.5%20(latest),label=Ubuntu/ws/STABLE-3.0/framework/cayenne-jpa-unpublished/target/test-classes>
[INFO] [surefire:test {execution: default-test}]
[INFO] Surefire report directory: <http://hudson.zones.apache.org/hudson/job/Cayenne-30/./jdk=JDK%201.5%20(latest),label=Ubuntu/ws/STABLE-3.0/framework/cayenne-jpa-unpublished/target/surefire-reports>

-------------------------------------------------------
 T E S T S
-------------------------------------------------------
Running org.apache.cayenne.jpa.ResourceLocalEntityManagerFactoryTest
Tests run: 1, Failures: 0, Errors: 0, Skipped: 0, Time elapsed: 0.025 sec
Running org.apache.cayenne.jpa.map.JpaRelationshipTest
Tests run: 1, Failures: 0, Errors: 0, Skipped: 0, Time elapsed: 0.008 sec
Running org.apache.cayenne.jpa.TestPersistenceProvider2
Tests run: 0, Failures: 0, Errors: 0, Skipped: 0, Time elapsed: 0.004 sec
Running org.apache.cayenne.jpa.conf.EntityMapDefaultsProcessor1Test
Tests run: 2, Failures: 0, Errors: 0, Skipped: 0, Time elapsed: 0.11 sec
Running org.apache.cayenne.jpa.ResourceLocalEntityManagerTest
Tests run: 3, Failures: 0, Errors: 0, Skipped: 0, Time elapsed: 0.012 sec
Running org.apache.cayenne.jpa.TestManagedClass
Tests run: 0, Failures: 0, Errors: 0, Skipped: 0, Time elapsed: 0.003 sec
Running org.apache.cayenne.jpa.conf.EntityMapXMLLoaderTest
Tests run: 2, Failures: 0, Errors: 0, Skipped: 0, Time elapsed: 0.392 sec
Running org.apache.cayenne.jpa.conf.ClassAnnotationProcessorFactoryTest
Tests run: 1, Failures: 0, Errors: 0, Skipped: 0, Time elapsed: 0.003 sec
Running org.apache.cayenne.jpa.conf.UnitDescriptorParserTest
Tests run: 7, Failures: 0, Errors: 0, Skipped: 0, Time elapsed: 0.038 sec
Running org.apache.cayenne.jpa.conf.AnnotationProcessorFactoryTest
Tests run: 2, Failures: 0, Errors: 0, Skipped: 0, Time elapsed: 0.004 sec
Running org.apache.cayenne.jpa.map.JpaColumnTest
Tests run: 1, Failures: 0, Errors: 0, Skipped: 0, Time elapsed: 0.003 sec
Running org.apache.cayenne.jpa.map.JpaClassDescriptorTest
Tests run: 4, Failures: 0, Errors: 0, Skipped: 0, Time elapsed: 0.015 sec
Running org.apache.cayenne.jpa.ProviderTest
Jun 25, 2010 3:10:59 AM org.apache.cayenne.jpa.Provider createEntityManagerFactory
INFO: Extra PersistenceUnitInfo properties: {}
Jun 25, 2010 3:10:59 AM org.apache.cayenne.jpa.Provider createContainerEntityManagerFactory
WARNING: NULL JTA DataSource returned from PersistenceUnitInfo
Jun 25, 2010 3:10:59 AM org.apache.cayenne.jpa.Provider createContainerEntityManagerFactory
INFO: Extra container PersistenceUnitInfo properties: {}
Jun 25, 2010 3:10:59 AM org.apache.cayenne.jpa.Provider createContainerEntityManagerFactory
WARNING: NULL JTA DataSource returned from PersistenceUnitInfo
Jun 25, 2010 3:10:59 AM org.apache.cayenne.jpa.Provider createContainerEntityManagerFactory
INFO: Extra container PersistenceUnitInfo properties: {}
Jun 25, 2010 3:10:59 AM org.apache.cayenne.jpa.Provider createContainerEntityManagerFactory
WARNING: NULL non-JTA DataSource returned from PersistenceUnitInfo
Jun 25, 2010 3:10:59 AM org.apache.cayenne.jpa.Provider createContainerEntityManagerFactory
INFO: Extra container PersistenceUnitInfo properties: {javax.persistence.transactionType=RESOURCE_LOCAL}
Jun 25, 2010 3:10:59 AM org.apache.cayenne.jpa.Provider createContainerEntityManagerFactory
WARNING: NULL non-JTA DataSource returned from PersistenceUnitInfo
Jun 25, 2010 3:10:59 AM org.apache.cayenne.jpa.Provider createContainerEntityManagerFactory
INFO: Extra container PersistenceUnitInfo properties: {javax.persistence.transactionType=JTA}
Jun 25, 2010 3:10:59 AM org.apache.cayenne.jpa.Provider createContainerEntityManagerFactory
WARNING: NULL JTA DataSource returned from PersistenceUnitInfo
Tests run: 2, Failures: 0, Errors: 0, Skipped: 0, Time elapsed: 0.136 sec
Running org.apache.cayenne.jpa.map.EntityMapTraversalTest
Tests run: 1, Failures: 0, Errors: 0, Skipped: 0, Time elapsed: 0.004 sec
Running org.apache.cayenne.jpa.bridge.DataMapConverterTest
Tests run: 8, Failures: 0, Errors: 0, Skipped: 0, Time elapsed: 0.091 sec
Running org.apache.cayenne.jpa.JpaUnitTest
Tests run: 3, Failures: 0, Errors: 0, Skipped: 0, Time elapsed: 0.008 sec
Running org.apache.cayenne.jpa.conf.EntityMapDefaultsProcessorTest
Tests run: 6, Failures: 0, Errors: 0, Skipped: 0, Time elapsed: 0.016 sec
Running org.apache.cayenne.util.BaseTreeVisitorTest
Tests run: 1, Failures: 0, Errors: 0, Skipped: 0, Time elapsed: 0.004 sec
Running org.apache.cayenne.jpa.bridge.QueryHintsTest
Tests run: 1, Failures: 0, Errors: 0, Skipped: 0, Time elapsed: 0.003 sec
Running org.apache.cayenne.jpa.TestPersistenceProvider1
Tests run: 0, Failures: 0, Errors: 0, Skipped: 0, Time elapsed: 0.002 sec
Running org.apache.cayenne.jpa.bridge.DataMapConverterRelationshipsTest
Tests run: 2, Failures: 0, Errors: 0, Skipped: 0, Time elapsed: 0.014 sec
Running org.apache.cayenne.jpa.map.JpaTableTest
Tests run: 1, Failures: 0, Errors: 0, Skipped: 0, Time elapsed: 0.002 sec
Running org.apache.cayenne.jpa.conf.EntityMapAnnotationLoaderTest
Tests run: 4, Failures: 0, Errors: 0, Skipped: 0, Time elapsed: 0.13 sec
Running org.apache.cayenne.jpa.JpaNativeQueryTest
Tests run: 2, Failures: 0, Errors: 0, Skipped: 0, Time elapsed: 0.018 sec

Results :

Tests run: 55, Failures: 0, Errors: 0, Skipped: 0

[INFO] [jar:jar {execution: default-jar}]
[INFO] Building jar: <http://hudson.zones.apache.org/hudson/job/Cayenne-30/./jdk=JDK%201.5%20(latest),label=Ubuntu/ws/STABLE-3.0/framework/cayenne-jpa-unpublished/target/cayenne-jpa-unpublished-3.0-SNAPSHOT.jar>
[INFO] Preparing source:jar
[WARNING] Removing: jar from forked lifecycle, to prevent recursive invocation.
[INFO] No goals needed for project - skipping
[INFO] [source:jar {execution: bundle-source-jar}]
[INFO] Building jar: <http://hudson.zones.apache.org/hudson/job/Cayenne-30/./jdk=JDK%201.5%20(latest),label=Ubuntu/ws/STABLE-3.0/framework/cayenne-jpa-unpublished/target/cayenne-jpa-unpublished-3.0-SNAPSHOT-sources.jar>
[INFO] [install:install {execution: default-install}]
[INFO] Installing <http://hudson.zones.apache.org/hudson/job/Cayenne-30/./jdk=JDK%201.5%20(latest),label=Ubuntu/ws/STABLE-3.0/framework/cayenne-jpa-unpublished/target/cayenne-jpa-unpublished-3.0-SNAPSHOT.jar>
to /home/hudson/.m2/repository/org/apache/cayenne/unpublished/cayenne-jpa-unpublished/3.0-SNAPSHOT/cayenne-jpa-unpublished-3.0-SNAPSHOT.jar
[INFO] Installing <http://hudson.zones.apache.org/hudson/job/Cayenne-30/./jdk=JDK%201.5%20(latest),label=Ubuntu/ws/STABLE-3.0/framework/cayenne-jpa-unpublished/target/cayenne-jpa-unpublished-3.0-SNAPSHOT-sources.jar>
to /home/hudson/.m2/repository/org/apache/cayenne/unpublished/cayenne-jpa-unpublished/3.0-SNAPSHOT/cayenne-jpa-unpublished-3.0-SNAPSHOT-sources.jar
[INFO] ------------------------------------------------------------------------
[INFO] Building Cayenne Enhancer Bootstrap Agent
[INFO]    task-segment: [clean, install]
[INFO] ------------------------------------------------------------------------
[INFO] [clean:clean {execution: default-clean}]
[INFO] Deleting directory <http://hudson.zones.apache.org/hudson/job/Cayenne-30/./jdk=JDK%201.5%20(latest),label=Ubuntu/ws/STABLE-3.0/framework/cayenne-agent/target>
[INFO] [resources:resources {execution: default-resources}]
[WARNING] Using platform encoding (UTF-8 actually) to copy filtered resources, i.e. build
is platform dependent!
[INFO] Copying 1 resource
[INFO] Setting property: classpath.resource.loader.class => 'org.codehaus.plexus.velocity.ContextClassLoaderResourceLoader'.
[INFO] Setting property: velocimacro.messages.on => 'false'.
[INFO] Setting property: resource.loader => 'classpath'.
[INFO] Setting property: resource.manager.logwhenfound => 'false'.
[INFO] [remote-resources:process {execution: default}]
[INFO] [compiler:compile {execution: default-compile}]
[INFO] Compiling 2 source files to <http://hudson.zones.apache.org/hudson/job/Cayenne-30/./jdk=JDK%201.5%20(latest),label=Ubuntu/ws/STABLE-3.0/framework/cayenne-agent/target/classes>
[INFO] [resources:testResources {execution: default-testResources}]
[WARNING] Using platform encoding (UTF-8 actually) to copy filtered resources, i.e. build
is platform dependent!
[INFO] skip non existing resourceDirectory <http://hudson.zones.apache.org/hudson/job/Cayenne-30/./jdk=JDK%201.5%20(latest),label=Ubuntu/ws/STABLE-3.0/framework/cayenne-agent/src/test/resources>
[INFO] Copying 7 resources
[INFO] [compiler:testCompile {execution: default-testCompile}]
[INFO] No sources to compile
[INFO] [surefire:test {execution: default-test}]
[INFO] Surefire report directory: <http://hudson.zones.apache.org/hudson/job/Cayenne-30/./jdk=JDK%201.5%20(latest),label=Ubuntu/ws/STABLE-3.0/framework/cayenne-agent/target/surefire-reports>

-------------------------------------------------------
 T E S T S
-------------------------------------------------------
There are no tests to run.

Results :

Tests run: 0, Failures: 0, Errors: 0, Skipped: 0

[INFO] [jar:jar {execution: default-jar}]
[INFO] Building jar: <http://hudson.zones.apache.org/hudson/job/Cayenne-30/./jdk=JDK%201.5%20(latest),label=Ubuntu/ws/STABLE-3.0/framework/cayenne-agent/target/cayenne-agent-3.0-SNAPSHOT.jar>
[INFO] Preparing source:jar
[WARNING] Removing: jar from forked lifecycle, to prevent recursive invocation.
[INFO] No goals needed for project - skipping
[INFO] [source:jar {execution: bundle-source-jar}]
[INFO] Building jar: <http://hudson.zones.apache.org/hudson/job/Cayenne-30/./jdk=JDK%201.5%20(latest),label=Ubuntu/ws/STABLE-3.0/framework/cayenne-agent/target/cayenne-agent-3.0-SNAPSHOT-sources.jar>
[INFO] [install:install {execution: default-install}]
[INFO] Installing <http://hudson.zones.apache.org/hudson/job/Cayenne-30/./jdk=JDK%201.5%20(latest),label=Ubuntu/ws/STABLE-3.0/framework/cayenne-agent/target/cayenne-agent-3.0-SNAPSHOT.jar>
to /home/hudson/.m2/repository/org/apache/cayenne/cayenne-agent/3.0-SNAPSHOT/cayenne-agent-3.0-SNAPSHOT.jar
[INFO] Installing <http://hudson.zones.apache.org/hudson/job/Cayenne-30/./jdk=JDK%201.5%20(latest),label=Ubuntu/ws/STABLE-3.0/framework/cayenne-agent/target/cayenne-agent-3.0-SNAPSHOT-sources.jar>
to /home/hudson/.m2/repository/org/apache/cayenne/cayenne-agent/3.0-SNAPSHOT/cayenne-agent-3.0-SNAPSHOT-sources.jar
[INFO] ------------------------------------------------------------------------
[INFO] Building Cayenne Aggregated Server Jar
[INFO]    task-segment: [clean, install]
[INFO] ------------------------------------------------------------------------
[INFO] [clean:clean {execution: default-clean}]
[INFO] Deleting directory <http://hudson.zones.apache.org/hudson/job/Cayenne-30/./jdk=JDK%201.5%20(latest),label=Ubuntu/ws/STABLE-3.0/framework/cayenne-server/target>
[INFO] [resources:resources {execution: default-resources}]
[WARNING] Using platform encoding (UTF-8 actually) to copy filtered resources, i.e. build
is platform dependent!
[INFO] skip non existing resourceDirectory <http://hudson.zones.apache.org/hudson/job/Cayenne-30/./jdk=JDK%201.5%20(latest),label=Ubuntu/ws/STABLE-3.0/framework/cayenne-server/src/main/resources>
[INFO] [compiler:compile {execution: default-compile}]
[INFO] No sources to compile
[INFO] [resources:testResources {execution: default-testResources}]
[WARNING] Using platform encoding (UTF-8 actually) to copy filtered resources, i.e. build
is platform dependent!
[INFO] skip non existing resourceDirectory <http://hudson.zones.apache.org/hudson/job/Cayenne-30/./jdk=JDK%201.5%20(latest),label=Ubuntu/ws/STABLE-3.0/framework/cayenne-server/src/test/resources>
[INFO] [compiler:testCompile {execution: default-testCompile}]
[INFO] No sources to compile
[INFO] [surefire:test {execution: default-test}]
[INFO] No tests to run.
[INFO] [jar:jar {execution: default-jar}]
[WARNING] JAR will be empty - no content was marked for inclusion!
[INFO] Building jar: <http://hudson.zones.apache.org/hudson/job/Cayenne-30/./jdk=JDK%201.5%20(latest),label=Ubuntu/ws/STABLE-3.0/framework/cayenne-server/target/cayenne-server-3.0-SNAPSHOT.jar>
[INFO] [cayenne-build:aggregate-bin {execution: aggregate-all}]
[INFO] Expanding: /home/hudson/.m2/repository/org/apache/cayenne/unpublished/cayenne-jdk1.5-unpublished/3.0-SNAPSHOT/cayenne-jdk1.5-unpublished-3.0-SNAPSHOT.jar
into <http://hudson.zones.apache.org/hudson/job/Cayenne-30/./jdk=JDK%201.5%20(latest),label=Ubuntu/ws/STABLE-3.0/framework/cayenne-server/target/aggregate/unpack-bin>
[INFO] Expanding: /home/hudson/.m2/repository/org/apache/cayenne/unpublished/cayenne-legal-unpublished/3.0-SNAPSHOT/cayenne-legal-unpublished-3.0-SNAPSHOT.jar
into <http://hudson.zones.apache.org/hudson/job/Cayenne-30/./jdk=JDK%201.5%20(latest),label=Ubuntu/ws/STABLE-3.0/framework/cayenne-server/target/aggregate/unpack-bin>
[INFO] ------------------------------------------------------------------------
[ERROR] BUILD ERROR
[INFO] ------------------------------------------------------------------------
[INFO] Error unpacking file: /home/hudson/.m2/repository/org/apache/cayenne/unpublished/cayenne-legal-unpublished/3.0-SNAPSHOT/cayenne-legal-unpublished-3.0-SNAPSHOT.jarto:
<http://hudson.zones.apache.org/hudson/job/Cayenne-30/./jdk=JDK%201.5%20(latest),label=Ubuntu/ws/STABLE-3.0/framework/cayenne-server/target/aggregate/unpack-bin>

Embedded error: Error while expanding /home/hudson/.m2/repository/org/apache/cayenne/unpublished/cayenne-legal-unpublished/3.0-SNAPSHOT/cayenne-legal-unpublished-3.0-SNAPSHOT.jar
Unexpected end of ZLIB input stream
[INFO] ------------------------------------------------------------------------
[INFO] Trace
org.apache.maven.lifecycle.LifecycleExecutionException: Error unpacking file: /home/hudson/.m2/repository/org/apache/cayenne/unpublished/cayenne-legal-unpublished/3.0-SNAPSHOT/cayenne-legal-unpublished-3.0-SNAPSHOT.jarto:
<http://hudson.zones.apache.org/hudson/job/Cayenne-30/./jdk=JDK%201.5%20(latest),label=Ubuntu/ws/STABLE-3.0/framework/cayenne-server/target/aggregate/unpack-bin>
	at org.apache.maven.lifecycle.DefaultLifecycleExecutor.executeGoals(DefaultLifecycleExecutor.java:719)
	at org.apache.maven.lifecycle.DefaultLifecycleExecutor.executeGoalWithLifecycle(DefaultLifecycleExecutor.java:556)
	at org.apache.maven.lifecycle.DefaultLifecycleExecutor.executeGoal(DefaultLifecycleExecutor.java:535)
	at org.apache.maven.lifecycle.DefaultLifecycleExecutor.executeGoalAndHandleFailures(DefaultLifecycleExecutor.java:387)
	at org.apache.maven.lifecycle.DefaultLifecycleExecutor.executeTaskSegments(DefaultLifecycleExecutor.java:348)
	at org.apache.maven.lifecycle.DefaultLifecycleExecutor.execute(DefaultLifecycleExecutor.java:180)
	at org.apache.maven.DefaultMaven.doExecute(DefaultMaven.java:328)
	at org.apache.maven.DefaultMaven.execute(DefaultMaven.java:138)
	at org.apache.maven.cli.MavenCli.main(MavenCli.java:362)
	at org.apache.maven.cli.compat.CompatibleMain.main(CompatibleMain.java:60)
	at sun.reflect.NativeMethodAccessorImpl.invoke0(Native Method)
	at sun.reflect.NativeMethodAccessorImpl.invoke(NativeMethodAccessorImpl.java:39)
	at sun.reflect.DelegatingMethodAccessorImpl.invoke(DelegatingMethodAccessorImpl.java:25)
	at java.lang.reflect.Method.invoke(Method.java:592)
	at org.codehaus.classworlds.Launcher.launchEnhanced(Launcher.java:315)
	at org.codehaus.classworlds.Launcher.launch(Launcher.java:255)
	at org.codehaus.classworlds.Launcher.mainWithExitCode(Launcher.java:430)
	at org.codehaus.classworlds.Launcher.main(Launcher.java:375)
Caused by: org.apache.maven.plugin.MojoExecutionException: Error unpacking file: /home/hudson/.m2/repository/org/apache/cayenne/unpublished/cayenne-legal-unpublished/3.0-SNAPSHOT/cayenne-legal-unpublished-3.0-SNAPSHOT.jarto:
<http://hudson.zones.apache.org/hudson/job/Cayenne-30/./jdk=JDK%201.5%20(latest),label=Ubuntu/ws/STABLE-3.0/framework/cayenne-server/target/aggregate/unpack-bin>
	at org.apache.cayenne.maven.plugin.aggregator.AbstractAggregatorMojo.unpackArtifact(AbstractAggregatorMojo.java:342)
	at org.apache.cayenne.maven.plugin.aggregator.AbstractAggregatorMojo.unpackArtifacts(AbstractAggregatorMojo.java:170)
	at org.apache.cayenne.maven.plugin.aggregator.BinAggregatorMojo.execute(BinAggregatorMojo.java:44)
	at org.apache.maven.plugin.DefaultPluginManager.executeMojo(DefaultPluginManager.java:490)
	at org.apache.maven.lifecycle.DefaultLifecycleExecutor.executeGoals(DefaultLifecycleExecutor.java:694)
	... 17 more
Caused by: org.codehaus.plexus.archiver.ArchiverException: Error while expanding /home/hudson/.m2/repository/org/apache/cayenne/unpublished/cayenne-legal-unpublished/3.0-SNAPSHOT/cayenne-legal-unpublished-3.0-SNAPSHOT.jar
	at org.codehaus.plexus.archiver.zip.AbstractZipUnArchiver.execute(AbstractZipUnArchiver.java:97)
	at org.codehaus.plexus.archiver.AbstractUnArchiver.extract(AbstractUnArchiver.java:85)
	at org.apache.cayenne.maven.plugin.aggregator.AbstractAggregatorMojo.unpackArtifact(AbstractAggregatorMojo.java:330)
	... 21 more
Caused by: java.io.EOFException: Unexpected end of ZLIB input stream
	at java.util.zip.InflaterInputStream.fill(InflaterInputStream.java:216)
	at java.util.zip.InflaterInputStream.read(InflaterInputStream.java:134)
	at java.io.FilterInputStream.read(FilterInputStream.java:90)
	at org.codehaus.plexus.archiver.zip.AbstractZipUnArchiver.extractFile(AbstractZipUnArchiver.java:231)
	at org.codehaus.plexus.archiver.zip.AbstractZipUnArchiver.extractFileIfIncluded(AbstractZipUnArchiver.java:123)
	at org.codehaus.plexus.archiver.zip.AbstractZipUnArchiver.execute(AbstractZipUnArchiver.java:87)
	... 23 more
[INFO] ------------------------------------------------------------------------
[INFO] Total time: 1 minute 27 seconds
[INFO] Finished at: Fri Jun 25 03:11:03 UTC 2010
[INFO] Final Memory: 60M/325M
[INFO] ------------------------------------------------------------------------
Recording test results


Mime
View raw message