cayenne-commits mailing list archives

Site index · List index
Message view « Date » · « Thread »
Top « Date » · « Thread »
From Apache Hudson Server <hud...@hudson.zones.apache.org>
Subject Build failed in Hudson: Cayenne-trunk » h2,JDK 1.5 (latest),Ubuntu #313
Date Sat, 05 Jun 2010 18:49:24 GMT
See <http://hudson.zones.apache.org/hudson/job/Cayenne-trunk/./cayenneTestConnection=h2,jdk=JDK%201.5%20(latest),label=Ubuntu/313/changes>

Changes:

[aadamchik] CAY-1327 Migrate HSQLDB modeler preferences to Java preferences API

* fixing EntityResolver state switching to prevent broken namespaces for projects when projects
  are opened multiple times

------------------------------------------
[...truncated 44 lines...]
[INFO] Installing <http://hudson.zones.apache.org/hudson/job/Cayenne-trunk/./cayenneTestConnection=h2,jdk=JDK%201.5%20(latest),label=Ubuntu/ws/trunk/pom.xml>
to /home/hudson/.m2/repository/org/apache/cayenne/cayenne-parent/3.1-SNAPSHOT/cayenne-parent-3.1-SNAPSHOT.pom
[INFO] ------------------------------------------------------------------------
[INFO] Building Common Unit Test Utilities
[INFO]    task-segment: [clean, install]
[INFO] ------------------------------------------------------------------------
[INFO] [clean:clean {execution: default-clean}]
[INFO] Deleting directory <http://hudson.zones.apache.org/hudson/job/Cayenne-trunk/./cayenneTestConnection=h2,jdk=JDK%201.5%20(latest),label=Ubuntu/ws/trunk/build-tools/cayenne-test-utilities/target>
[INFO] [resources:resources {execution: default-resources}]
[WARNING] Using platform encoding (UTF-8 actually) to copy filtered resources, i.e. build
is platform dependent!
[INFO] skip non existing resourceDirectory <http://hudson.zones.apache.org/hudson/job/Cayenne-trunk/./cayenneTestConnection=h2,jdk=JDK%201.5%20(latest),label=Ubuntu/ws/trunk/build-tools/cayenne-test-utilities/src/main/resources>
[INFO] [compiler:compile {execution: default-compile}]
[INFO] Compiling 5 source files to <http://hudson.zones.apache.org/hudson/job/Cayenne-trunk/./cayenneTestConnection=h2,jdk=JDK%201.5%20(latest),label=Ubuntu/ws/trunk/build-tools/cayenne-test-utilities/target/classes>
[INFO] [resources:testResources {execution: default-testResources}]
[WARNING] Using platform encoding (UTF-8 actually) to copy filtered resources, i.e. build
is platform dependent!
[INFO] skip non existing resourceDirectory <http://hudson.zones.apache.org/hudson/job/Cayenne-trunk/./cayenneTestConnection=h2,jdk=JDK%201.5%20(latest),label=Ubuntu/ws/trunk/build-tools/cayenne-test-utilities/src/test/resources>
[INFO] [compiler:testCompile {execution: default-testCompile}]
[INFO] No sources to compile
[WARNING] DEPRECATED [systemProperties]: Use systemPropertyVariables instead.
[INFO] [surefire:test {execution: default-test}]
[INFO] No tests to run.
[INFO] [jar:jar {execution: default-jar}]
[INFO] Building jar: <http://hudson.zones.apache.org/hudson/job/Cayenne-trunk/./cayenneTestConnection=h2,jdk=JDK%201.5%20(latest),label=Ubuntu/ws/trunk/build-tools/cayenne-test-utilities/target/cayenne-test-utilities-3.1-SNAPSHOT.jar>
[INFO] [install:install {execution: default-install}]
[INFO] Installing <http://hudson.zones.apache.org/hudson/job/Cayenne-trunk/./cayenneTestConnection=h2,jdk=JDK%201.5%20(latest),label=Ubuntu/ws/trunk/build-tools/cayenne-test-utilities/target/cayenne-test-utilities-3.1-SNAPSHOT.jar>
to /home/hudson/.m2/repository/org/apache/cayenne/build-tools/cayenne-test-utilities/3.1-SNAPSHOT/cayenne-test-utilities-3.1-SNAPSHOT.jar
[INFO] ------------------------------------------------------------------------
[INFO] Building Cayenne Internal Build Plugin
[INFO]    task-segment: [clean, install]
[INFO] ------------------------------------------------------------------------
[INFO] [clean:clean {execution: default-clean}]
[INFO] Deleting directory <http://hudson.zones.apache.org/hudson/job/Cayenne-trunk/./cayenneTestConnection=h2,jdk=JDK%201.5%20(latest),label=Ubuntu/ws/trunk/build-tools/maven-cayenne-build-plugin/target>
[INFO] [plugin:descriptor {execution: default-descriptor}]
[INFO] Using 2 extractors.
[INFO] Applying extractor for language: java
[INFO] Extractor for language: java found 3 mojo descriptors.
[INFO] Applying extractor for language: bsh
[INFO] Extractor for language: bsh found 0 mojo descriptors.
[INFO] [resources:resources {execution: default-resources}]
[WARNING] Using platform encoding (UTF-8 actually) to copy filtered resources, i.e. build
is platform dependent!
[INFO] skip non existing resourceDirectory <http://hudson.zones.apache.org/hudson/job/Cayenne-trunk/./cayenneTestConnection=h2,jdk=JDK%201.5%20(latest),label=Ubuntu/ws/trunk/build-tools/maven-cayenne-build-plugin/src/main/resources>
[INFO] [compiler:compile {execution: default-compile}]
[INFO] Compiling 6 source files to <http://hudson.zones.apache.org/hudson/job/Cayenne-trunk/./cayenneTestConnection=h2,jdk=JDK%201.5%20(latest),label=Ubuntu/ws/trunk/build-tools/maven-cayenne-build-plugin/target/classes>
[INFO] [resources:testResources {execution: default-testResources}]
[WARNING] Using platform encoding (UTF-8 actually) to copy filtered resources, i.e. build
is platform dependent!
[INFO] skip non existing resourceDirectory <http://hudson.zones.apache.org/hudson/job/Cayenne-trunk/./cayenneTestConnection=h2,jdk=JDK%201.5%20(latest),label=Ubuntu/ws/trunk/build-tools/maven-cayenne-build-plugin/src/test/resources>
[INFO] [compiler:testCompile {execution: default-testCompile}]
[INFO] Nothing to compile - all classes are up to date
[WARNING] DEPRECATED [systemProperties]: Use systemPropertyVariables instead.
[INFO] [surefire:test {execution: default-test}]
[INFO] No tests to run.
[INFO] [jar:jar {execution: default-jar}]
[INFO] Building jar: <http://hudson.zones.apache.org/hudson/job/Cayenne-trunk/./cayenneTestConnection=h2,jdk=JDK%201.5%20(latest),label=Ubuntu/ws/trunk/build-tools/maven-cayenne-build-plugin/target/maven-cayenne-build-plugin-3.1-SNAPSHOT.jar>
[INFO] [plugin:addPluginArtifactMetadata {execution: default-addPluginArtifactMetadata}]
[INFO] [install:install {execution: default-install}]
[INFO] Installing <http://hudson.zones.apache.org/hudson/job/Cayenne-trunk/./cayenneTestConnection=h2,jdk=JDK%201.5%20(latest),label=Ubuntu/ws/trunk/build-tools/maven-cayenne-build-plugin/target/maven-cayenne-build-plugin-3.1-SNAPSHOT.jar>
to /home/hudson/.m2/repository/org/apache/cayenne/build-tools/maven-cayenne-build-plugin/3.1-SNAPSHOT/maven-cayenne-build-plugin-3.1-SNAPSHOT.jar
[INFO] ------------------------------------------------------------------------
[INFO] Building Cayenne Internal Documentation Build Plugin
[INFO]    task-segment: [clean, install]
[INFO] ------------------------------------------------------------------------
[INFO] [clean:clean {execution: default-clean}]
[INFO] Deleting directory <http://hudson.zones.apache.org/hudson/job/Cayenne-trunk/./cayenneTestConnection=h2,jdk=JDK%201.5%20(latest),label=Ubuntu/ws/trunk/build-tools/maven-cayenne-doc-plugin/target>
Downloading: http://objectstyle.org/maven2/com/atlassian/confluence/confluence-soap/2.0/confluence-soap-2.0.pom
[INFO] Unable to find resource 'com.atlassian.confluence:confluence-soap:pom:2.0' in repository
objectstyle (http://objectstyle.org/maven2)
Downloading: http://repo1.maven.org/maven2/com/atlassian/confluence/confluence-soap/2.0/confluence-soap-2.0.pom
[INFO] Unable to find resource 'com.atlassian.confluence:confluence-soap:pom:2.0' in repository
central (http://repo1.maven.org/maven2)
[INFO] [plugin:descriptor {execution: default-descriptor}]
[INFO] Using 2 extractors.
[INFO] Applying extractor for language: java
[INFO] Extractor for language: java found 1 mojo descriptors.
[INFO] Applying extractor for language: bsh
[INFO] Extractor for language: bsh found 0 mojo descriptors.
[INFO] [resources:resources {execution: default-resources}]
[WARNING] Using platform encoding (UTF-8 actually) to copy filtered resources, i.e. build
is platform dependent!
[INFO] Copying 1 resource
[INFO] [compiler:compile {execution: default-compile}]
[INFO] Compiling 6 source files to <http://hudson.zones.apache.org/hudson/job/Cayenne-trunk/./cayenneTestConnection=h2,jdk=JDK%201.5%20(latest),label=Ubuntu/ws/trunk/build-tools/maven-cayenne-doc-plugin/target/classes>
[INFO] [resources:testResources {execution: default-testResources}]
[WARNING] Using platform encoding (UTF-8 actually) to copy filtered resources, i.e. build
is platform dependent!
[INFO] skip non existing resourceDirectory <http://hudson.zones.apache.org/hudson/job/Cayenne-trunk/./cayenneTestConnection=h2,jdk=JDK%201.5%20(latest),label=Ubuntu/ws/trunk/build-tools/maven-cayenne-doc-plugin/src/test/resources>
[INFO] [compiler:testCompile {execution: default-testCompile}]
[INFO] Compiling 1 source file to <http://hudson.zones.apache.org/hudson/job/Cayenne-trunk/./cayenneTestConnection=h2,jdk=JDK%201.5%20(latest),label=Ubuntu/ws/trunk/build-tools/maven-cayenne-doc-plugin/target/test-classes>
[WARNING] DEPRECATED [systemProperties]: Use systemPropertyVariables instead.
[INFO] [surefire:test {execution: default-test}]
[INFO] Surefire report directory: <http://hudson.zones.apache.org/hudson/job/Cayenne-trunk/./cayenneTestConnection=h2,jdk=JDK%201.5%20(latest),label=Ubuntu/ws/trunk/build-tools/maven-cayenne-doc-plugin/target/surefire-reports>

-------------------------------------------------------
 T E S T S
-------------------------------------------------------
Running org.apache.cayenne.maven.plugin.confluence.DocPageTest
Tests run: 5, Failures: 0, Errors: 0, Skipped: 0, Time elapsed: 0.036 sec

Results :

Tests run: 5, Failures: 0, Errors: 0, Skipped: 0

[INFO] [jar:jar {execution: default-jar}]
[INFO] Building jar: <http://hudson.zones.apache.org/hudson/job/Cayenne-trunk/./cayenneTestConnection=h2,jdk=JDK%201.5%20(latest),label=Ubuntu/ws/trunk/build-tools/maven-cayenne-doc-plugin/target/maven-cayenne-doc-plugin-3.1-SNAPSHOT.jar>
[INFO] [plugin:addPluginArtifactMetadata {execution: default-addPluginArtifactMetadata}]
[INFO] [install:install {execution: default-install}]
[INFO] Installing <http://hudson.zones.apache.org/hudson/job/Cayenne-trunk/./cayenneTestConnection=h2,jdk=JDK%201.5%20(latest),label=Ubuntu/ws/trunk/build-tools/maven-cayenne-doc-plugin/target/maven-cayenne-doc-plugin-3.1-SNAPSHOT.jar>
to /home/hudson/.m2/repository/org/apache/cayenne/build-tools/maven-cayenne-doc-plugin/3.1-SNAPSHOT/maven-cayenne-doc-plugin-3.1-SNAPSHOT.jar
[INFO] ------------------------------------------------------------------------
[INFO] Building Cayenne Build Tools Parent
[INFO]    task-segment: [clean, install]
[INFO] ------------------------------------------------------------------------
[INFO] [clean:clean {execution: default-clean}]
[INFO] [site:attach-descriptor {execution: default-attach-descriptor}]
[INFO] [install:install {execution: default-install}]
[INFO] Installing <http://hudson.zones.apache.org/hudson/job/Cayenne-trunk/./cayenneTestConnection=h2,jdk=JDK%201.5%20(latest),label=Ubuntu/ws/trunk/build-tools/pom.xml>
to /home/hudson/.m2/repository/org/apache/cayenne/parents/cayenne-build-tools/3.1-SNAPSHOT/cayenne-build-tools-3.1-SNAPSHOT.pom
[INFO] ------------------------------------------------------------------------
[INFO] Building Cayenne License and Notice Bundle
[INFO]    task-segment: [clean, install]
[INFO] ------------------------------------------------------------------------
[INFO] [clean:clean {execution: default-clean}]
[INFO] Deleting directory <http://hudson.zones.apache.org/hudson/job/Cayenne-trunk/./cayenneTestConnection=h2,jdk=JDK%201.5%20(latest),label=Ubuntu/ws/trunk/framework/cayenne-legal-unpublished/target>
[INFO] [cayenne-build:date {execution: date}]
[INFO] [remote-resources:bundle {execution: default}]
[INFO] [resources:resources {execution: default-resources}]
[WARNING] File encoding has not been set, using platform encoding UTF-8, i.e. build is platform
dependent!
[WARNING] Using platform encoding (UTF-8 actually) to copy filtered resources, i.e. build
is platform dependent!
[INFO] Copying 2 resources
[INFO] [compiler:compile {execution: default-compile}]
[INFO] No sources to compile
[INFO] [resources:testResources {execution: default-testResources}]
[WARNING] Using platform encoding (UTF-8 actually) to copy filtered resources, i.e. build
is platform dependent!
[INFO] skip non existing resourceDirectory <http://hudson.zones.apache.org/hudson/job/Cayenne-trunk/./cayenneTestConnection=h2,jdk=JDK%201.5%20(latest),label=Ubuntu/ws/trunk/framework/cayenne-legal-unpublished/src/test/resources>
[INFO] [compiler:testCompile {execution: default-testCompile}]
[INFO] No sources to compile
[WARNING] DEPRECATED [systemProperties]: Use systemPropertyVariables instead.
[INFO] [surefire:test {execution: default-test}]
[INFO] No tests to run.
[INFO] [jar:jar {execution: default-jar}]
[INFO] Building jar: <http://hudson.zones.apache.org/hudson/job/Cayenne-trunk/./cayenneTestConnection=h2,jdk=JDK%201.5%20(latest),label=Ubuntu/ws/trunk/framework/cayenne-legal-unpublished/target/cayenne-legal-unpublished-3.1-SNAPSHOT.jar>
[INFO] Preparing source:jar
[WARNING] Removing: jar from forked lifecycle, to prevent recursive invocation.
[INFO] [cayenne-build:date {execution: date}]
[INFO] [source:jar {execution: bundle-source-jar}]
[INFO] Building jar: <http://hudson.zones.apache.org/hudson/job/Cayenne-trunk/./cayenneTestConnection=h2,jdk=JDK%201.5%20(latest),label=Ubuntu/ws/trunk/framework/cayenne-legal-unpublished/target/cayenne-legal-unpublished-3.1-SNAPSHOT-sources.jar>
[INFO] [install:install {execution: default-install}]
[INFO] Installing <http://hudson.zones.apache.org/hudson/job/Cayenne-trunk/./cayenneTestConnection=h2,jdk=JDK%201.5%20(latest),label=Ubuntu/ws/trunk/framework/cayenne-legal-unpublished/target/cayenne-legal-unpublished-3.1-SNAPSHOT.jar>
to /home/hudson/.m2/repository/org/apache/cayenne/unpublished/cayenne-legal-unpublished/3.1-SNAPSHOT/cayenne-legal-unpublished-3.1-SNAPSHOT.jar
[INFO] Installing <http://hudson.zones.apache.org/hudson/job/Cayenne-trunk/./cayenneTestConnection=h2,jdk=JDK%201.5%20(latest),label=Ubuntu/ws/trunk/framework/cayenne-legal-unpublished/target/cayenne-legal-unpublished-3.1-SNAPSHOT-sources.jar>
to /home/hudson/.m2/repository/org/apache/cayenne/unpublished/cayenne-legal-unpublished/3.1-SNAPSHOT/cayenne-legal-unpublished-3.1-SNAPSHOT-sources.jar
[INFO] ------------------------------------------------------------------------
[INFO] Building Cayenne Dependency Injection Container
[INFO]    task-segment: [clean, install]
[INFO] ------------------------------------------------------------------------
[INFO] [clean:clean {execution: default-clean}]
[INFO] Deleting directory <http://hudson.zones.apache.org/hudson/job/Cayenne-trunk/./cayenneTestConnection=h2,jdk=JDK%201.5%20(latest),label=Ubuntu/ws/trunk/framework/cayenne-di-unpublished/target>
[INFO] [resources:resources {execution: default-resources}]
[WARNING] File encoding has not been set, using platform encoding UTF-8, i.e. build is platform
dependent!
[WARNING] Using platform encoding (UTF-8 actually) to copy filtered resources, i.e. build
is platform dependent!
[INFO] Copying 1 resource
[INFO] [compiler:compile {execution: default-compile}]
[INFO] Compiling 33 source files to <http://hudson.zones.apache.org/hudson/job/Cayenne-trunk/./cayenneTestConnection=h2,jdk=JDK%201.5%20(latest),label=Ubuntu/ws/trunk/framework/cayenne-di-unpublished/target/classes>
[INFO] [resources:testResources {execution: default-testResources}]
[WARNING] Using platform encoding (UTF-8 actually) to copy filtered resources, i.e. build
is platform dependent!
[INFO] skip non existing resourceDirectory <http://hudson.zones.apache.org/hudson/job/Cayenne-trunk/./cayenneTestConnection=h2,jdk=JDK%201.5%20(latest),label=Ubuntu/ws/trunk/framework/cayenne-di-unpublished/src/test/resources>
[INFO] [compiler:testCompile {execution: default-testCompile}]
[INFO] Compiling 34 source files to <http://hudson.zones.apache.org/hudson/job/Cayenne-trunk/./cayenneTestConnection=h2,jdk=JDK%201.5%20(latest),label=Ubuntu/ws/trunk/framework/cayenne-di-unpublished/target/test-classes>
[WARNING] DEPRECATED [systemProperties]: Use systemPropertyVariables instead.
[INFO] [surefire:test {execution: default-test}]
[INFO] Surefire report directory: <http://hudson.zones.apache.org/hudson/job/Cayenne-trunk/./cayenneTestConnection=h2,jdk=JDK%201.5%20(latest),label=Ubuntu/ws/trunk/framework/cayenne-di-unpublished/target/surefire-reports>

-------------------------------------------------------
 T E S T S
-------------------------------------------------------
Running org.apache.cayenne.di.KeyTest
Tests run: 3, Failures: 0, Errors: 0, Skipped: 0, Time elapsed: 0.044 sec
Running org.apache.cayenne.CayenneExceptionTest
Tests run: 6, Failures: 0, Errors: 0, Skipped: 0, Time elapsed: 0.012 sec
Running org.apache.cayenne.di.DIBootstrapTest
Tests run: 3, Failures: 0, Errors: 0, Skipped: 0, Time elapsed: 0.015 sec
Running org.apache.cayenne.di.spi.DefaultInjectorBindingTest
Tests run: 5, Failures: 0, Errors: 0, Skipped: 0, Time elapsed: 0.024 sec
Running org.apache.cayenne.CayenneRuntimeExceptionTest
Tests run: 8, Failures: 0, Errors: 0, Skipped: 0, Time elapsed: 0.01 sec
Running org.apache.cayenne.di.spi.DefaultInjectorTest
Tests run: 3, Failures: 0, Errors: 0, Skipped: 0, Time elapsed: 0.005 sec
Running org.apache.cayenne.di.spi.DefaultInjectorScopeTest
Tests run: 3, Failures: 0, Errors: 0, Skipped: 0, Time elapsed: 0.006 sec
Running org.apache.cayenne.di.spi.DefaultInjectorInjectionTest
Tests run: 15, Failures: 0, Errors: 0, Skipped: 0, Time elapsed: 0.087 sec
Running org.apache.cayenne.di.spi.DefaultInjectorCircularInjectionTest
Tests run: 3, Failures: 0, Errors: 0, Skipped: 0, Time elapsed: 0.021 sec

Results :

Tests run: 49, Failures: 0, Errors: 0, Skipped: 0

[INFO] [jar:jar {execution: default-jar}]
[INFO] Building jar: <http://hudson.zones.apache.org/hudson/job/Cayenne-trunk/./cayenneTestConnection=h2,jdk=JDK%201.5%20(latest),label=Ubuntu/ws/trunk/framework/cayenne-di-unpublished/target/cayenne-di-unpublished-3.1-SNAPSHOT.jar>
[INFO] Preparing source:jar
[WARNING] Removing: jar from forked lifecycle, to prevent recursive invocation.
[INFO] No goals needed for project - skipping
[INFO] [source:jar {execution: bundle-source-jar}]
[INFO] Building jar: <http://hudson.zones.apache.org/hudson/job/Cayenne-trunk/./cayenneTestConnection=h2,jdk=JDK%201.5%20(latest),label=Ubuntu/ws/trunk/framework/cayenne-di-unpublished/target/cayenne-di-unpublished-3.1-SNAPSHOT-sources.jar>
[INFO] [install:install {execution: default-install}]
[INFO] Installing <http://hudson.zones.apache.org/hudson/job/Cayenne-trunk/./cayenneTestConnection=h2,jdk=JDK%201.5%20(latest),label=Ubuntu/ws/trunk/framework/cayenne-di-unpublished/target/cayenne-di-unpublished-3.1-SNAPSHOT.jar>
to /home/hudson/.m2/repository/org/apache/cayenne/unpublished/cayenne-di-unpublished/3.1-SNAPSHOT/cayenne-di-unpublished-3.1-SNAPSHOT.jar
[INFO] ------------------------------------------------------------------------
[ERROR] BUILD ERROR
[INFO] ------------------------------------------------------------------------
[INFO] Error installing artifact's metadata: Error installing metadata: Error copying POM
to the local repository.

Failed to copy full contents from <http://hudson.zones.apache.org/hudson/job/Cayenne-trunk/./cayenneTestConnection=h2,jdk=JDK%201.5%20(latest),label=Ubuntu/ws/trunk/framework/cayenne-di-unpublished/pom.xml>
to /home/hudson/.m2/repository/org/apache/cayenne/unpublished/cayenne-di-unpublished/3.1-SNAPSHOT/cayenne-di-unpublished-3.1-SNAPSHOT.pom
[INFO] ------------------------------------------------------------------------
[INFO] Trace
org.apache.maven.lifecycle.LifecycleExecutionException: Error installing artifact's metadata:
Error installing metadata: Error copying POM to the local repository.
	at org.apache.maven.lifecycle.DefaultLifecycleExecutor.executeGoals(DefaultLifecycleExecutor.java:719)
	at org.apache.maven.lifecycle.DefaultLifecycleExecutor.executeGoalWithLifecycle(DefaultLifecycleExecutor.java:556)
	at org.apache.maven.lifecycle.DefaultLifecycleExecutor.executeGoal(DefaultLifecycleExecutor.java:535)
	at org.apache.maven.lifecycle.DefaultLifecycleExecutor.executeGoalAndHandleFailures(DefaultLifecycleExecutor.java:387)
	at org.apache.maven.lifecycle.DefaultLifecycleExecutor.executeTaskSegments(DefaultLifecycleExecutor.java:348)
	at org.apache.maven.lifecycle.DefaultLifecycleExecutor.execute(DefaultLifecycleExecutor.java:180)
	at org.apache.maven.DefaultMaven.doExecute(DefaultMaven.java:328)
	at org.apache.maven.DefaultMaven.execute(DefaultMaven.java:138)
	at org.apache.maven.cli.MavenCli.main(MavenCli.java:362)
	at org.apache.maven.cli.compat.CompatibleMain.main(CompatibleMain.java:60)
	at sun.reflect.NativeMethodAccessorImpl.invoke0(Native Method)
	at sun.reflect.NativeMethodAccessorImpl.invoke(NativeMethodAccessorImpl.java:39)
	at sun.reflect.DelegatingMethodAccessorImpl.invoke(DelegatingMethodAccessorImpl.java:25)
	at java.lang.reflect.Method.invoke(Method.java:592)
	at org.codehaus.classworlds.Launcher.launchEnhanced(Launcher.java:315)
	at org.codehaus.classworlds.Launcher.launch(Launcher.java:255)
	at org.codehaus.classworlds.Launcher.mainWithExitCode(Launcher.java:430)
	at org.codehaus.classworlds.Launcher.main(Launcher.java:375)
Caused by: org.apache.maven.plugin.MojoExecutionException: Error installing artifact's metadata:
Error installing metadata: Error copying POM to the local repository.
	at org.apache.maven.plugin.install.InstallMojo.execute(InstallMojo.java:143)
	at org.apache.maven.plugin.DefaultPluginManager.executeMojo(DefaultPluginManager.java:490)
	at org.apache.maven.lifecycle.DefaultLifecycleExecutor.executeGoals(DefaultLifecycleExecutor.java:694)
	... 17 more
Caused by: org.apache.maven.artifact.installer.ArtifactInstallationException: Error installing
artifact's metadata: Error installing metadata: Error copying POM to the local repository.
	at org.apache.maven.artifact.installer.DefaultArtifactInstaller.install(DefaultArtifactInstaller.java:123)
	at org.apache.maven.plugin.install.InstallMojo.execute(InstallMojo.java:105)
	... 19 more
Caused by: org.apache.maven.artifact.repository.metadata.RepositoryMetadataInstallationException:
Error installing metadata: Error copying POM to the local repository.
	at org.apache.maven.artifact.repository.metadata.DefaultRepositoryMetadataManager.install(DefaultRepositoryMetadataManager.java:462)
	at org.apache.maven.artifact.installer.DefaultArtifactInstaller.install(DefaultArtifactInstaller.java:111)
	... 20 more
Caused by: org.apache.maven.artifact.repository.metadata.RepositoryMetadataStoreException:
Error copying POM to the local repository.
	at org.apache.maven.project.artifact.ProjectArtifactMetadata.storeInLocalRepository(ProjectArtifactMetadata.java:100)
	at org.apache.maven.artifact.repository.metadata.DefaultRepositoryMetadataManager.install(DefaultRepositoryMetadataManager.java:458)
	... 21 more
Caused by: java.io.IOException: Failed to copy full contents from <http://hudson.zones.apache.org/hudson/job/Cayenne-trunk/./cayenneTestConnection=h2,jdk=JDK%201.5%20(latest),label=Ubuntu/ws/trunk/framework/cayenne-di-unpublished/pom.xml>
to /home/hudson/.m2/repository/org/apache/cayenne/unpublished/cayenne-di-unpublished/3.1-SNAPSHOT/cayenne-di-unpublished-3.1-SNAPSHOT.pom
	at hidden.org.codehaus.plexus.util.FileUtils.copyFile(FileUtils.java:1018)
	at org.apache.maven.project.artifact.ProjectArtifactMetadata.storeInLocalRepository(ProjectArtifactMetadata.java:96)
	... 22 more
[INFO] ------------------------------------------------------------------------
[INFO] Total time: 13 seconds
[INFO] Finished at: Sat Jun 05 18:49:03 UTC 2010
[INFO] Final Memory: 36M/204M
[INFO] ------------------------------------------------------------------------
Recording test results


Mime
View raw message