cayenne-commits mailing list archives

Site index · List index
Message view « Date » · « Thread »
Top « Date » · « Thread »
From Apache Hudson Server <hud...@hudson.apache.org>
Subject Build failed in Hudson: Cayenne-trunk » h2,JDK 1.6 (latest),Ubuntu #370
Date Sun, 19 Sep 2010 09:50:09 GMT
See <https://hudson.apache.org/hudson/job/Cayenne-trunk/./cayenneTestConnection=h2,jdk=JDK%201.6%20(latest),label=Ubuntu/370/changes>

Changes:

[aadamchik] CAY-1213 Cayenne should support enum types in qualifier statements/expression
handling

* patch by Andrei Veprev
* (Andrus) fixing use of StringUtils

------------------------------------------
Started by upstream project "Cayenne-trunk" build number 370
Building remotely on ubuntu2
Updating http://svn.apache.org/repos/asf/cayenne/main/trunk
A         framework/cayenne-jdk1.5-unpublished/src/test/java/org/apache/cayenne/query/ConstQueryTest.java
A         framework/cayenne-jdk1.5-unpublished/src/test/java/org/apache/cayenne/testdo/consttest
A         framework/cayenne-jdk1.5-unpublished/src/test/java/org/apache/cayenne/testdo/consttest/Const1Entity.java
A         framework/cayenne-jdk1.5-unpublished/src/test/java/org/apache/cayenne/testdo/consttest/Const.java
A         framework/cayenne-jdk1.5-unpublished/src/test/java/org/apache/cayenne/testdo/consttest/auto
A         framework/cayenne-jdk1.5-unpublished/src/test/java/org/apache/cayenne/testdo/consttest/auto/_Const1Entity.java
A         framework/cayenne-jdk1.5-unpublished/src/test/java/org/apache/cayenne/testdo/consttest/auto/_Const.java
A         framework/cayenne-jdk1.5-unpublished/src/test/java/org/apache/cayenne/testdo/consttest/Const1Type.java
A         framework/cayenne-jdk1.5-unpublished/src/test/java/org/apache/cayenne/testdo/consttest/Const1Status.java
U         framework/cayenne-jdk1.5-unpublished/src/test/resources/spring-test-resources.xml
A         framework/cayenne-jdk1.5-unpublished/src/test/resources/const.map.xml
A         framework/cayenne-jdk1.5-unpublished/src/test/resources/cayenne-const.xml
U         framework/cayenne-jdk1.5-unpublished/src/main/java/org/apache/cayenne/access/trans/QualifierTranslator.java
At revision 998620
[trunk] $ /home/hudson/tools/maven/apache-maven-2.2.1/bin/mvn -Dlabel=Ubuntu "-Djdk=JDK 1.6
(latest)" -DcayenneTestConnection=h2 -e clean install
+ Error stacktraces are turned on.
[INFO] Scanning for projects...
[INFO] Reactor build order: 
[INFO]   Cayenne
[INFO]   Common Unit Test Utilities
[INFO]   Cayenne Internal Build Plugin
[INFO]   Cayenne Internal Documentation Build Plugin
[INFO]   Cayenne Build Tools Parent
[INFO]   Cayenne License and Notice Bundle
[INFO]   Cayenne Dependency Injection Container
[INFO]   Cayenne Java 1.5 Unpublished
[INFO]   Cayenne Java 1.6 Extensions
[INFO]   Cayenne Project
[INFO]   Cayenne WebObjects Compatibility Library
[INFO]   Cayenne Aggregated Server Jar
[INFO]   Cayenne Aggregated Client Jar
[INFO]   Cayenne Tools
[INFO]   Cayenne Maven Plugin
[INFO]   Cayenne Framework Aggregator Project
[INFO]   Cayenne Integration Tests Parent
[INFO]   Integration Tests - Cayenne Runtime
[INFO]   Cayenne Modeler
[INFO]   Cayenne Modeler Maven Plugin
[INFO]   Cayenne Modeler Parent
[INFO]   Cayenne Tutorial
[INFO]   Cayenne ROP Server Tutorial
[INFO]   Cayenne ROP Client Tutorial
[INFO]   Cayenne Tutorials
[INFO]   Cayenne Documentation
[INFO]   Cayenne Documenation Parent
[INFO] ------------------------------------------------------------------------
[INFO] Building Cayenne
[INFO]    task-segment: [clean, install]
[INFO] ------------------------------------------------------------------------
[INFO] [clean:clean {execution: default-clean}]
[INFO] [site:attach-descriptor {execution: default-attach-descriptor}]
[INFO] [install:install {execution: default-install}]
[INFO] Installing <https://hudson.apache.org/hudson/job/Cayenne-trunk/./cayenneTestConnection=h2,jdk=JDK%201.6%20(latest),label=Ubuntu/ws/trunk/pom.xml>
to /home/hudson/.m2/repository/org/apache/cayenne/cayenne-parent/3.1-SNAPSHOT/cayenne-parent-3.1-SNAPSHOT.pom
[INFO] ------------------------------------------------------------------------
[ERROR] BUILD ERROR
[INFO] ------------------------------------------------------------------------
[INFO] Error installing artifact's metadata: Error installing metadata: Error updating group
repository metadata

input contained no data
[INFO] ------------------------------------------------------------------------
[INFO] Trace
org.apache.maven.lifecycle.LifecycleExecutionException: Error installing artifact's metadata:
Error installing metadata: Error updating group repository metadata
	at org.apache.maven.lifecycle.DefaultLifecycleExecutor.executeGoals(DefaultLifecycleExecutor.java:719)
	at org.apache.maven.lifecycle.DefaultLifecycleExecutor.executeGoalWithLifecycle(DefaultLifecycleExecutor.java:556)
	at org.apache.maven.lifecycle.DefaultLifecycleExecutor.executeGoal(DefaultLifecycleExecutor.java:535)
	at org.apache.maven.lifecycle.DefaultLifecycleExecutor.executeGoalAndHandleFailures(DefaultLifecycleExecutor.java:387)
	at org.apache.maven.lifecycle.DefaultLifecycleExecutor.executeTaskSegments(DefaultLifecycleExecutor.java:348)
	at org.apache.maven.lifecycle.DefaultLifecycleExecutor.execute(DefaultLifecycleExecutor.java:180)
	at org.apache.maven.DefaultMaven.doExecute(DefaultMaven.java:328)
	at org.apache.maven.DefaultMaven.execute(DefaultMaven.java:138)
	at org.apache.maven.cli.MavenCli.main(MavenCli.java:362)
	at org.apache.maven.cli.compat.CompatibleMain.main(CompatibleMain.java:60)
	at sun.reflect.NativeMethodAccessorImpl.invoke0(Native Method)
	at sun.reflect.NativeMethodAccessorImpl.invoke(NativeMethodAccessorImpl.java:39)
	at sun.reflect.DelegatingMethodAccessorImpl.invoke(DelegatingMethodAccessorImpl.java:25)
	at java.lang.reflect.Method.invoke(Method.java:597)
	at org.codehaus.classworlds.Launcher.launchEnhanced(Launcher.java:315)
	at org.codehaus.classworlds.Launcher.launch(Launcher.java:255)
	at org.codehaus.classworlds.Launcher.mainWithExitCode(Launcher.java:430)
	at org.codehaus.classworlds.Launcher.main(Launcher.java:375)
Caused by: org.apache.maven.plugin.MojoExecutionException: Error installing artifact's metadata:
Error installing metadata: Error updating group repository metadata
	at org.apache.maven.plugin.install.InstallMojo.execute(InstallMojo.java:143)
	at org.apache.maven.plugin.DefaultPluginManager.executeMojo(DefaultPluginManager.java:490)
	at org.apache.maven.lifecycle.DefaultLifecycleExecutor.executeGoals(DefaultLifecycleExecutor.java:694)
	... 17 more
Caused by: org.apache.maven.artifact.installer.ArtifactInstallationException: Error installing
artifact's metadata: Error installing metadata: Error updating group repository metadata
	at org.apache.maven.artifact.installer.DefaultArtifactInstaller.install(DefaultArtifactInstaller.java:123)
	at org.apache.maven.plugin.install.InstallMojo.execute(InstallMojo.java:92)
	... 19 more
Caused by: org.apache.maven.artifact.repository.metadata.RepositoryMetadataInstallationException:
Error installing metadata: Error updating group repository metadata
	at org.apache.maven.artifact.repository.metadata.DefaultRepositoryMetadataManager.install(DefaultRepositoryMetadataManager.java:462)
	at org.apache.maven.artifact.installer.DefaultArtifactInstaller.install(DefaultArtifactInstaller.java:111)
	... 20 more
Caused by: org.apache.maven.artifact.repository.metadata.RepositoryMetadataStoreException:
Error updating group repository metadata
	at org.apache.maven.artifact.repository.metadata.AbstractRepositoryMetadata.storeInLocalRepository(AbstractRepositoryMetadata.java:72)
	at org.apache.maven.artifact.repository.metadata.DefaultRepositoryMetadataManager.install(DefaultRepositoryMetadataManager.java:458)
	... 21 more
Caused by: java.io.EOFException: input contained no data
	at hidden.org.codehaus.plexus.util.xml.pull.MXParser.fillBuf(MXParser.java:3005)
	at hidden.org.codehaus.plexus.util.xml.pull.MXParser.more(MXParser.java:3048)
	at hidden.org.codehaus.plexus.util.xml.pull.MXParser.parseProlog(MXParser.java:1422)
	at hidden.org.codehaus.plexus.util.xml.pull.MXParser.nextImpl(MXParser.java:1407)
	at hidden.org.codehaus.plexus.util.xml.pull.MXParser.next(MXParser.java:1105)
	at org.apache.maven.artifact.repository.metadata.io.xpp3.MetadataXpp3Reader.read(MetadataXpp3Reader.java:949)
	at org.apache.maven.artifact.repository.metadata.AbstractRepositoryMetadata.updateRepositoryMetadata(AbstractRepositoryMetadata.java:98)
	at org.apache.maven.artifact.repository.metadata.AbstractRepositoryMetadata.storeInLocalRepository(AbstractRepositoryMetadata.java:68)
	... 22 more
[INFO] ------------------------------------------------------------------------
[INFO] Total time: 4 seconds
[INFO] Finished at: Sun Sep 19 09:49:51 UTC 2010
[INFO] Final Memory: 25M/309M
[INFO] ------------------------------------------------------------------------
Recording test results


Mime
View raw message