cayenne-commits mailing list archives

Site index · List index
Message view « Date » · « Thread »
Top « Date » · « Thread »
From Apache Hudson Server <hud...@hudson.apache.org>
Subject Build failed in Hudson: Cayenne-trunk » HSQLDB,JDK 1.6 (latest),Ubuntu #416
Date Sat, 29 Jan 2011 12:46:48 GMT
See <https://hudson.apache.org/hudson/job/Cayenne-trunk/./cayenneTestConnection=HSQLDB,jdk=JDK%201.6%20(latest),label=Ubuntu/416/changes>

Changes:

[aadamchik] CAY-1529 Cayenne should support enum types in qualifier statements/expression
handling

[aadamchik] cleaning up pom

[aadamchik] CAY-1534 cayenne-lifecycle: implement AuditableFilter

release notes

[aadamchik] CAY-1534 cayenne-lifecycle: implement AuditableFilter

collapse multiple audit ops

[aadamchik] cayenne-lifecycle - java 1.5 downgrade

[aadamchik] CAY-1534 cayenne-lifecycle: implement AuditableFilter

refactoring to collapse multiple audit operations per audit root

[aadamchik] CAY-1534 cayenne-lifecycle: implement AuditableFilter

refactoring, created AuditableFilter .. in progress

[aadamchik] clarifying javadocs

------------------------------------------
Started by upstream project "Cayenne-trunk" build number 416
Building remotely on ubuntu2
Updating http://svn.apache.org/repos/asf/cayenne/main/trunk
U         docs/doc/src/main/resources/RELEASE-NOTES.txt
U         framework/cayenne-lifecycle/.classpath
A         framework/cayenne-lifecycle/src/test/java/org/apache/cayenne/lifecycle/audit
A         framework/cayenne-lifecycle/src/test/java/org/apache/cayenne/lifecycle/audit/AuditableFilterTest.java
A         framework/cayenne-lifecycle/src/test/java/org/apache/cayenne/lifecycle/audit/MockAuditableChild.java
U         framework/cayenne-lifecycle/src/main/java/org/apache/cayenne/lifecycle/changeset/ChangeSetFilter.java
U         framework/cayenne-lifecycle/src/main/java/org/apache/cayenne/lifecycle/changeset/GenericChangeSet.java
U         framework/cayenne-lifecycle/src/main/java/org/apache/cayenne/lifecycle/relationship/MixinRelationshipBatchFaultingStrategy.java
U         framework/cayenne-lifecycle/src/main/java/org/apache/cayenne/lifecycle/relationship/MixinRelationshipFilter.java
U         framework/cayenne-lifecycle/src/main/java/org/apache/cayenne/lifecycle/cache/CacheInvalidationFilter.java
D         framework/cayenne-lifecycle/src/main/java/org/apache/cayenne/lifecycle/audit/AbstractAuditableHandler.java
A         framework/cayenne-lifecycle/src/main/java/org/apache/cayenne/lifecycle/audit/AuditableFilter.java
U         framework/cayenne-lifecycle/src/main/java/org/apache/cayenne/lifecycle/audit/Auditable.java
A         framework/cayenne-lifecycle/src/main/java/org/apache/cayenne/lifecycle/audit/AuditableProcessor.java
U         framework/cayenne-lifecycle/src/main/java/org/apache/cayenne/lifecycle/audit/AuditableOperation.java
A         framework/cayenne-lifecycle/src/main/java/org/apache/cayenne/lifecycle/audit/AuditableAggregator.java
U         framework/cayenne-lifecycle/src/main/java/org/apache/cayenne/lifecycle/ref/ReferenceableHandler.java
U         framework/cayenne-lifecycle/src/main/java/org/apache/cayenne/lifecycle/ref/Referenceable.java
U         framework/cayenne-lifecycle/pom.xml
D         framework/cayenne-lifecycle/.settings/org.maven.ide.eclipse.prefs
U         framework/cayenne-lifecycle/.settings/org.eclipse.jdt.core.prefs
U         framework/cayenne-lifecycle/.settings/org.eclipse.jdt.ui.prefs
U         framework/cayenne-jdk1.5-unpublished/src/test/java/org/apache/cayenne/exp/ExpressionTest.java
A         framework/cayenne-jdk1.5-unpublished/src/test/java/org/apache/cayenne/exp/ExpEnum1.java
U         framework/cayenne-jdk1.5-unpublished/src/main/java/org/apache/cayenne/DataChannel.java
U         framework/cayenne-jdk1.5-unpublished/src/main/java/org/apache/cayenne/exp/parser/ExpressionParserConstants.java
U         framework/cayenne-jdk1.5-unpublished/src/main/java/org/apache/cayenne/exp/parser/JJTExpressionParserState.java
A         framework/cayenne-jdk1.5-unpublished/src/main/java/org/apache/cayenne/exp/parser/ParserUtil.java
U         framework/cayenne-jdk1.5-unpublished/src/main/java/org/apache/cayenne/exp/parser/ExpressionParserTokenManager.java
U         framework/cayenne-jdk1.5-unpublished/src/main/java/org/apache/cayenne/exp/parser/ExpressionParser.java
U         framework/cayenne-jdk1.5-unpublished/src/main/java/org/apache/cayenne/exp/parser/ExpressionParserTreeConstants.java
U         framework/cayenne-jdk1.5-unpublished/src/main/jjtree/org/apache/cayenne/exp/parser/ExpressionParser.jjt
U         framework/cayenne-jdk1.5-unpublished/pom.xml
At revision 1065011
[trunk] $ /home/hudson/tools/maven/apache-maven-2.2.1/bin/mvn -Dlabel=Ubuntu "-Djdk=JDK 1.6
(latest)" -DcayenneTestConnection=HSQLDB -e clean install
[INFO] Error stacktraces are turned on.
[INFO] Scanning for projects...
[ERROR] The build could not read 1 project -> [Help 1]
org.apache.maven.project.ProjectBuildingException: Some problems were encountered while processing
the POMs:
[WARNING] 'build.plugins.plugin.version' for org.apache.maven.plugins:maven-deploy-plugin
is missing. @ line 59, column 12
[WARNING] 'build.plugins.plugin.version' for org.apache.maven.plugins:maven-compiler-plugin
is missing. @ line 52, column 12
[WARNING] 'reporting.plugins.plugin.version' for com.atlassian.maven.plugins:maven-clover2-plugin
is missing. @ 
[WARNING] 'reporting.plugins.plugin.version' for org.apache.maven.plugins:maven-javadoc-plugin
is missing. @ 
[WARNING] 'build.plugins.plugin.version' for org.apache.maven.plugins:maven-deploy-plugin
is missing. @ line 100, column 12
[WARNING] 'reporting.plugins.plugin.version' for com.atlassian.maven.plugins:maven-clover2-plugin
is missing. @ 
[WARNING] 'reporting.plugins.plugin.version' for org.apache.maven.plugins:maven-javadoc-plugin
is missing. @ 
[WARNING] 'build.plugins.plugin.version' for org.apache.maven.plugins:maven-deploy-plugin
is missing. @ line 73, column 12
[WARNING] 'build.plugins.plugin.version' for org.apache.maven.plugins:maven-compiler-plugin
is missing. @ line 65, column 12
[WARNING] 'reporting.plugins.plugin.version' for com.atlassian.maven.plugins:maven-clover2-plugin
is missing. @ 
[WARNING] 'reporting.plugins.plugin.version' for org.apache.maven.plugins:maven-javadoc-plugin
is missing. @ 
[WARNING] 'build.plugins.plugin.version' for org.apache.maven.plugins:maven-deploy-plugin
is missing. @ line 45, column 12
[WARNING] 'reporting.plugins.plugin.version' for com.atlassian.maven.plugins:maven-clover2-plugin
is missing. @ 
[WARNING] 'reporting.plugins.plugin.version' for org.apache.maven.plugins:maven-javadoc-plugin
is missing. @ 
[WARNING] 'build.plugins.plugin.version' for org.apache.maven.plugins:maven-deploy-plugin
is missing. @ line 84, column 12
[WARNING] 'build.plugins.plugin.version' for org.apache.cayenne.build-tools:maven-cayenne-build-plugin
is missing. @ line 48, column 12
[WARNING] 'build.plugins.plugin.version' for org.apache.maven.plugins:maven-source-plugin
is missing. @ line 72, column 12
[WARNING] 'reporting.plugins.plugin.version' for com.atlassian.maven.plugins:maven-clover2-plugin
is missing. @ 
[WARNING] 'reporting.plugins.plugin.version' for org.apache.maven.plugins:maven-javadoc-plugin
is missing. @ 
[WARNING] 'build.plugins.plugin.version' for org.apache.cayenne.build-tools:maven-cayenne-build-plugin
is missing. @ line 49, column 12
[WARNING] 'build.plugins.plugin.version' for org.apache.maven.plugins:maven-compiler-plugin
is missing. @ line 28, column 12
[WARNING] 'build.plugins.plugin.version' for org.apache.maven.plugins:maven-source-plugin
is missing. @ line 36, column 12
[WARNING] 'reporting.plugins.plugin.version' for com.atlassian.maven.plugins:maven-clover2-plugin
is missing. @ 
[WARNING] 'reporting.plugins.plugin.version' for org.apache.maven.plugins:maven-javadoc-plugin
is missing. @ 
[WARNING] 'build.plugins.plugin.version' for org.apache.cayenne.build-tools:maven-cayenne-build-plugin
is missing. @ line 245, column 12
[WARNING] 'build.plugins.plugin.version' for org.apache.maven.plugins:maven-deploy-plugin
is missing. @ line 227, column 12
[WARNING] 'build.plugins.plugin.version' for org.apache.maven.plugins:maven-source-plugin
is missing. @ line 214, column 12
[WARNING] 'build.plugins.plugin.version' for org.apache.maven.plugins:maven-jar-plugin is
missing. @ line 234, column 12
[WARNING] 'build.plugins.plugin.version' for org.apache.maven.plugins:maven-compiler-plugin
is missing. @ line 125, column 12
[WARNING] The expression ${version} is deprecated. Please use ${project.version} instead.
@ 
[WARNING] The expression ${version} is deprecated. Please use ${project.version} instead.
@ 
[WARNING] 'reporting.plugins.plugin.version' for com.atlassian.maven.plugins:maven-clover2-plugin
is missing. @ 
[WARNING] 'reporting.plugins.plugin.version' for org.apache.maven.plugins:maven-javadoc-plugin
is missing. @ 
[WARNING] 'build.plugins.plugin.version' for org.apache.maven.plugins:maven-deploy-plugin
is missing. @ line 85, column 12
[WARNING] 'build.plugins.plugin.version' for org.apache.cayenne.build-tools:maven-cayenne-build-plugin
is missing. @ line 73, column 12
[WARNING] 'build.plugins.plugin.version' for org.apache.maven.plugins:maven-compiler-plugin
is missing. @ line 52, column 12
[WARNING] 'build.plugins.plugin.version' for org.apache.maven.plugins:maven-source-plugin
is missing. @ line 60, column 12
[WARNING] The expression ${version} is deprecated. Please use ${project.version} instead.
@ 
[WARNING] 'reporting.plugins.plugin.version' for com.atlassian.maven.plugins:maven-clover2-plugin
is missing. @ 
[WARNING] 'reporting.plugins.plugin.version' for org.apache.maven.plugins:maven-javadoc-plugin
is missing. @ 
[WARNING] 'build.plugins.plugin.version' for org.apache.maven.plugins:maven-deploy-plugin
is missing. @ line 83, column 12
[WARNING] 'build.plugins.plugin.version' for org.apache.maven.plugins:maven-compiler-plugin
is missing. @ line 62, column 12
[WARNING] 'build.plugins.plugin.version' for org.apache.maven.plugins:maven-source-plugin
is missing. @ line 70, column 12
[WARNING] The expression ${version} is deprecated. Please use ${project.version} instead.
@ 
[WARNING] The expression ${version} is deprecated. Please use ${project.version} instead.
@ 
[WARNING] The expression ${version} is deprecated. Please use ${project.version} instead.
@ 
[WARNING] 'reporting.plugins.plugin.version' for com.atlassian.maven.plugins:maven-clover2-plugin
is missing. @ 
[WARNING] 'reporting.plugins.plugin.version' for org.apache.maven.plugins:maven-javadoc-plugin
is missing. @ 
[WARNING] 'build.plugins.plugin.version' for org.apache.maven.plugins:maven-deploy-plugin
is missing. @ line 77, column 12
[WARNING] 'build.plugins.plugin.version' for org.apache.maven.plugins:maven-compiler-plugin
is missing. @ line 56, column 12
[WARNING] 'build.plugins.plugin.version' for org.apache.maven.plugins:maven-source-plugin
is missing. @ line 64, column 12
[WARNING] The expression ${version} is deprecated. Please use ${project.version} instead.
@ 
[WARNING] The expression ${version} is deprecated. Please use ${project.version} instead.
@ 
[WARNING] 'reporting.plugins.plugin.version' for com.atlassian.maven.plugins:maven-clover2-plugin
is missing. @ 
[WARNING] 'reporting.plugins.plugin.version' for org.apache.maven.plugins:maven-javadoc-plugin
is missing. @ 
[WARNING] 'build.plugins.plugin.version' for org.apache.cayenne.build-tools:maven-cayenne-build-plugin
is missing. @ line 66, column 12
[WARNING] The expression ${version} is deprecated. Please use ${project.version} instead.
@ 
[WARNING] The expression ${version} is deprecated. Please use ${project.version} instead.
@ 
[WARNING] The expression ${version} is deprecated. Please use ${project.version} instead.
@ 
[WARNING] The expression ${version} is deprecated. Please use ${project.version} instead.
@ 
[WARNING] The expression ${version} is deprecated. Please use ${project.version} instead.
@ 
[WARNING] The expression ${version} is deprecated. Please use ${project.version} instead.
@ 
[WARNING] The expression ${version} is deprecated. Please use ${project.version} instead.
@ 
[WARNING] The expression ${version} is deprecated. Please use ${project.version} instead.
@ 
[WARNING] The expression ${version} is deprecated. Please use ${project.version} instead.
@ 
[WARNING] The expression ${version} is deprecated. Please use ${project.version} instead.
@ 
[WARNING] The expression ${version} is deprecated. Please use ${project.version} instead.
@ 
[WARNING] The expression ${version} is deprecated. Please use ${project.version} instead.
@ 
[WARNING] The expression ${version} is deprecated. Please use ${project.version} instead.
@ 
[WARNING] 'reporting.plugins.plugin.version' for com.atlassian.maven.plugins:maven-clover2-plugin
is missing. @ 
[WARNING] 'reporting.plugins.plugin.version' for org.apache.maven.plugins:maven-javadoc-plugin
is missing. @ 
[WARNING] 'build.plugins.plugin.version' for org.apache.cayenne.build-tools:maven-cayenne-build-plugin
is missing. @ line 67, column 12
[WARNING] The expression ${version} is deprecated. Please use ${project.version} instead.
@ 
[WARNING] The expression ${version} is deprecated. Please use ${project.version} instead.
@ 
[WARNING] The expression ${version} is deprecated. Please use ${project.version} instead.
@ 
[WARNING] The expression ${version} is deprecated. Please use ${project.version} instead.
@ 
[WARNING] The expression ${version} is deprecated. Please use ${project.version} instead.
@ 
[WARNING] The expression ${version} is deprecated. Please use ${project.version} instead.
@ 
[WARNING] The expression ${version} is deprecated. Please use ${project.version} instead.
@ 
[WARNING] The expression ${version} is deprecated. Please use ${project.version} instead.
@ 
[WARNING] The expression ${version} is deprecated. Please use ${project.version} instead.
@ 
[WARNING] The expression ${version} is deprecated. Please use ${project.version} instead.
@ 
[WARNING] The expression ${version} is deprecated. Please use ${project.version} instead.
@ 
[WARNING] The expression ${version} is deprecated. Please use ${project.version} instead.
@ 
[WARNING] The expression ${version} is deprecated. Please use ${project.version} instead.
@ 
[WARNING] 'reporting.plugins.plugin.version' for com.atlassian.maven.plugins:maven-clover2-plugin
is missing. @ 
[WARNING] 'reporting.plugins.plugin.version' for org.apache.maven.plugins:maven-javadoc-plugin
is missing. @ 
[WARNING] 'build.plugins.plugin.version' for org.apache.maven.plugins:maven-compiler-plugin
is missing. @ line 138, column 21
[WARNING] 'build.plugins.plugin.version' for org.apache.maven.plugins:maven-source-plugin
is missing. @ line 146, column 21
[WARNING] 'build.plugins.plugin.version' for org.apache.maven.plugins:maven-remote-resources-plugin
is missing. @ line 116, column 21
[WARNING] The expression ${version} is deprecated. Please use ${project.version} instead.
@ 
[WARNING] The expression ${version} is deprecated. Please use ${project.version} instead.
@ 
[WARNING] The expression ${version} is deprecated. Please use ${project.version} instead.
@ 
[WARNING] The expression ${version} is deprecated. Please use ${project.version} instead.
@ 
[WARNING] The expression ${version} is deprecated. Please use ${project.version} instead.
@ 
[WARNING] 'reporting.plugins.plugin.version' for com.atlassian.maven.plugins:maven-clover2-plugin
is missing. @ 
[WARNING] 'reporting.plugins.plugin.version' for org.apache.maven.plugins:maven-javadoc-plugin
is missing. @ 
[WARNING] 'build.plugins.plugin.version' for org.apache.maven.plugins:maven-remote-resources-plugin
is missing. @ line 50, column 12
[WARNING] 'build.plugins.plugin.version' for org.apache.maven.plugins:maven-source-plugin
is missing. @ line 37, column 12
[WARNING] The expression ${version} is deprecated. Please use ${project.version} instead.
@ 
[WARNING] The expression ${version} is deprecated. Please use ${project.version} instead.
@ 
[WARNING] The expression ${version} is deprecated. Please use ${project.version} instead.
@ 
[ERROR] 'dependencies.dependency.version' for org.mockito:mockito-all:jar is missing. @ line
18, column 15
[WARNING] 'reporting.plugins.plugin.version' for com.atlassian.maven.plugins:maven-clover2-plugin
is missing. @ 
[WARNING] 'reporting.plugins.plugin.version' for org.apache.maven.plugins:maven-javadoc-plugin
is missing. @ 
[WARNING] 'build.plugins.plugin.version' for org.apache.maven.plugins:maven-compiler-plugin
is missing. @ line 113, column 12
[WARNING] The expression ${version} is deprecated. Please use ${project.version} instead.
@ 
[WARNING] The expression ${version} is deprecated. Please use ${project.version} instead.
@ 
[WARNING] The expression ${version} is deprecated. Please use ${project.version} instead.
@ 
[WARNING] The expression ${version} is deprecated. Please use ${project.version} instead.
@ 
[WARNING] 'reporting.plugins.plugin.version' for com.atlassian.maven.plugins:maven-clover2-plugin
is missing. @ 
[WARNING] 'reporting.plugins.plugin.version' for org.apache.maven.plugins:maven-javadoc-plugin
is missing. @ 
[WARNING] 'build.plugins.plugin.version' for org.apache.maven.plugins:maven-deploy-plugin
is missing. @ line 35, column 12
[WARNING] 'reporting.plugins.plugin.version' for com.atlassian.maven.plugins:maven-clover2-plugin
is missing. @ 
[WARNING] 'reporting.plugins.plugin.version' for org.apache.maven.plugins:maven-javadoc-plugin
is missing. @ 
[WARNING] 'build.plugins.plugin.version' for org.apache.maven.plugins:maven-compiler-plugin
is missing. @ line 69, column 12
[WARNING] 'build.plugins.plugin.version' for org.apache.maven.plugins:maven-deploy-plugin
is missing. @ line 77, column 12
[WARNING] The expression ${version} is deprecated. Please use ${project.version} instead.
@ 
[WARNING] The expression ${version} is deprecated. Please use ${project.version} instead.
@ 
[WARNING] The expression ${version} is deprecated. Please use ${project.version} instead.
@ 
[WARNING] 'reporting.plugins.plugin.version' for com.atlassian.maven.plugins:maven-clover2-plugin
is missing. @ 
[WARNING] 'reporting.plugins.plugin.version' for org.apache.maven.plugins:maven-javadoc-plugin
is missing. @ 
[WARNING] 'build.plugins.plugin.version' for org.apache.maven.plugins:maven-compiler-plugin
is missing. @ line 79, column 12
[WARNING] 'build.plugins.plugin.version' for org.apache.maven.plugins:maven-deploy-plugin
is missing. @ line 87, column 12
[WARNING] 'build.plugins.plugin.version' for org.apache.cayenne.plugins:maven-cayenne-plugin
is missing. @ line 95, column 12
[WARNING] The expression ${version} is deprecated. Please use ${project.version} instead.
@ 
[WARNING] The expression ${version} is deprecated. Please use ${project.version} instead.
@ 
[WARNING] The expression ${version} is deprecated. Please use ${project.version} instead.
@ 
[WARNING] The expression ${version} is deprecated. Please use ${project.version} instead.
@ 
[WARNING] The expression ${version} is deprecated. Please use ${project.version} instead.
@ 
[WARNING] 'reporting.plugins.plugin.version' for com.atlassian.maven.plugins:maven-clover2-plugin
is missing. @ 
[WARNING] 'reporting.plugins.plugin.version' for org.apache.maven.plugins:maven-javadoc-plugin
is missing. @ 
[WARNING] 'build.plugins.plugin.version' for org.apache.maven.plugins:maven-deploy-plugin
is missing. @ line 45, column 12
[WARNING] 'reporting.plugins.plugin.version' for com.atlassian.maven.plugins:maven-clover2-plugin
is missing. @ 
[WARNING] 'reporting.plugins.plugin.version' for org.apache.maven.plugins:maven-javadoc-plugin
is missing. @ 
[WARNING] 'build.plugins.plugin.version' for org.apache.maven.plugins:maven-compiler-plugin
is missing. @ line 155, column 12
[WARNING] 'build.plugins.plugin.version' for org.apache.maven.plugins:maven-source-plugin
is missing. @ line 163, column 12
[WARNING] 'build.plugins.plugin.version' for org.apache.maven.plugins:maven-remote-resources-plugin
is missing. @ line 133, column 12
[WARNING] The expression ${version} is deprecated. Please use ${project.version} instead.
@ 
[WARNING] The expression ${version} is deprecated. Please use ${project.version} instead.
@ 
[WARNING] The expression ${version} is deprecated. Please use ${project.version} instead.
@ 
[WARNING] The expression ${version} is deprecated. Please use ${project.version} instead.
@ 
[WARNING] The expression ${version} is deprecated. Please use ${project.version} instead.
@ 
[WARNING] The expression ${version} is deprecated. Please use ${project.version} instead.
@ 
[WARNING] 'reporting.plugins.plugin.version' for com.atlassian.maven.plugins:maven-clover2-plugin
is missing. @ 
[WARNING] 'reporting.plugins.plugin.version' for org.apache.maven.plugins:maven-javadoc-plugin
is missing. @ 
[WARNING] 'build.plugins.plugin.version' for org.apache.maven.plugins:maven-compiler-plugin
is missing. @ line 88, column 12
[WARNING] The expression ${version} is deprecated. Please use ${project.version} instead.
@ 
[WARNING] The expression ${version} is deprecated. Please use ${project.version} instead.
@ 
[WARNING] The expression ${version} is deprecated. Please use ${project.version} instead.
@ 
[WARNING] 'reporting.plugins.plugin.version' for com.atlassian.maven.plugins:maven-clover2-plugin
is missing. @ 
[WARNING] 'reporting.plugins.plugin.version' for org.apache.maven.plugins:maven-javadoc-plugin
is missing. @ 
[WARNING] 'build.plugins.plugin.version' for org.apache.maven.plugins:maven-deploy-plugin
is missing. @ line 44, column 12
[WARNING] 'reporting.plugins.plugin.version' for com.atlassian.maven.plugins:maven-clover2-plugin
is missing. @ 
[WARNING] 'reporting.plugins.plugin.version' for org.apache.maven.plugins:maven-javadoc-plugin
is missing. @ 
[WARNING] 'build.plugins.plugin.version' for org.apache.maven.plugins:maven-deploy-plugin
is missing. @ line 52, column 12
[WARNING] 'build.plugins.plugin.version' for org.apache.maven.plugins:maven-compiler-plugin
is missing. @ line 39, column 12
[WARNING] 'build.plugins.plugin.version' for org.apache.maven.plugins:maven-deploy-plugin
is missing. @ line 65, column 12
[WARNING] 'build.plugins.plugin.version' for org.apache.maven.plugins:maven-compiler-plugin
is missing. @ line 44, column 12
[WARNING] 'build.plugins.plugin.version' for org.apache.maven.plugins:maven-deploy-plugin
is missing. @ line 47, column 12
[WARNING] 'build.plugins.plugin.version' for org.apache.maven.plugins:maven-compiler-plugin
is missing. @ line 39, column 12
[WARNING] 'reporting.plugins.plugin.version' for com.atlassian.maven.plugins:maven-clover2-plugin
is missing. @ 
[WARNING] 'reporting.plugins.plugin.version' for org.apache.maven.plugins:maven-javadoc-plugin
is missing. @ 
[WARNING] 'build.plugins.plugin.version' for org.codehaus.mojo:dependency-maven-plugin is
missing. @ line 163, column 12
[WARNING] 'build.plugins.plugin.version' for org.apache.maven.plugins:maven-deploy-plugin
is missing. @ line 219, column 12
[WARNING] 'build.plugins.plugin.version' for org.apache.cayenne.build-tools:maven-cayenne-build-plugin
is missing. @ line 207, column 12
[WARNING] The expression ${version} is deprecated. Please use ${project.version} instead.
@ 
[WARNING] The expression ${version} is deprecated. Please use ${project.version} instead.
@ 
[WARNING] The expression ${version} is deprecated. Please use ${project.version} instead.
@ 
[WARNING] 'reporting.plugins.plugin.version' for com.atlassian.maven.plugins:maven-clover2-plugin
is missing. @ 
[WARNING] 'reporting.plugins.plugin.version' for org.apache.maven.plugins:maven-javadoc-plugin
is missing. @ 
[WARNING] 'build.plugins.plugin.version' for org.apache.maven.plugins:maven-deploy-plugin
is missing. @ line 44, column 12
[WARNING] 'reporting.plugins.plugin.version' for com.atlassian.maven.plugins:maven-clover2-plugin
is missing. @ 
[WARNING] 'reporting.plugins.plugin.version' for org.apache.maven.plugins:maven-javadoc-plugin
is missing. @ 
[WARNING] 'reporting.plugins.plugin.version' for com.atlassian.maven.plugins:maven-clover2-plugin
is missing. @ line 588, column 12
[WARNING] 'reporting.plugins.plugin.version' for org.apache.maven.plugins:maven-javadoc-plugin
is missing. @ line 613, column 12

	at org.apache.maven.project.DefaultProjectBuilder.build(DefaultProjectBuilder.java:325)
	at org.apache.maven.DefaultMaven.collectProjects(DefaultMaven.java:632)
	at org.apache.maven.DefaultMaven.getProjectsForMavenReactor(DefaultMaven.java:581)
	at org.apache.maven.DefaultMaven.doExecute(DefaultMaven.java:233)
	at org.apache.maven.DefaultMaven.execute(DefaultMaven.java:156)
	at org.apache.maven.cli.MavenCli.execute(MavenCli.java:534)
	at org.apache.maven.cli.MavenCli.doMain(MavenCli.java:196)
	at org.apache.maven.cli.MavenCli.main(MavenCli.java:141)
	at sun.reflect.NativeMethodAccessorImpl.invoke0(Native Method)
	at sun.reflect.NativeMethodAccessorImpl.invoke(NativeMethodAccessorImpl.java:39)
	at sun.reflect.DelegatingMethodAccessorImpl.invoke(DelegatingMethodAccessorImpl.java:25)
	at java.lang.reflect.Method.invoke(Method.java:597)
	at org.codehaus.plexus.classworlds.launcher.Launcher.launchEnhanced(Launcher.java:290)
	at org.codehaus.plexus.classworlds.launcher.Launcher.launch(Launcher.java:230)
	at org.codehaus.plexus.classworlds.launcher.Launcher.mainWithExitCode(Launcher.java:409)
	at org.codehaus.plexus.classworlds.launcher.Launcher.main(Launcher.java:352)
[ERROR]   
[ERROR]   The project org.apache.cayenne:cayenne-lifecycle:3.1-SNAPSHOT (<https://hudson.apache.org/hudson/job/Cayenne-trunk/./cayenneTestConnection=HSQLDB,jdk=JDK%201.6%20(latest),label=Ubuntu/ws/trunk/framework/cayenne-lifecycle/pom.xml)>
has 1 error
[ERROR]     'dependencies.dependency.version' for org.mockito:mockito-all:jar is missing.
@ line 18, column 15
[ERROR] 
[ERROR] Re-run Maven using the -X switch to enable full debug logging.
[ERROR] 
[ERROR] For more information about the errors and possible solutions, please read the following
articles:
[ERROR] [Help 1] http://cwiki.apache.org/confluence/display/MAVEN/ProjectBuildingException
Recording test results


Mime
View raw message