cayenne-commits mailing list archives

Site index · List index
Message view « Date » · « Thread »
Top « Date » · « Thread »
From Apache Hudson Server <hud...@hudson.apache.org>
Subject Build failed in Hudson: Cayenne-doc #174
Date Fri, 28 Jan 2011 00:23:28 GMT
See <https://hudson.apache.org/hudson/job/Cayenne-doc/174/changes>

Changes:

[mgentry] Added missing removeDataMap() method.

------------------------------------------
[...truncated 172 lines...]
[WARNING] 'reporting.plugins.plugin.version' for com.atlassian.maven.plugins:maven-clover2-plugin
is missing.
[WARNING] 'reporting.plugins.plugin.version' for org.apache.maven.plugins:maven-javadoc-plugin
is missing.
[WARNING] 
[WARNING] Some problems were encountered while building the effective model for org.apache.cayenne.itests:cayenne-tools-itest:jar:3.1-SNAPSHOT
[WARNING] 'build.plugins.plugin.version' for org.apache.maven.plugins:maven-compiler-plugin
is missing. @ line 79, column 12
[WARNING] 'build.plugins.plugin.version' for org.apache.maven.plugins:maven-deploy-plugin
is missing. @ line 87, column 12
[WARNING] 'build.plugins.plugin.version' for org.apache.cayenne.plugins:maven-cayenne-plugin
is missing. @ line 95, column 12
[WARNING] The expression ${version} is deprecated. Please use ${project.version} instead.
[WARNING] The expression ${version} is deprecated. Please use ${project.version} instead.
[WARNING] The expression ${version} is deprecated. Please use ${project.version} instead.
[WARNING] The expression ${version} is deprecated. Please use ${project.version} instead.
[WARNING] The expression ${version} is deprecated. Please use ${project.version} instead.
[WARNING] 'reporting.plugins.plugin.version' for com.atlassian.maven.plugins:maven-clover2-plugin
is missing.
[WARNING] 'reporting.plugins.plugin.version' for org.apache.maven.plugins:maven-javadoc-plugin
is missing.
[WARNING] 
[WARNING] Some problems were encountered while building the effective model for org.apache.cayenne.itests:cayenne-itests-parent:pom:3.1-SNAPSHOT
[WARNING] 'build.plugins.plugin.version' for org.apache.maven.plugins:maven-deploy-plugin
is missing. @ line 45, column 12
[WARNING] 'reporting.plugins.plugin.version' for com.atlassian.maven.plugins:maven-clover2-plugin
is missing.
[WARNING] 'reporting.plugins.plugin.version' for org.apache.maven.plugins:maven-javadoc-plugin
is missing.
[WARNING] 
[WARNING] Some problems were encountered while building the effective model for org.apache.cayenne:cayenne-modeler:jar:3.1-SNAPSHOT
[WARNING] 'build.plugins.plugin.version' for org.apache.maven.plugins:maven-compiler-plugin
is missing. @ line 155, column 12
[WARNING] 'build.plugins.plugin.version' for org.apache.maven.plugins:maven-source-plugin
is missing. @ line 163, column 12
[WARNING] 'build.plugins.plugin.version' for org.apache.maven.plugins:maven-remote-resources-plugin
is missing. @ line 133, column 12
[WARNING] The expression ${version} is deprecated. Please use ${project.version} instead.
[WARNING] The expression ${version} is deprecated. Please use ${project.version} instead.
[WARNING] The expression ${version} is deprecated. Please use ${project.version} instead.
[WARNING] The expression ${version} is deprecated. Please use ${project.version} instead.
[WARNING] The expression ${version} is deprecated. Please use ${project.version} instead.
[WARNING] The expression ${version} is deprecated. Please use ${project.version} instead.
[WARNING] 'reporting.plugins.plugin.version' for com.atlassian.maven.plugins:maven-clover2-plugin
is missing.
[WARNING] 'reporting.plugins.plugin.version' for org.apache.maven.plugins:maven-javadoc-plugin
is missing.
[WARNING] 
[WARNING] Some problems were encountered while building the effective model for org.apache.cayenne.plugins:maven-cayenne-modeler-plugin:maven-plugin:3.1-SNAPSHOT
[WARNING] 'build.plugins.plugin.version' for org.apache.maven.plugins:maven-compiler-plugin
is missing. @ line 88, column 12
[WARNING] The expression ${version} is deprecated. Please use ${project.version} instead.
[WARNING] The expression ${version} is deprecated. Please use ${project.version} instead.
[WARNING] The expression ${version} is deprecated. Please use ${project.version} instead.
[WARNING] 'reporting.plugins.plugin.version' for com.atlassian.maven.plugins:maven-clover2-plugin
is missing.
[WARNING] 'reporting.plugins.plugin.version' for org.apache.maven.plugins:maven-javadoc-plugin
is missing.
[WARNING] 
[WARNING] Some problems were encountered while building the effective model for org.apache.cayenne.parents:cayenne-modeler-parent:pom:3.1-SNAPSHOT
[WARNING] 'build.plugins.plugin.version' for org.apache.maven.plugins:maven-deploy-plugin
is missing. @ line 44, column 12
[WARNING] 'reporting.plugins.plugin.version' for com.atlassian.maven.plugins:maven-clover2-plugin
is missing.
[WARNING] 'reporting.plugins.plugin.version' for org.apache.maven.plugins:maven-javadoc-plugin
is missing.
[WARNING] 
[WARNING] Some problems were encountered while building the effective model for org.apache.cayenne:tutorial:jar:3.1-SNAPSHOT
[WARNING] 'build.plugins.plugin.version' for org.apache.maven.plugins:maven-deploy-plugin
is missing. @ line 52, column 12
[WARNING] 'build.plugins.plugin.version' for org.apache.maven.plugins:maven-compiler-plugin
is missing. @ line 39, column 12
[WARNING] 
[WARNING] Some problems were encountered while building the effective model for org.apache.cayenne:tutorial-rop-server:jar:3.1-SNAPSHOT
[WARNING] 'build.plugins.plugin.version' for org.apache.maven.plugins:maven-deploy-plugin
is missing. @ line 65, column 12
[WARNING] 'build.plugins.plugin.version' for org.apache.maven.plugins:maven-compiler-plugin
is missing. @ line 44, column 12
[WARNING] 
[WARNING] Some problems were encountered while building the effective model for org.apache.cayenne:tutorial-rop-client:jar:3.1-SNAPSHOT
[WARNING] 'build.plugins.plugin.version' for org.apache.maven.plugins:maven-deploy-plugin
is missing. @ line 47, column 12
[WARNING] 'build.plugins.plugin.version' for org.apache.maven.plugins:maven-compiler-plugin
is missing. @ line 39, column 12
[WARNING] 
[WARNING] Some problems were encountered while building the effective model for org.apache.cayenne.parents:cayenne-tutorials-parent:pom:3.1-SNAPSHOT
[WARNING] 'reporting.plugins.plugin.version' for com.atlassian.maven.plugins:maven-clover2-plugin
is missing.
[WARNING] 'reporting.plugins.plugin.version' for org.apache.maven.plugins:maven-javadoc-plugin
is missing.
[WARNING] 
[WARNING] Some problems were encountered while building the effective model for org.apache.cayenne.docs:cayenne-doc:jar:3.1-SNAPSHOT
[WARNING] 'build.plugins.plugin.version' for org.codehaus.mojo:dependency-maven-plugin is
missing. @ line 163, column 12
[WARNING] 'build.plugins.plugin.version' for org.apache.maven.plugins:maven-deploy-plugin
is missing. @ line 219, column 12
[WARNING] 'build.plugins.plugin.version' for org.apache.cayenne.build-tools:maven-cayenne-build-plugin
is missing. @ line 207, column 12
[WARNING] The expression ${version} is deprecated. Please use ${project.version} instead.
[WARNING] The expression ${version} is deprecated. Please use ${project.version} instead.
[WARNING] The expression ${version} is deprecated. Please use ${project.version} instead.
[WARNING] 'reporting.plugins.plugin.version' for com.atlassian.maven.plugins:maven-clover2-plugin
is missing.
[WARNING] 'reporting.plugins.plugin.version' for org.apache.maven.plugins:maven-javadoc-plugin
is missing.
[WARNING] 
[WARNING] Some problems were encountered while building the effective model for org.apache.cayenne.parents:cayenne-docs-parent:pom:3.1-SNAPSHOT
[WARNING] 'build.plugins.plugin.version' for org.apache.maven.plugins:maven-deploy-plugin
is missing. @ line 44, column 12
[WARNING] 'reporting.plugins.plugin.version' for com.atlassian.maven.plugins:maven-clover2-plugin
is missing.
[WARNING] 'reporting.plugins.plugin.version' for org.apache.maven.plugins:maven-javadoc-plugin
is missing.
[WARNING] 
[WARNING] Some problems were encountered while building the effective model for org.apache.cayenne:cayenne-parent:pom:3.1-SNAPSHOT
[WARNING] 'reporting.plugins.plugin.version' for com.atlassian.maven.plugins:maven-clover2-plugin
is missing. @ line 582, column 12
[WARNING] 'reporting.plugins.plugin.version' for org.apache.maven.plugins:maven-javadoc-plugin
is missing. @ line 607, column 12
[WARNING] 
[WARNING] It is highly recommended to fix these problems because they threaten the stability
of your build.
[WARNING] 
[WARNING] For this reason, future Maven versions might no longer support building such malformed
projects.
[WARNING] 
[INFO] ------------------------------------------------------------------------
[INFO] Reactor Build Order:
[INFO] 
[INFO] Cayenne
[INFO] Common Unit Test Utilities
[INFO] Cayenne Internal Build Plugin
[INFO] Cayenne Internal Documentation Build Plugin
[INFO] Cayenne Build Tools Parent
[INFO] Cayenne License and Notice Bundle
[INFO] Cayenne Dependency Injection Container
[INFO] Cayenne Java 1.5 Unpublished
[INFO] Cayenne Java 1.6 Extensions
[INFO] Cayenne Project
[INFO] Cayenne WebObjects Compatibility Library
[INFO] Cayenne Aggregated Server Jar
[INFO] Cayenne Aggregated Client Jar
[INFO] Cayenne Tools
[INFO] Cayenne Maven Plugin
[INFO] Cayenne Framework Aggregator Project
[INFO] Cayenne Integration Tests Parent
[INFO] Integration Tests - Cayenne Runtime
[INFO] Integration Tests - Cayenne Tools
[INFO] Cayenne Modeler
[INFO] Cayenne Modeler Maven Plugin
[INFO] Cayenne Modeler Parent
[INFO] Cayenne Tutorial
[INFO] Cayenne ROP Server Tutorial
[INFO] Cayenne ROP Client Tutorial
[INFO] Cayenne Tutorials
[INFO] Cayenne Documentation
[INFO] Cayenne Documenation Parent
Downloading: http://repo1.maven.org/maven2/org/codehaus/mojo/maven-metadata.xml
Downloading: http://repo1.maven.org/maven2/org/apache/maven/plugins/maven-metadata.xml
Downloading: http://repo1.maven.org/maven2/org/codehaus/mojo/maven-metadata.xml
Downloading: http://repo1.maven.org/maven2/org/apache/maven/plugins/maven-metadata.xml
4 KB   
8 KB   
8 KB   
12 KB   
13 KB   
17 KB   
17 KB   
        
Downloaded: http://repo1.maven.org/maven2/org/codehaus/mojo/maven-metadata.xml (17 KB at 51.6
KB/sec)
4 KB    
8 KB   
8 KB   
12 KB   
13 KB   
17 KB   
17 KB   
        
Downloaded: http://repo1.maven.org/maven2/org/codehaus/mojo/maven-metadata.xml (17 KB at 13.0
KB/sec)
4 KB    
8 KB   
9 KB   
       
Downloaded: http://repo1.maven.org/maven2/org/apache/maven/plugins/maven-metadata.xml (9 KB
at 3.6 KB/sec)
4 KB   
8 KB   
9 KB   
       
Downloaded: http://repo1.maven.org/maven2/org/apache/maven/plugins/maven-metadata.xml (9 KB
at 2.6 KB/sec)
Downloading: http://repo1.maven.org/maven2/org/apache/maven/plugins/maven-checkstyle-plugin/maven-metadata.xml
Downloading: http://repo1.maven.org/maven2/org/apache/maven/plugins/maven-checkstyle-plugin/maven-metadata.xml
595 B   
595 B   595 B   
                
Downloaded: http://repo1.maven.org/maven2/org/apache/maven/plugins/maven-checkstyle-plugin/maven-metadata.xml
(595 B at 0.5 KB/sec)
                
Downloaded: http://repo1.maven.org/maven2/org/apache/maven/plugins/maven-checkstyle-plugin/maven-metadata.xml
(595 B at 0.3 KB/sec)
Downloading: http://repo1.maven.org/maven2/org/codehaus/mojo/findbugs-maven-plugin/maven-metadata.xml
Downloading: http://repo1.maven.org/maven2/org/codehaus/mojo/findbugs-maven-plugin/maven-metadata.xml
648 B           
648 B   648 B   
                
Downloaded: http://repo1.maven.org/maven2/org/codehaus/mojo/findbugs-maven-plugin/maven-metadata.xml
(648 B at 0.6 KB/sec)
                
Downloaded: http://repo1.maven.org/maven2/org/codehaus/mojo/findbugs-maven-plugin/maven-metadata.xml
(648 B at 0.3 KB/sec)
[INFO]                                                                         
[INFO] ------------------------------------------------------------------------
[INFO] Building Cayenne 3.1-SNAPSHOT
[INFO] ------------------------------------------------------------------------
[INFO] 
[INFO] --- maven-clean-plugin:2.4.1:clean (default-clean) @ cayenne-parent ---
[INFO] Deleting <https://hudson.apache.org/hudson/job/Cayenne-doc/ws/trunk/target>
[INFO] 
[INFO] --- maven-install-plugin:2.3.1:install (default-install) @ cayenne-parent ---
[INFO] Installing <https://hudson.apache.org/hudson/job/Cayenne-doc/ws/trunk/pom.xml>
to /home/hudson/.m2/repository/org/apache/cayenne/cayenne-parent/3.1-SNAPSHOT/cayenne-parent-3.1-SNAPSHOT.pom
[INFO] 
[INFO] >>> maven-javadoc-plugin:2.6.1:javadoc (default-cli) @ cayenne-parent >>>
[INFO] 
[INFO] <<< maven-javadoc-plugin:2.6.1:javadoc (default-cli) @ cayenne-parent <<<
[INFO] 
[INFO] --- maven-javadoc-plugin:2.6.1:javadoc (default-cli) @ cayenne-parent ---
[INFO] 
[INFO] --- maven-checkstyle-plugin:2.6:checkstyle (default-cli) @ cayenne-parent ---
[INFO] 
[INFO] >>> findbugs-maven-plugin:2.3.1:findbugs (default-cli) @ cayenne-parent >>>
[INFO] 
[INFO] <<< findbugs-maven-plugin:2.3.1:findbugs (default-cli) @ cayenne-parent <<<
[INFO] 
[INFO] --- findbugs-maven-plugin:2.3.1:findbugs (default-cli) @ cayenne-parent ---
[INFO] 
[INFO] --- maven-clover2-plugin:2.6.3:setup (default-cli) @ cayenne-parent ---
[INFO] No 'maven.clover.licenseLocation' configured. Using default evaluation license.
[INFO]                                                                         
[INFO] ------------------------------------------------------------------------
[INFO] Skipping Cayenne
[INFO] This project has been banned from the build due to previous failures.
[INFO] ------------------------------------------------------------------------
[INFO]                                                                         
[INFO] ------------------------------------------------------------------------
[INFO] Skipping Cayenne
[INFO] This project has been banned from the build due to previous failures.
[INFO] ------------------------------------------------------------------------
[INFO] ------------------------------------------------------------------------
[INFO] Reactor Summary:
[INFO] 
[INFO] Cayenne ........................................... FAILURE [2.964s]
[INFO] Common Unit Test Utilities ........................ SKIPPED
[INFO] Cayenne Internal Build Plugin ..................... SKIPPED
[INFO] Cayenne Internal Documentation Build Plugin ....... SKIPPED
[INFO] Cayenne Build Tools Parent ........................ SKIPPED
[INFO] Cayenne License and Notice Bundle ................. SKIPPED
[INFO] Cayenne Dependency Injection Container ............ SKIPPED
[INFO] Cayenne Java 1.5 Unpublished ...................... SKIPPED
[INFO] Cayenne Java 1.6 Extensions ....................... SKIPPED
[INFO] Cayenne Project ................................... SKIPPED
[INFO] Cayenne WebObjects Compatibility Library .......... SKIPPED
[INFO] Cayenne Aggregated Server Jar ..................... SKIPPED
[INFO] Cayenne Aggregated Client Jar ..................... SKIPPED
[INFO] Cayenne Tools ..................................... SKIPPED
[INFO] Cayenne Maven Plugin .............................. SKIPPED
[INFO] Cayenne Framework Aggregator Project .............. SKIPPED
[INFO] Cayenne Integration Tests Parent .................. SKIPPED
[INFO] Integration Tests - Cayenne Runtime ............... SKIPPED
[INFO] Integration Tests - Cayenne Tools ................. SKIPPED
[INFO] Cayenne Modeler ................................... SKIPPED
[INFO] Cayenne Modeler Maven Plugin ...................... SKIPPED
[INFO] Cayenne Modeler Parent ............................ SKIPPED
[INFO] Cayenne Tutorial .................................. SKIPPED
[INFO] Cayenne ROP Server Tutorial ....................... SKIPPED
[INFO] Cayenne ROP Client Tutorial ....................... SKIPPED
[INFO] Cayenne Tutorials ................................. SKIPPED
[INFO] Cayenne Documentation ............................. SKIPPED
[INFO] Cayenne Documenation Parent ....................... SKIPPED
[INFO] ------------------------------------------------------------------------
[INFO] BUILD FAILURE
[INFO] ------------------------------------------------------------------------
[INFO] Total time: 11.425s
[INFO] Finished at: Fri Jan 28 00:23:29 UTC 2011
[INFO] Final Memory: 21M/180M
[INFO] ------------------------------------------------------------------------
[ERROR] Failed to execute goal com.atlassian.maven.plugins:maven-clover2-plugin:2.6.3:setup
(default-cli) on project cayenne-parent: Failed to load resource as file [/clover.license]:
Could not find resource '/clover.license'. -> [Help 1]
[ERROR] 
[ERROR] To see the full stack trace of the errors, re-run Maven with the -e switch.
[ERROR] Re-run Maven using the -X switch to enable full debug logging.
[ERROR] 
[ERROR] For more information about the errors and possible solutions, please read the following
articles:
[ERROR] [Help 1] http://cwiki.apache.org/confluence/display/MAVEN/MojoExecutionException
Publishing Javadoc
Publishing Clover coverage report...
No Clover report will be published due to a Build Failure


Mime
View raw message