cayenne-commits mailing list archives

Site index · List index
Message view « Date » · « Thread »
Top « Date » · « Thread »
From Apache Hudson Server <hud...@hudson.apache.org>
Subject Build failed in Jenkins: Cayenne-trunk » HSQLDB,JDK 1.6 (latest),Ubuntu #444
Date Mon, 21 Mar 2011 21:48:32 GMT
See <https://hudson.apache.org/hudson/job/Cayenne-trunk/./cayenneTestConnection=HSQLDB,jdk=JDK%201.6%20(latest),label=Ubuntu/444/changes>

Changes:

[aadamchik] CAY-1547 cayenne-lifecycle: support for setting UuidRelationships

a test inserting related UUID related objects

------------------------------------------
[...truncated 67502 lines...]
[INFO] Setting property: resource.manager.logwhenfound => 'false'.
[INFO] [remote-resources:process {execution: default}]
[INFO] [compiler:compile {execution: default-compile}]
[INFO] Compiling 28 source files to <https://hudson.apache.org/hudson/job/Cayenne-trunk/./cayenneTestConnection=HSQLDB,jdk=JDK%201.6%20(latest),label=Ubuntu/ws/trunk/framework/cayenne-tools/target/classes>
[INFO] [resources:testResources {execution: default-testResources}]
[INFO] Using 'UTF-8' encoding to copy filtered resources.
[INFO] Copying 5 resources
[INFO] Copying 54 resources
[INFO] [compiler:testCompile {execution: default-testCompile}]
[INFO] Compiling 9 source files to <https://hudson.apache.org/hudson/job/Cayenne-trunk/./cayenneTestConnection=HSQLDB,jdk=JDK%201.6%20(latest),label=Ubuntu/ws/trunk/framework/cayenne-tools/target/test-classes>
[INFO] [surefire:test {execution: default-test}]
[INFO] Surefire report directory: <https://hudson.apache.org/hudson/job/Cayenne-trunk/./cayenneTestConnection=HSQLDB,jdk=JDK%201.6%20(latest),label=Ubuntu/ws/trunk/framework/cayenne-tools/target/surefire-reports>

-------------------------------------------------------
 T E S T S
-------------------------------------------------------
Running org.apache.cayenne.tools.CayenneGeneratorTaskTest
Tests run: 7, Failures: 0, Errors: 0, Skipped: 0, Time elapsed: 1.285 sec
Running org.apache.cayenne.tools.AntDataPortDelegateTest
Tests run: 1, Failures: 0, Errors: 0, Skipped: 0, Time elapsed: 0.006 sec
Running org.apache.cayenne.gen.ClassGenerationActionTest
Tests run: 7, Failures: 0, Errors: 0, Skipped: 0, Time elapsed: 0.133 sec
Running org.apache.cayenne.tools.NamePatternMatcherTest
Tests run: 3, Failures: 0, Errors: 0, Skipped: 0, Time elapsed: 0.004 sec
Running org.apache.cayenne.map.naming.SmartNamingStrategyTest
Tests run: 1, Failures: 0, Errors: 0, Skipped: 0, Time elapsed: 0.028 sec
Running org.apache.cayenne.access.AbstractDbLoaderDelegateTest
Tests run: 5, Failures: 0, Errors: 0, Skipped: 0, Time elapsed: 0.006 sec
Running org.apache.cayenne.tools.DbGeneratorTaskTest
Tests run: 4, Failures: 0, Errors: 0, Skipped: 0, Time elapsed: 0.038 sec
Running org.apache.cayenne.tools.CayenneGeneratorTaskCrossMapRelationshipsTest
Tests run: 1, Failures: 0, Errors: 0, Skipped: 0, Time elapsed: 0.034 sec
Running org.apache.cayenne.gen.ImportUtilsTest
Tests run: 14, Failures: 0, Errors: 0, Skipped: 0, Time elapsed: 0.005 sec

Results :

Tests run: 43, Failures: 0, Errors: 0, Skipped: 0

[INFO] [jar:jar {execution: default-jar}]
[INFO] Building jar: <https://hudson.apache.org/hudson/job/Cayenne-trunk/./cayenneTestConnection=HSQLDB,jdk=JDK%201.6%20(latest),label=Ubuntu/ws/trunk/framework/cayenne-tools/target/cayenne-tools-3.1-SNAPSHOT.jar>
[INFO] Preparing source:jar
[WARNING] Removing: jar from forked lifecycle, to prevent recursive invocation.
[INFO] No goals needed for project - skipping
[INFO] [source:jar {execution: bundle-source-jar}]
[INFO] Building jar: <https://hudson.apache.org/hudson/job/Cayenne-trunk/./cayenneTestConnection=HSQLDB,jdk=JDK%201.6%20(latest),label=Ubuntu/ws/trunk/framework/cayenne-tools/target/cayenne-tools-3.1-SNAPSHOT-sources.jar>
[INFO] [install:install {execution: default-install}]
[INFO] Installing <https://hudson.apache.org/hudson/job/Cayenne-trunk/./cayenneTestConnection=HSQLDB,jdk=JDK%201.6%20(latest),label=Ubuntu/ws/trunk/framework/cayenne-tools/target/cayenne-tools-3.1-SNAPSHOT.jar>
to /home/hudson/.m2/repository/org/apache/cayenne/cayenne-tools/3.1-SNAPSHOT/cayenne-tools-3.1-SNAPSHOT.jar
[INFO] Installing <https://hudson.apache.org/hudson/job/Cayenne-trunk/./cayenneTestConnection=HSQLDB,jdk=JDK%201.6%20(latest),label=Ubuntu/ws/trunk/framework/cayenne-tools/target/cayenne-tools-3.1-SNAPSHOT-sources.jar>
to /home/hudson/.m2/repository/org/apache/cayenne/cayenne-tools/3.1-SNAPSHOT/cayenne-tools-3.1-SNAPSHOT-sources.jar
[INFO] ------------------------------------------------------------------------
[INFO] Building Library: cayenne-lifecycle
[INFO]    task-segment: [clean, install]
[INFO] ------------------------------------------------------------------------
[INFO] [clean:clean {execution: default-clean}]
[INFO] [resources:resources {execution: default-resources}]
[INFO] Using 'UTF-8' encoding to copy filtered resources.
[INFO] skip non existing resourceDirectory <https://hudson.apache.org/hudson/job/Cayenne-trunk/./cayenneTestConnection=HSQLDB,jdk=JDK%201.6%20(latest),label=Ubuntu/ws/trunk/framework/cayenne-lifecycle/src/main/resources>
[INFO] [remote-resources:process {execution: default}]
[INFO] [compiler:compile {execution: default-compile}]
[INFO] Compiling 22 source files to <https://hudson.apache.org/hudson/job/Cayenne-trunk/./cayenneTestConnection=HSQLDB,jdk=JDK%201.6%20(latest),label=Ubuntu/ws/trunk/framework/cayenne-lifecycle/target/classes>
[INFO] [resources:testResources {execution: default-testResources}]
[INFO] Using 'UTF-8' encoding to copy filtered resources.
[INFO] Copying 2 resources
[INFO] Copying 29 resources
[INFO] [compiler:testCompile {execution: default-testCompile}]
[INFO] Compiling 13 source files to <https://hudson.apache.org/hudson/job/Cayenne-trunk/./cayenneTestConnection=HSQLDB,jdk=JDK%201.6%20(latest),label=Ubuntu/ws/trunk/framework/cayenne-lifecycle/target/test-classes>
[INFO] [surefire:test {execution: default-test}]
[INFO] Surefire report directory: <https://hudson.apache.org/hudson/job/Cayenne-trunk/./cayenneTestConnection=HSQLDB,jdk=JDK%201.6%20(latest),label=Ubuntu/ws/trunk/framework/cayenne-lifecycle/target/surefire-reports>

-------------------------------------------------------
 T E S T S
-------------------------------------------------------
Running org.apache.cayenne.lifecycle.relationship.UuidRelationshipHandlerTest
Mar 21, 2011 9:48:27 PM org.apache.cayenne.configuration.XMLDataChannelDescriptorLoader load
INFO: Loading XML configuration resource from <https://hudson.apache.org/hudson/job/Cayenne-trunk/./cayenneTestConnection=HSQLDB,jdk=JDK%201.6%20(latest),label=Ubuntu/ws/trunk/framework/cayenne-lifecycle/target/test-classes/cayenne-lifecycle.xml>
Mar 21, 2011 9:48:27 PM org.apache.cayenne.configuration.XMLDataChannelDescriptorLoader$DataSourceChildrenHandler
createChildTagHandler
INFO: loading user name and password.
Mar 21, 2011 9:48:27 PM org.apache.cayenne.log.CommonsJdbcEventLogger logPoolCreated
INFO: Created connection pool: jdbc:hsqldb:mem:lifecycle
	Driver class: org.hsqldb.jdbcDriver
	Min. connections in the pool: 1
	Max. connections in the pool: 1
Mar 21, 2011 9:48:27 PM org.apache.cayenne.test.jdbc.UtilityLogger log
INFO: delete from UUID_ROOT1
Mar 21, 2011 9:48:27 PM org.apache.cayenne.log.CommonsJdbcEventLogger logConnect
INFO: Opening connection: jdbc:hsqldb:mem:lifecycle
	Login: sa
	Password: *******
Mar 21, 2011 9:48:27 PM org.apache.cayenne.log.CommonsJdbcEventLogger logConnectSuccess
INFO: +++ Connecting: SUCCESS.
Mar 21, 2011 9:48:27 PM org.apache.cayenne.log.CommonsJdbcEventLogger log
INFO: Detected and installed adapter: org.apache.cayenne.dba.hsqldb.HSQLDBAdapter
Mar 21, 2011 9:48:27 PM org.apache.cayenne.access.dbsync.CreateIfNoSchemaStrategy processSchemaUpdate
INFO: No schema detected, will create mapped tables
Mar 21, 2011 9:48:27 PM org.apache.cayenne.log.CommonsJdbcEventLogger logQuery
INFO: CREATE CACHED TABLE E1 (ID BIGINT NOT NULL, PRIMARY KEY (ID))
Mar 21, 2011 9:48:27 PM org.apache.cayenne.log.CommonsJdbcEventLogger logQuery
INFO: CREATE CACHED TABLE E2 (ID BIGINT NOT NULL, PRIMARY KEY (ID))
Mar 21, 2011 9:48:27 PM org.apache.cayenne.log.CommonsJdbcEventLogger logQuery
INFO: CREATE CACHED TABLE UUID_ROOT1 (ID INTEGER NOT NULL, UUID VARCHAR(200) NULL, PRIMARY
KEY (ID))
Mar 21, 2011 9:48:27 PM org.apache.cayenne.log.CommonsJdbcEventLogger logQuery
INFO: CREATE TABLE AUTO_PK_SUPPORT (  TABLE_NAME CHAR(100) NOT NULL,  NEXT_ID BIGINT NOT NULL,
 PRIMARY KEY(TABLE_NAME))
Mar 21, 2011 9:48:27 PM org.apache.cayenne.log.CommonsJdbcEventLogger logQuery
INFO: DELETE FROM AUTO_PK_SUPPORT WHERE TABLE_NAME IN ('E1', 'E2', 'UUID_ROOT1')
Mar 21, 2011 9:48:27 PM org.apache.cayenne.log.CommonsJdbcEventLogger logQuery
INFO: INSERT INTO AUTO_PK_SUPPORT (TABLE_NAME, NEXT_ID) VALUES ('E1', 200)
Mar 21, 2011 9:48:27 PM org.apache.cayenne.log.CommonsJdbcEventLogger logQuery
INFO: INSERT INTO AUTO_PK_SUPPORT (TABLE_NAME, NEXT_ID) VALUES ('E2', 200)
Mar 21, 2011 9:48:27 PM org.apache.cayenne.log.CommonsJdbcEventLogger logQuery
INFO: INSERT INTO AUTO_PK_SUPPORT (TABLE_NAME, NEXT_ID) VALUES ('UUID_ROOT1', 200)
Mar 21, 2011 9:48:27 PM org.apache.cayenne.test.jdbc.UtilityLogger log
INFO: delete from E1
Mar 21, 2011 9:48:27 PM org.apache.cayenne.test.jdbc.UtilityLogger log
INFO: INSERT INTO E1 (ID) VALUES (?)
Mar 21, 2011 9:48:27 PM org.apache.cayenne.log.CommonsJdbcEventLogger logBeginTransaction
INFO: --- transaction started.
Mar 21, 2011 9:48:27 PM org.apache.cayenne.log.CommonsJdbcEventLogger logQuery
INFO: SELECT t0.ID FROM E1 t0 - prepared in 15 ms.
Mar 21, 2011 9:48:27 PM org.apache.cayenne.log.CommonsJdbcEventLogger logSelectCount
INFO: === returned 1 row. - took 21 ms.
Mar 21, 2011 9:48:27 PM org.apache.cayenne.log.CommonsJdbcEventLogger logCommitTransaction
INFO: +++ transaction committed.
Mar 21, 2011 9:48:27 PM org.apache.cayenne.log.CommonsJdbcEventLogger logBeginTransaction
INFO: --- transaction started.
Mar 21, 2011 9:48:27 PM org.apache.cayenne.log.CommonsJdbcEventLogger logQuery
INFO: SELECT NEXT_ID FROM AUTO_PK_SUPPORT WHERE TABLE_NAME = 'UUID_ROOT1'
Mar 21, 2011 9:48:27 PM org.apache.cayenne.log.CommonsJdbcEventLogger logSelectCount
INFO: === returned 1 row. - took 3 ms.
Mar 21, 2011 9:48:27 PM org.apache.cayenne.log.CommonsJdbcEventLogger logQuery
INFO: UPDATE AUTO_PK_SUPPORT SET NEXT_ID = NEXT_ID + 20 WHERE TABLE_NAME = 'UUID_ROOT1'
Mar 21, 2011 9:48:27 PM org.apache.cayenne.log.CommonsJdbcEventLogger logUpdateCount
INFO: === updated 1 row.
Mar 21, 2011 9:48:27 PM org.apache.cayenne.log.CommonsJdbcEventLogger logQuery
INFO: INSERT INTO UUID_ROOT1 (ID, UUID) VALUES (?, ?)
Mar 21, 2011 9:48:27 PM org.apache.cayenne.log.CommonsJdbcEventLogger logQueryParameters
INFO: [bind: 1->ID:200, 2->UUID:'E1:1']
Mar 21, 2011 9:48:27 PM org.apache.cayenne.log.CommonsJdbcEventLogger logUpdateCount
INFO: === updated 1 row.
Mar 21, 2011 9:48:27 PM org.apache.cayenne.log.CommonsJdbcEventLogger logCommitTransaction
INFO: +++ transaction committed.
Mar 21, 2011 9:48:27 PM org.apache.cayenne.test.jdbc.UtilityLogger log
INFO: select ID, UUID from UUID_ROOT1
Mar 21, 2011 9:48:27 PM org.apache.cayenne.configuration.XMLDataChannelDescriptorLoader load
INFO: Loading XML configuration resource from <https://hudson.apache.org/hudson/job/Cayenne-trunk/./cayenneTestConnection=HSQLDB,jdk=JDK%201.6%20(latest),label=Ubuntu/ws/trunk/framework/cayenne-lifecycle/target/test-classes/cayenne-lifecycle.xml>
Mar 21, 2011 9:48:27 PM org.apache.cayenne.configuration.XMLDataChannelDescriptorLoader$DataSourceChildrenHandler
createChildTagHandler
INFO: loading user name and password.
Mar 21, 2011 9:48:27 PM org.apache.cayenne.log.CommonsJdbcEventLogger logPoolCreated
INFO: Created connection pool: jdbc:hsqldb:mem:lifecycle
	Driver class: org.hsqldb.jdbcDriver
	Min. connections in the pool: 1
	Max. connections in the pool: 1
Mar 21, 2011 9:48:27 PM org.apache.cayenne.test.jdbc.UtilityLogger log
INFO: delete from UUID_ROOT1
Mar 21, 2011 9:48:27 PM org.apache.cayenne.log.CommonsJdbcEventLogger logConnect
INFO: Opening connection: jdbc:hsqldb:mem:lifecycle
	Login: sa
	Password: *******
Mar 21, 2011 9:48:27 PM org.apache.cayenne.log.CommonsJdbcEventLogger logConnectSuccess
INFO: +++ Connecting: SUCCESS.
Mar 21, 2011 9:48:27 PM org.apache.cayenne.log.CommonsJdbcEventLogger log
INFO: Detected and installed adapter: org.apache.cayenne.dba.hsqldb.HSQLDBAdapter
Mar 21, 2011 9:48:27 PM org.apache.cayenne.access.dbsync.CreateIfNoSchemaStrategy processSchemaUpdate
INFO: Full or partial schema detected, skipping tables creation
Mar 21, 2011 9:48:27 PM org.apache.cayenne.test.jdbc.UtilityLogger log
INFO: delete from E1
Tests run: 2, Failures: 0, Errors: 1, Skipped: 0, Time elapsed: 0.722 sec <<< FAILURE!
Running org.apache.cayenne.lifecycle.audit.AuditableFilterTest
Tests run: 6, Failures: 0, Errors: 0, Skipped: 0, Time elapsed: 0.16 sec
Running org.apache.cayenne.lifecycle.ref.ReferenceableHandlerTest
Mar 21, 2011 9:48:28 PM org.apache.cayenne.configuration.XMLDataChannelDescriptorLoader load
INFO: Loading XML configuration resource from <https://hudson.apache.org/hudson/job/Cayenne-trunk/./cayenneTestConnection=HSQLDB,jdk=JDK%201.6%20(latest),label=Ubuntu/ws/trunk/framework/cayenne-lifecycle/target/test-classes/cayenne-lifecycle.xml>
Mar 21, 2011 9:48:28 PM org.apache.cayenne.configuration.XMLDataChannelDescriptorLoader$DataSourceChildrenHandler
createChildTagHandler
INFO: loading user name and password.
Mar 21, 2011 9:48:28 PM org.apache.cayenne.log.CommonsJdbcEventLogger logPoolCreated
INFO: Created connection pool: jdbc:hsqldb:mem:lifecycle
	Driver class: org.hsqldb.jdbcDriver
	Min. connections in the pool: 1
	Max. connections in the pool: 1
Mar 21, 2011 9:48:28 PM org.apache.cayenne.configuration.XMLDataChannelDescriptorLoader load
INFO: Loading XML configuration resource from <https://hudson.apache.org/hudson/job/Cayenne-trunk/./cayenneTestConnection=HSQLDB,jdk=JDK%201.6%20(latest),label=Ubuntu/ws/trunk/framework/cayenne-lifecycle/target/test-classes/cayenne-lifecycle.xml>
Mar 21, 2011 9:48:28 PM org.apache.cayenne.configuration.XMLDataChannelDescriptorLoader$DataSourceChildrenHandler
createChildTagHandler
INFO: loading user name and password.
Mar 21, 2011 9:48:28 PM org.apache.cayenne.log.CommonsJdbcEventLogger logPoolCreated
INFO: Created connection pool: jdbc:hsqldb:mem:lifecycle
	Driver class: org.hsqldb.jdbcDriver
	Min. connections in the pool: 1
	Max. connections in the pool: 1
Mar 21, 2011 9:48:28 PM org.apache.cayenne.configuration.XMLDataChannelDescriptorLoader load
INFO: Loading XML configuration resource from <https://hudson.apache.org/hudson/job/Cayenne-trunk/./cayenneTestConnection=HSQLDB,jdk=JDK%201.6%20(latest),label=Ubuntu/ws/trunk/framework/cayenne-lifecycle/target/test-classes/cayenne-lifecycle.xml>
Mar 21, 2011 9:48:28 PM org.apache.cayenne.configuration.XMLDataChannelDescriptorLoader$DataSourceChildrenHandler
createChildTagHandler
INFO: loading user name and password.
Mar 21, 2011 9:48:28 PM org.apache.cayenne.log.CommonsJdbcEventLogger logPoolCreated
INFO: Created connection pool: jdbc:hsqldb:mem:lifecycle
	Driver class: org.hsqldb.jdbcDriver
	Min. connections in the pool: 1
	Max. connections in the pool: 1
Tests run: 3, Failures: 0, Errors: 0, Skipped: 0, Time elapsed: 0.045 sec
Running org.apache.cayenne.lifecycle.uuid.UuidCoderTest
Tests run: 5, Failures: 0, Errors: 0, Skipped: 0, Time elapsed: 0.043 sec

Results :

Tests in error: 
  testRelate_New(org.apache.cayenne.lifecycle.relationship.UuidRelationshipHandlerTest)

Tests run: 16, Failures: 0, Errors: 1, Skipped: 0

[INFO] ------------------------------------------------------------------------
[ERROR] BUILD FAILURE
[INFO] ------------------------------------------------------------------------
[INFO] There are test failures.

Please refer to <https://hudson.apache.org/hudson/job/Cayenne-trunk/./cayenneTestConnection=HSQLDB,jdk=JDK%201.6%20(latest),label=Ubuntu/ws/trunk/framework/cayenne-lifecycle/target/surefire-reports>
for the individual test results.
[INFO] ------------------------------------------------------------------------
[INFO] Trace
org.apache.maven.BuildFailureException: There are test failures.

Please refer to <https://hudson.apache.org/hudson/job/Cayenne-trunk/./cayenneTestConnection=HSQLDB,jdk=JDK%201.6%20(latest),label=Ubuntu/ws/trunk/framework/cayenne-lifecycle/target/surefire-reports>
for the individual test results.
	at org.apache.maven.lifecycle.DefaultLifecycleExecutor.executeGoals(DefaultLifecycleExecutor.java:715)
	at org.apache.maven.lifecycle.DefaultLifecycleExecutor.executeGoalWithLifecycle(DefaultLifecycleExecutor.java:556)
	at org.apache.maven.lifecycle.DefaultLifecycleExecutor.executeGoal(DefaultLifecycleExecutor.java:535)
	at org.apache.maven.lifecycle.DefaultLifecycleExecutor.executeGoalAndHandleFailures(DefaultLifecycleExecutor.java:387)
	at org.apache.maven.lifecycle.DefaultLifecycleExecutor.executeTaskSegments(DefaultLifecycleExecutor.java:348)
	at org.apache.maven.lifecycle.DefaultLifecycleExecutor.execute(DefaultLifecycleExecutor.java:180)
	at org.apache.maven.DefaultMaven.doExecute(DefaultMaven.java:328)
	at org.apache.maven.DefaultMaven.execute(DefaultMaven.java:138)
	at org.apache.maven.cli.MavenCli.main(MavenCli.java:362)
	at org.apache.maven.cli.compat.CompatibleMain.main(CompatibleMain.java:60)
	at sun.reflect.NativeMethodAccessorImpl.invoke0(Native Method)
	at sun.reflect.NativeMethodAccessorImpl.invoke(NativeMethodAccessorImpl.java:39)
	at sun.reflect.DelegatingMethodAccessorImpl.invoke(DelegatingMethodAccessorImpl.java:25)
	at java.lang.reflect.Method.invoke(Method.java:597)
	at org.codehaus.classworlds.Launcher.launchEnhanced(Launcher.java:315)
	at org.codehaus.classworlds.Launcher.launch(Launcher.java:255)
	at org.codehaus.classworlds.Launcher.mainWithExitCode(Launcher.java:430)
	at org.codehaus.classworlds.Launcher.main(Launcher.java:375)
Caused by: org.apache.maven.plugin.MojoFailureException: There are test failures.

Please refer to <https://hudson.apache.org/hudson/job/Cayenne-trunk/./cayenneTestConnection=HSQLDB,jdk=JDK%201.6%20(latest),label=Ubuntu/ws/trunk/framework/cayenne-lifecycle/target/surefire-reports>
for the individual test results.
	at org.apache.maven.plugin.surefire.SurefirePlugin.execute(SurefirePlugin.java:629)
	at org.apache.maven.plugin.DefaultPluginManager.executeMojo(DefaultPluginManager.java:490)
	at org.apache.maven.lifecycle.DefaultLifecycleExecutor.executeGoals(DefaultLifecycleExecutor.java:694)
	... 17 more
[INFO] ------------------------------------------------------------------------
[INFO] Total time: 1 minute 36 seconds
[INFO] Finished at: Mon Mar 21 21:48:28 UTC 2011
[INFO] Final Memory: 105M/436M
[INFO] ------------------------------------------------------------------------
Recording test results


Mime
View raw message