cayenne-commits mailing list archives

Site index · List index
Message view « Date » · « Thread »
Top « Date » · « Thread »
From Apache Hudson Server <hud...@hudson.apache.org>
Subject Build failed in Jenkins: Cayenne-trunk » h2,JDK 1.5 (latest),Ubuntu #439
Date Mon, 07 Mar 2011 13:57:32 GMT
See <https://hudson.apache.org/hudson/job/Cayenne-trunk/./cayenneTestConnection=h2,jdk=JDK%201.5%20(latest),label=Ubuntu/439/changes>

Changes:

[mgentry] Fixed typo.

------------------------------------------
[...truncated 68086 lines...]
[INFO] Generating superclass file: <https://hudson.apache.org/hudson/job/Cayenne-trunk/./cayenneTestConnection=h2,jdk=JDK%201.5%20(latest),label=Ubuntu/ws/trunk/itests/cayenne-tools-itest/target/generated-tests/pairs2/_CompoundFkTestEntity.java>
[INFO] Generating class file: <https://hudson.apache.org/hudson/job/Cayenne-trunk/./cayenneTestConnection=h2,jdk=JDK%201.5%20(latest),label=Ubuntu/ws/trunk/itests/cayenne-tools-itest/target/generated-tests/pairs2/CompoundFkTestEntity.java>
[INFO] Generating superclass file: <https://hudson.apache.org/hudson/job/Cayenne-trunk/./cayenneTestConnection=h2,jdk=JDK%201.5%20(latest),label=Ubuntu/ws/trunk/itests/cayenne-tools-itest/target/generated-tests/pairs2/_CompoundPainting.java>
[INFO] Generating class file: <https://hudson.apache.org/hudson/job/Cayenne-trunk/./cayenneTestConnection=h2,jdk=JDK%201.5%20(latest),label=Ubuntu/ws/trunk/itests/cayenne-tools-itest/target/generated-tests/pairs2/CompoundPainting.java>
[INFO] Generating superclass file: <https://hudson.apache.org/hudson/job/Cayenne-trunk/./cayenneTestConnection=h2,jdk=JDK%201.5%20(latest),label=Ubuntu/ws/trunk/itests/cayenne-tools-itest/target/generated-tests/pairs2/_CompoundPkTestEntity.java>
[INFO] Generating class file: <https://hudson.apache.org/hudson/job/Cayenne-trunk/./cayenneTestConnection=h2,jdk=JDK%201.5%20(latest),label=Ubuntu/ws/trunk/itests/cayenne-tools-itest/target/generated-tests/pairs2/CompoundPkTestEntity.java>
[INFO] Generating superclass file: <https://hudson.apache.org/hudson/job/Cayenne-trunk/./cayenneTestConnection=h2,jdk=JDK%201.5%20(latest),label=Ubuntu/ws/trunk/itests/cayenne-tools-itest/target/generated-tests/pairs2/_DateTestEntity.java>
[INFO] Generating class file: <https://hudson.apache.org/hudson/job/Cayenne-trunk/./cayenneTestConnection=h2,jdk=JDK%201.5%20(latest),label=Ubuntu/ws/trunk/itests/cayenne-tools-itest/target/generated-tests/pairs2/DateTestEntity.java>
[INFO] Generating superclass file: <https://hudson.apache.org/hudson/job/Cayenne-trunk/./cayenneTestConnection=h2,jdk=JDK%201.5%20(latest),label=Ubuntu/ws/trunk/itests/cayenne-tools-itest/target/generated-tests/pairs2/_DecimalPKTest1.java>
[INFO] Generating class file: <https://hudson.apache.org/hudson/job/Cayenne-trunk/./cayenneTestConnection=h2,jdk=JDK%201.5%20(latest),label=Ubuntu/ws/trunk/itests/cayenne-tools-itest/target/generated-tests/pairs2/DecimalPKTest1.java>
[INFO] Generating superclass file: <https://hudson.apache.org/hudson/job/Cayenne-trunk/./cayenneTestConnection=h2,jdk=JDK%201.5%20(latest),label=Ubuntu/ws/trunk/itests/cayenne-tools-itest/target/generated-tests/pairs2/_DecimalPKTestEntity.java>
[INFO] Generating class file: <https://hudson.apache.org/hudson/job/Cayenne-trunk/./cayenneTestConnection=h2,jdk=JDK%201.5%20(latest),label=Ubuntu/ws/trunk/itests/cayenne-tools-itest/target/generated-tests/pairs2/DecimalPKTestEntity.java>
[INFO] Generating superclass file: <https://hudson.apache.org/hudson/job/Cayenne-trunk/./cayenneTestConnection=h2,jdk=JDK%201.5%20(latest),label=Ubuntu/ws/trunk/itests/cayenne-tools-itest/target/generated-tests/pairs2/_EnumEntity.java>
[INFO] Generating class file: <https://hudson.apache.org/hudson/job/Cayenne-trunk/./cayenneTestConnection=h2,jdk=JDK%201.5%20(latest),label=Ubuntu/ws/trunk/itests/cayenne-tools-itest/target/generated-tests/pairs2/EnumEntity.java>
[INFO] Generating superclass file: <https://hudson.apache.org/hudson/job/Cayenne-trunk/./cayenneTestConnection=h2,jdk=JDK%201.5%20(latest),label=Ubuntu/ws/trunk/itests/cayenne-tools-itest/target/generated-tests/pairs2/_Exhibit.java>
[INFO] Generating class file: <https://hudson.apache.org/hudson/job/Cayenne-trunk/./cayenneTestConnection=h2,jdk=JDK%201.5%20(latest),label=Ubuntu/ws/trunk/itests/cayenne-tools-itest/target/generated-tests/pairs2/Exhibit.java>
[INFO] Generating superclass file: <https://hudson.apache.org/hudson/job/Cayenne-trunk/./cayenneTestConnection=h2,jdk=JDK%201.5%20(latest),label=Ubuntu/ws/trunk/itests/cayenne-tools-itest/target/generated-tests/pairs2/_ExtendedTypeEntity.java>
[INFO] Generating class file: <https://hudson.apache.org/hudson/job/Cayenne-trunk/./cayenneTestConnection=h2,jdk=JDK%201.5%20(latest),label=Ubuntu/ws/trunk/itests/cayenne-tools-itest/target/generated-tests/pairs2/ExtendedTypeEntity.java>
[INFO] Generating superclass file: <https://hudson.apache.org/hudson/job/Cayenne-trunk/./cayenneTestConnection=h2,jdk=JDK%201.5%20(latest),label=Ubuntu/ws/trunk/itests/cayenne-tools-itest/target/generated-tests/pairs2/_Gallery.java>
[INFO] Generating class file: <https://hudson.apache.org/hudson/job/Cayenne-trunk/./cayenneTestConnection=h2,jdk=JDK%201.5%20(latest),label=Ubuntu/ws/trunk/itests/cayenne-tools-itest/target/generated-tests/pairs2/Gallery.java>
[INFO] Generating superclass file: <https://hudson.apache.org/hudson/job/Cayenne-trunk/./cayenneTestConnection=h2,jdk=JDK%201.5%20(latest),label=Ubuntu/ws/trunk/itests/cayenne-tools-itest/target/generated-tests/pairs2/_GeneratedColumnCompKey.java>
[INFO] Generating class file: <https://hudson.apache.org/hudson/job/Cayenne-trunk/./cayenneTestConnection=h2,jdk=JDK%201.5%20(latest),label=Ubuntu/ws/trunk/itests/cayenne-tools-itest/target/generated-tests/pairs2/GeneratedColumnCompKey.java>
[INFO] Generating superclass file: <https://hudson.apache.org/hudson/job/Cayenne-trunk/./cayenneTestConnection=h2,jdk=JDK%201.5%20(latest),label=Ubuntu/ws/trunk/itests/cayenne-tools-itest/target/generated-tests/pairs2/_GeneratedColumnCompMaster.java>
[INFO] Generating class file: <https://hudson.apache.org/hudson/job/Cayenne-trunk/./cayenneTestConnection=h2,jdk=JDK%201.5%20(latest),label=Ubuntu/ws/trunk/itests/cayenne-tools-itest/target/generated-tests/pairs2/GeneratedColumnCompMaster.java>
[INFO] Generating superclass file: <https://hudson.apache.org/hudson/job/Cayenne-trunk/./cayenneTestConnection=h2,jdk=JDK%201.5%20(latest),label=Ubuntu/ws/trunk/itests/cayenne-tools-itest/target/generated-tests/pairs2/_GeneratedColumnDep.java>
[INFO] Generating class file: <https://hudson.apache.org/hudson/job/Cayenne-trunk/./cayenneTestConnection=h2,jdk=JDK%201.5%20(latest),label=Ubuntu/ws/trunk/itests/cayenne-tools-itest/target/generated-tests/pairs2/GeneratedColumnDep.java>
[INFO] Generating superclass file: <https://hudson.apache.org/hudson/job/Cayenne-trunk/./cayenneTestConnection=h2,jdk=JDK%201.5%20(latest),label=Ubuntu/ws/trunk/itests/cayenne-tools-itest/target/generated-tests/pairs2/_GeneratedColumnTest2.java>
[INFO] Generating class file: <https://hudson.apache.org/hudson/job/Cayenne-trunk/./cayenneTestConnection=h2,jdk=JDK%201.5%20(latest),label=Ubuntu/ws/trunk/itests/cayenne-tools-itest/target/generated-tests/pairs2/GeneratedColumnTest2.java>
[INFO] Generating superclass file: <https://hudson.apache.org/hudson/job/Cayenne-trunk/./cayenneTestConnection=h2,jdk=JDK%201.5%20(latest),label=Ubuntu/ws/trunk/itests/cayenne-tools-itest/target/generated-tests/pairs2/_GeneratedColumnTestEntity.java>
[INFO] Generating class file: <https://hudson.apache.org/hudson/job/Cayenne-trunk/./cayenneTestConnection=h2,jdk=JDK%201.5%20(latest),label=Ubuntu/ws/trunk/itests/cayenne-tools-itest/target/generated-tests/pairs2/GeneratedColumnTestEntity.java>
[INFO] Generating superclass file: <https://hudson.apache.org/hudson/job/Cayenne-trunk/./cayenneTestConnection=h2,jdk=JDK%201.5%20(latest),label=Ubuntu/ws/trunk/itests/cayenne-tools-itest/target/generated-tests/pairs2/_GeneratedF1.java>
[INFO] Generating class file: <https://hudson.apache.org/hudson/job/Cayenne-trunk/./cayenneTestConnection=h2,jdk=JDK%201.5%20(latest),label=Ubuntu/ws/trunk/itests/cayenne-tools-itest/target/generated-tests/pairs2/GeneratedF1.java>
[INFO] Generating superclass file: <https://hudson.apache.org/hudson/job/Cayenne-trunk/./cayenneTestConnection=h2,jdk=JDK%201.5%20(latest),label=Ubuntu/ws/trunk/itests/cayenne-tools-itest/target/generated-tests/pairs2/_GeneratedF2.java>
[INFO] Generating class file: <https://hudson.apache.org/hudson/job/Cayenne-trunk/./cayenneTestConnection=h2,jdk=JDK%201.5%20(latest),label=Ubuntu/ws/trunk/itests/cayenne-tools-itest/target/generated-tests/pairs2/GeneratedF2.java>
[INFO] Generating superclass file: <https://hudson.apache.org/hudson/job/Cayenne-trunk/./cayenneTestConnection=h2,jdk=JDK%201.5%20(latest),label=Ubuntu/ws/trunk/itests/cayenne-tools-itest/target/generated-tests/pairs2/_LongEntity.java>
[INFO] Generating class file: <https://hudson.apache.org/hudson/job/Cayenne-trunk/./cayenneTestConnection=h2,jdk=JDK%201.5%20(latest),label=Ubuntu/ws/trunk/itests/cayenne-tools-itest/target/generated-tests/pairs2/LongEntity.java>
[INFO] Generating superclass file: <https://hudson.apache.org/hudson/job/Cayenne-trunk/./cayenneTestConnection=h2,jdk=JDK%201.5%20(latest),label=Ubuntu/ws/trunk/itests/cayenne-tools-itest/target/generated-tests/pairs2/_MeaningfulGeneratedColumnTestEntity.java>
[INFO] Generating class file: <https://hudson.apache.org/hudson/job/Cayenne-trunk/./cayenneTestConnection=h2,jdk=JDK%201.5%20(latest),label=Ubuntu/ws/trunk/itests/cayenne-tools-itest/target/generated-tests/pairs2/MeaningfulGeneratedColumnTestEntity.java>
[INFO] Generating superclass file: <https://hudson.apache.org/hudson/job/Cayenne-trunk/./cayenneTestConnection=h2,jdk=JDK%201.5%20(latest),label=Ubuntu/ws/trunk/itests/cayenne-tools-itest/target/generated-tests/pairs2/_MeaningfulPKDep.java>
[INFO] Generating class file: <https://hudson.apache.org/hudson/job/Cayenne-trunk/./cayenneTestConnection=h2,jdk=JDK%201.5%20(latest),label=Ubuntu/ws/trunk/itests/cayenne-tools-itest/target/generated-tests/pairs2/MeaningfulPKDep.java>
[INFO] Generating superclass file: <https://hudson.apache.org/hudson/job/Cayenne-trunk/./cayenneTestConnection=h2,jdk=JDK%201.5%20(latest),label=Ubuntu/ws/trunk/itests/cayenne-tools-itest/target/generated-tests/pairs2/_MeaningfulPKTest1.java>
[INFO] Generating class file: <https://hudson.apache.org/hudson/job/Cayenne-trunk/./cayenneTestConnection=h2,jdk=JDK%201.5%20(latest),label=Ubuntu/ws/trunk/itests/cayenne-tools-itest/target/generated-tests/pairs2/MeaningfulPKTest1.java>
[INFO] Generating superclass file: <https://hudson.apache.org/hudson/job/Cayenne-trunk/./cayenneTestConnection=h2,jdk=JDK%201.5%20(latest),label=Ubuntu/ws/trunk/itests/cayenne-tools-itest/target/generated-tests/pairs2/_MixedPersistenceStrategy.java>
[INFO] Generating class file: <https://hudson.apache.org/hudson/job/Cayenne-trunk/./cayenneTestConnection=h2,jdk=JDK%201.5%20(latest),label=Ubuntu/ws/trunk/itests/cayenne-tools-itest/target/generated-tests/pairs2/MixedPersistenceStrategy.java>
[INFO] Generating superclass file: <https://hudson.apache.org/hudson/job/Cayenne-trunk/./cayenneTestConnection=h2,jdk=JDK%201.5%20(latest),label=Ubuntu/ws/trunk/itests/cayenne-tools-itest/target/generated-tests/pairs2/_MixedPersistenceStrategy2.java>
[INFO] Generating class file: <https://hudson.apache.org/hudson/job/Cayenne-trunk/./cayenneTestConnection=h2,jdk=JDK%201.5%20(latest),label=Ubuntu/ws/trunk/itests/cayenne-tools-itest/target/generated-tests/pairs2/MixedPersistenceStrategy2.java>
[INFO] Generating superclass file: <https://hudson.apache.org/hudson/job/Cayenne-trunk/./cayenneTestConnection=h2,jdk=JDK%201.5%20(latest),label=Ubuntu/ws/trunk/itests/cayenne-tools-itest/target/generated-tests/pairs2/_NoPkTestEntity.java>
[INFO] Generating class file: <https://hudson.apache.org/hudson/job/Cayenne-trunk/./cayenneTestConnection=h2,jdk=JDK%201.5%20(latest),label=Ubuntu/ws/trunk/itests/cayenne-tools-itest/target/generated-tests/pairs2/NoPkTestEntity.java>
[INFO] Generating superclass file: <https://hudson.apache.org/hudson/job/Cayenne-trunk/./cayenneTestConnection=h2,jdk=JDK%201.5%20(latest),label=Ubuntu/ws/trunk/itests/cayenne-tools-itest/target/generated-tests/pairs2/_Painting.java>
[INFO] Generating class file: <https://hudson.apache.org/hudson/job/Cayenne-trunk/./cayenneTestConnection=h2,jdk=JDK%201.5%20(latest),label=Ubuntu/ws/trunk/itests/cayenne-tools-itest/target/generated-tests/pairs2/Painting.java>
[INFO] Generating superclass file: <https://hudson.apache.org/hudson/job/Cayenne-trunk/./cayenneTestConnection=h2,jdk=JDK%201.5%20(latest),label=Ubuntu/ws/trunk/itests/cayenne-tools-itest/target/generated-tests/pairs2/_Painting1.java>
[INFO] Generating class file: <https://hudson.apache.org/hudson/job/Cayenne-trunk/./cayenneTestConnection=h2,jdk=JDK%201.5%20(latest),label=Ubuntu/ws/trunk/itests/cayenne-tools-itest/target/generated-tests/pairs2/Painting1.java>
[INFO] Generating superclass file: <https://hudson.apache.org/hudson/job/Cayenne-trunk/./cayenneTestConnection=h2,jdk=JDK%201.5%20(latest),label=Ubuntu/ws/trunk/itests/cayenne-tools-itest/target/generated-tests/pairs2/_PaintingInfo.java>
[INFO] Generating class file: <https://hudson.apache.org/hudson/job/Cayenne-trunk/./cayenneTestConnection=h2,jdk=JDK%201.5%20(latest),label=Ubuntu/ws/trunk/itests/cayenne-tools-itest/target/generated-tests/pairs2/PaintingInfo.java>
[INFO] Generating superclass file: <https://hudson.apache.org/hudson/job/Cayenne-trunk/./cayenneTestConnection=h2,jdk=JDK%201.5%20(latest),label=Ubuntu/ws/trunk/itests/cayenne-tools-itest/target/generated-tests/pairs2/_PrimitivesTestEntity.java>
[INFO] Generating class file: <https://hudson.apache.org/hudson/job/Cayenne-trunk/./cayenneTestConnection=h2,jdk=JDK%201.5%20(latest),label=Ubuntu/ws/trunk/itests/cayenne-tools-itest/target/generated-tests/pairs2/PrimitivesTestEntity.java>
[INFO] Generating superclass file: <https://hudson.apache.org/hudson/job/Cayenne-trunk/./cayenneTestConnection=h2,jdk=JDK%201.5%20(latest),label=Ubuntu/ws/trunk/itests/cayenne-tools-itest/target/generated-tests/pairs2/_ROArtist.java>
[INFO] Generating class file: <https://hudson.apache.org/hudson/job/Cayenne-trunk/./cayenneTestConnection=h2,jdk=JDK%201.5%20(latest),label=Ubuntu/ws/trunk/itests/cayenne-tools-itest/target/generated-tests/pairs2/ROArtist.java>
[INFO] Generating superclass file: <https://hudson.apache.org/hudson/job/Cayenne-trunk/./cayenneTestConnection=h2,jdk=JDK%201.5%20(latest),label=Ubuntu/ws/trunk/itests/cayenne-tools-itest/target/generated-tests/pairs2/_ROPainting.java>
[INFO] Generating class file: <https://hudson.apache.org/hudson/job/Cayenne-trunk/./cayenneTestConnection=h2,jdk=JDK%201.5%20(latest),label=Ubuntu/ws/trunk/itests/cayenne-tools-itest/target/generated-tests/pairs2/ROPainting.java>
[INFO] Generating superclass file: <https://hudson.apache.org/hudson/job/Cayenne-trunk/./cayenneTestConnection=h2,jdk=JDK%201.5%20(latest),label=Ubuntu/ws/trunk/itests/cayenne-tools-itest/target/generated-tests/pairs2/_RWCompoundPainting.java>
[INFO] Generating class file: <https://hudson.apache.org/hudson/job/Cayenne-trunk/./cayenneTestConnection=h2,jdk=JDK%201.5%20(latest),label=Ubuntu/ws/trunk/itests/cayenne-tools-itest/target/generated-tests/pairs2/RWCompoundPainting.java>
[INFO] Generating superclass file: <https://hudson.apache.org/hudson/job/Cayenne-trunk/./cayenneTestConnection=h2,jdk=JDK%201.5%20(latest),label=Ubuntu/ws/trunk/itests/cayenne-tools-itest/target/generated-tests/pairs2/_ReturnTypesMap1.java>
[INFO] Generating class file: <https://hudson.apache.org/hudson/job/Cayenne-trunk/./cayenneTestConnection=h2,jdk=JDK%201.5%20(latest),label=Ubuntu/ws/trunk/itests/cayenne-tools-itest/target/generated-tests/pairs2/ReturnTypesMap1.java>
[INFO] Generating superclass file: <https://hudson.apache.org/hudson/job/Cayenne-trunk/./cayenneTestConnection=h2,jdk=JDK%201.5%20(latest),label=Ubuntu/ws/trunk/itests/cayenne-tools-itest/target/generated-tests/pairs2/_ReturnTypesMap2.java>
[INFO] Generating class file: <https://hudson.apache.org/hudson/job/Cayenne-trunk/./cayenneTestConnection=h2,jdk=JDK%201.5%20(latest),label=Ubuntu/ws/trunk/itests/cayenne-tools-itest/target/generated-tests/pairs2/ReturnTypesMap2.java>
[INFO] Generating superclass file: <https://hudson.apache.org/hudson/job/Cayenne-trunk/./cayenneTestConnection=h2,jdk=JDK%201.5%20(latest),label=Ubuntu/ws/trunk/itests/cayenne-tools-itest/target/generated-tests/pairs2/_SerializableEntity.java>
[INFO] Generating class file: <https://hudson.apache.org/hudson/job/Cayenne-trunk/./cayenneTestConnection=h2,jdk=JDK%201.5%20(latest),label=Ubuntu/ws/trunk/itests/cayenne-tools-itest/target/generated-tests/pairs2/SerializableEntity.java>
[INFO] Generating superclass file: <https://hudson.apache.org/hudson/job/Cayenne-trunk/./cayenneTestConnection=h2,jdk=JDK%201.5%20(latest),label=Ubuntu/ws/trunk/itests/cayenne-tools-itest/target/generated-tests/pairs2/_SmallintTestEntity.java>
[INFO] Generating class file: <https://hudson.apache.org/hudson/job/Cayenne-trunk/./cayenneTestConnection=h2,jdk=JDK%201.5%20(latest),label=Ubuntu/ws/trunk/itests/cayenne-tools-itest/target/generated-tests/pairs2/SmallintTestEntity.java>
[INFO] Generating superclass file: <https://hudson.apache.org/hudson/job/Cayenne-trunk/./cayenneTestConnection=h2,jdk=JDK%201.5%20(latest),label=Ubuntu/ws/trunk/itests/cayenne-tools-itest/target/generated-tests/pairs2/_SubPainting.java>
[INFO] Generating class file: <https://hudson.apache.org/hudson/job/Cayenne-trunk/./cayenneTestConnection=h2,jdk=JDK%201.5%20(latest),label=Ubuntu/ws/trunk/itests/cayenne-tools-itest/target/generated-tests/pairs2/SubPainting.java>
[INFO] Generating superclass file: <https://hudson.apache.org/hudson/job/Cayenne-trunk/./cayenneTestConnection=h2,jdk=JDK%201.5%20(latest),label=Ubuntu/ws/trunk/itests/cayenne-tools-itest/target/generated-tests/pairs2/_TinyintTestEntity.java>
[INFO] Generating class file: <https://hudson.apache.org/hudson/job/Cayenne-trunk/./cayenneTestConnection=h2,jdk=JDK%201.5%20(latest),label=Ubuntu/ws/trunk/itests/cayenne-tools-itest/target/generated-tests/pairs2/TinyintTestEntity.java>
[INFO] Generating superclass file: <https://hudson.apache.org/hudson/job/Cayenne-trunk/./cayenneTestConnection=h2,jdk=JDK%201.5%20(latest),label=Ubuntu/ws/trunk/itests/cayenne-tools-itest/target/generated-tests/pairs2/_UuidTestEntity.java>
[INFO] Generating class file: <https://hudson.apache.org/hudson/job/Cayenne-trunk/./cayenneTestConnection=h2,jdk=JDK%201.5%20(latest),label=Ubuntu/ws/trunk/itests/cayenne-tools-itest/target/generated-tests/pairs2/UuidTestEntity.java>
[INFO] [cayenne:cgen {execution: pairs3}]
[INFO] Generating superclass file: <https://hudson.apache.org/hudson/job/Cayenne-trunk/./cayenneTestConnection=h2,jdk=JDK%201.5%20(latest),label=Ubuntu/ws/trunk/itests/cayenne-tools-itest/target/generated-tests/pairs3/org/apache/cayenne/testdo/testmap/superart/_ArraysEntity.java>
[INFO] Generating class file: <https://hudson.apache.org/hudson/job/Cayenne-trunk/./cayenneTestConnection=h2,jdk=JDK%201.5%20(latest),label=Ubuntu/ws/trunk/itests/cayenne-tools-itest/target/generated-tests/pairs3/org/apache/cayenne/testdo/testmap/ArraysEntity.java>
[INFO] Generating superclass file: <https://hudson.apache.org/hudson/job/Cayenne-trunk/./cayenneTestConnection=h2,jdk=JDK%201.5%20(latest),label=Ubuntu/ws/trunk/itests/cayenne-tools-itest/target/generated-tests/pairs3/org/apache/cayenne/testdo/testmap/superart/_ArtGroup.java>
[INFO] Generating class file: <https://hudson.apache.org/hudson/job/Cayenne-trunk/./cayenneTestConnection=h2,jdk=JDK%201.5%20(latest),label=Ubuntu/ws/trunk/itests/cayenne-tools-itest/target/generated-tests/pairs3/org/apache/cayenne/testdo/testmap/ArtGroup.java>
[INFO] Generating superclass file: <https://hudson.apache.org/hudson/job/Cayenne-trunk/./cayenneTestConnection=h2,jdk=JDK%201.5%20(latest),label=Ubuntu/ws/trunk/itests/cayenne-tools-itest/target/generated-tests/pairs3/org/apache/cayenne/testdo/testmap/superart/_Artist.java>
[INFO] Generating class file: <https://hudson.apache.org/hudson/job/Cayenne-trunk/./cayenneTestConnection=h2,jdk=JDK%201.5%20(latest),label=Ubuntu/ws/trunk/itests/cayenne-tools-itest/target/generated-tests/pairs3/org/apache/cayenne/testdo/testmap/Artist.java>
[INFO] Generating superclass file: <https://hudson.apache.org/hudson/job/Cayenne-trunk/./cayenneTestConnection=h2,jdk=JDK%201.5%20(latest),label=Ubuntu/ws/trunk/itests/cayenne-tools-itest/target/generated-tests/pairs3/org/apache/cayenne/testdo/testmap/superart/_ArtistCallbackTest.java>
[INFO] Generating class file: <https://hudson.apache.org/hudson/job/Cayenne-trunk/./cayenneTestConnection=h2,jdk=JDK%201.5%20(latest),label=Ubuntu/ws/trunk/itests/cayenne-tools-itest/target/generated-tests/pairs3/org/apache/cayenne/testdo/testmap/ArtistCallbackTest.java>
[INFO] Generating superclass file: <https://hudson.apache.org/hudson/job/Cayenne-trunk/./cayenneTestConnection=h2,jdk=JDK%201.5%20(latest),label=Ubuntu/ws/trunk/itests/cayenne-tools-itest/target/generated-tests/pairs3/org/apache/cayenne/testdo/testmap/superart/_ArtistExhibit.java>
[INFO] Generating class file: <https://hudson.apache.org/hudson/job/Cayenne-trunk/./cayenneTestConnection=h2,jdk=JDK%201.5%20(latest),label=Ubuntu/ws/trunk/itests/cayenne-tools-itest/target/generated-tests/pairs3/org/apache/cayenne/testdo/testmap/ArtistExhibit.java>
[INFO] Generating superclass file: <https://hudson.apache.org/hudson/job/Cayenne-trunk/./cayenneTestConnection=h2,jdk=JDK%201.5%20(latest),label=Ubuntu/ws/trunk/itests/cayenne-tools-itest/target/generated-tests/pairs3/org/apache/cayenne/testdo/testmap/superart/_BigDecimalEntity.java>
[INFO] Generating class file: <https://hudson.apache.org/hudson/job/Cayenne-trunk/./cayenneTestConnection=h2,jdk=JDK%201.5%20(latest),label=Ubuntu/ws/trunk/itests/cayenne-tools-itest/target/generated-tests/pairs3/org/apache/cayenne/testdo/testmap/BigDecimalEntity.java>
[INFO] Generating superclass file: <https://hudson.apache.org/hudson/job/Cayenne-trunk/./cayenneTestConnection=h2,jdk=JDK%201.5%20(latest),label=Ubuntu/ws/trunk/itests/cayenne-tools-itest/target/generated-tests/pairs3/org/apache/cayenne/testdo/testmap/superart/_BigIntegerEntity.java>
[INFO] Generating class file: <https://hudson.apache.org/hudson/job/Cayenne-trunk/./cayenneTestConnection=h2,jdk=JDK%201.5%20(latest),label=Ubuntu/ws/trunk/itests/cayenne-tools-itest/target/generated-tests/pairs3/org/apache/cayenne/testdo/testmap/BigIntegerEntity.java>
[INFO] Generating superclass file: <https://hudson.apache.org/hudson/job/Cayenne-trunk/./cayenneTestConnection=h2,jdk=JDK%201.5%20(latest),label=Ubuntu/ws/trunk/itests/cayenne-tools-itest/target/generated-tests/pairs3/org/apache/cayenne/testdo/testmap/superart/_BinaryPKTest1.java>
[INFO] Generating class file: <https://hudson.apache.org/hudson/job/Cayenne-trunk/./cayenneTestConnection=h2,jdk=JDK%201.5%20(latest),label=Ubuntu/ws/trunk/itests/cayenne-tools-itest/target/generated-tests/pairs3/org/apache/cayenne/testdo/testmap/BinaryPKTest1.java>
[INFO] Generating superclass file: <https://hudson.apache.org/hudson/job/Cayenne-trunk/./cayenneTestConnection=h2,jdk=JDK%201.5%20(latest),label=Ubuntu/ws/trunk/itests/cayenne-tools-itest/target/generated-tests/pairs3/org/apache/cayenne/testdo/testmap/superart/_BinaryPKTest2.java>
[INFO] Generating class file: <https://hudson.apache.org/hudson/job/Cayenne-trunk/./cayenneTestConnection=h2,jdk=JDK%201.5%20(latest),label=Ubuntu/ws/trunk/itests/cayenne-tools-itest/target/generated-tests/pairs3/org/apache/cayenne/testdo/testmap/BinaryPKTest2.java>
[INFO] Generating superclass file: <https://hudson.apache.org/hudson/job/Cayenne-trunk/./cayenneTestConnection=h2,jdk=JDK%201.5%20(latest),label=Ubuntu/ws/trunk/itests/cayenne-tools-itest/target/generated-tests/pairs3/org/apache/cayenne/testdo/testmap/superart/_BitNumberTestEntity.java>
[INFO] Generating class file: <https://hudson.apache.org/hudson/job/Cayenne-trunk/./cayenneTestConnection=h2,jdk=JDK%201.5%20(latest),label=Ubuntu/ws/trunk/itests/cayenne-tools-itest/target/generated-tests/pairs3/org/apache/cayenne/testdo/testmap/BitNumberTestEntity.java>
[INFO] Generating superclass file: <https://hudson.apache.org/hudson/job/Cayenne-trunk/./cayenneTestConnection=h2,jdk=JDK%201.5%20(latest),label=Ubuntu/ws/trunk/itests/cayenne-tools-itest/target/generated-tests/pairs3/org/apache/cayenne/testdo/testmap/superart/_BitTestEntity.java>
[INFO] Generating class file: <https://hudson.apache.org/hudson/job/Cayenne-trunk/./cayenneTestConnection=h2,jdk=JDK%201.5%20(latest),label=Ubuntu/ws/trunk/itests/cayenne-tools-itest/target/generated-tests/pairs3/org/apache/cayenne/testdo/testmap/BitTestEntity.java>
[INFO] Generating superclass file: <https://hudson.apache.org/hudson/job/Cayenne-trunk/./cayenneTestConnection=h2,jdk=JDK%201.5%20(latest),label=Ubuntu/ws/trunk/itests/cayenne-tools-itest/target/generated-tests/pairs3/org/apache/cayenne/testdo/testmap/superart/_BlobTestEntity.java>
[INFO] Generating class file: <https://hudson.apache.org/hudson/job/Cayenne-trunk/./cayenneTestConnection=h2,jdk=JDK%201.5%20(latest),label=Ubuntu/ws/trunk/itests/cayenne-tools-itest/target/generated-tests/pairs3/org/apache/cayenne/testdo/testmap/BlobTestEntity.java>
[INFO] Generating superclass file: <https://hudson.apache.org/hudson/job/Cayenne-trunk/./cayenneTestConnection=h2,jdk=JDK%201.5%20(latest),label=Ubuntu/ws/trunk/itests/cayenne-tools-itest/target/generated-tests/pairs3/org/apache/cayenne/testdo/testmap/superart/_BooleanTestEntity.java>
[INFO] Generating class file: <https://hudson.apache.org/hudson/job/Cayenne-trunk/./cayenneTestConnection=h2,jdk=JDK%201.5%20(latest),label=Ubuntu/ws/trunk/itests/cayenne-tools-itest/target/generated-tests/pairs3/org/apache/cayenne/testdo/testmap/BooleanTestEntity.java>
[INFO] Generating superclass file: <https://hudson.apache.org/hudson/job/Cayenne-trunk/./cayenneTestConnection=h2,jdk=JDK%201.5%20(latest),label=Ubuntu/ws/trunk/itests/cayenne-tools-itest/target/generated-tests/pairs3/org/apache/cayenne/testdo/testmap/superart/_CalendarEntity.java>
[INFO] Generating class file: <https://hudson.apache.org/hudson/job/Cayenne-trunk/./cayenneTestConnection=h2,jdk=JDK%201.5%20(latest),label=Ubuntu/ws/trunk/itests/cayenne-tools-itest/target/generated-tests/pairs3/org/apache/cayenne/testdo/testmap/CalendarEntity.java>
[INFO] Generating superclass file: <https://hudson.apache.org/hudson/job/Cayenne-trunk/./cayenneTestConnection=h2,jdk=JDK%201.5%20(latest),label=Ubuntu/ws/trunk/itests/cayenne-tools-itest/target/generated-tests/pairs3/org/apache/cayenne/testdo/testmap/superart/_CharFkTestEntity.java>
[INFO] Generating class file: <https://hudson.apache.org/hudson/job/Cayenne-trunk/./cayenneTestConnection=h2,jdk=JDK%201.5%20(latest),label=Ubuntu/ws/trunk/itests/cayenne-tools-itest/target/generated-tests/pairs3/org/apache/cayenne/testdo/testmap/CharFkTestEntity.java>
[INFO] Generating superclass file: <https://hudson.apache.org/hudson/job/Cayenne-trunk/./cayenneTestConnection=h2,jdk=JDK%201.5%20(latest),label=Ubuntu/ws/trunk/itests/cayenne-tools-itest/target/generated-tests/pairs3/org/apache/cayenne/testdo/testmap/superart/_CharPkTestEntity.java>
[INFO] Generating class file: <https://hudson.apache.org/hudson/job/Cayenne-trunk/./cayenneTestConnection=h2,jdk=JDK%201.5%20(latest),label=Ubuntu/ws/trunk/itests/cayenne-tools-itest/target/generated-tests/pairs3/org/apache/cayenne/testdo/testmap/CharPkTestEntity.java>
[INFO] Generating superclass file: <https://hudson.apache.org/hudson/job/Cayenne-trunk/./cayenneTestConnection=h2,jdk=JDK%201.5%20(latest),label=Ubuntu/ws/trunk/itests/cayenne-tools-itest/target/generated-tests/pairs3/org/apache/cayenne/testdo/testmap/superart/_CharacterEntity.java>
[INFO] Generating class file: <https://hudson.apache.org/hudson/job/Cayenne-trunk/./cayenneTestConnection=h2,jdk=JDK%201.5%20(latest),label=Ubuntu/ws/trunk/itests/cayenne-tools-itest/target/generated-tests/pairs3/org/apache/cayenne/testdo/testmap/CharacterEntity.java>
[INFO] Generating superclass file: <https://hudson.apache.org/hudson/job/Cayenne-trunk/./cayenneTestConnection=h2,jdk=JDK%201.5%20(latest),label=Ubuntu/ws/trunk/itests/cayenne-tools-itest/target/generated-tests/pairs3/org/apache/cayenne/testdo/testmap/superart/_ClobTestEntity.java>
[INFO] Generating class file: <https://hudson.apache.org/hudson/job/Cayenne-trunk/./cayenneTestConnection=h2,jdk=JDK%201.5%20(latest),label=Ubuntu/ws/trunk/itests/cayenne-tools-itest/target/generated-tests/pairs3/org/apache/cayenne/testdo/testmap/ClobTestEntity.java>
[INFO] Generating superclass file: <https://hudson.apache.org/hudson/job/Cayenne-trunk/./cayenneTestConnection=h2,jdk=JDK%201.5%20(latest),label=Ubuntu/ws/trunk/itests/cayenne-tools-itest/target/generated-tests/pairs3/org/apache/cayenne/testdo/testmap/superart/_ClobTestRelation.java>
[INFO] Generating class file: <https://hudson.apache.org/hudson/job/Cayenne-trunk/./cayenneTestConnection=h2,jdk=JDK%201.5%20(latest),label=Ubuntu/ws/trunk/itests/cayenne-tools-itest/target/generated-tests/pairs3/org/apache/cayenne/testdo/testmap/ClobTestRelation.java>
[INFO] Generating superclass file: <https://hudson.apache.org/hudson/job/Cayenne-trunk/./cayenneTestConnection=h2,jdk=JDK%201.5%20(latest),label=Ubuntu/ws/trunk/itests/cayenne-tools-itest/target/generated-tests/pairs3/org/apache/cayenne/testdo/testmap/superart/_CompoundFkTestEntity.java>
[INFO] Generating class file: <https://hudson.apache.org/hudson/job/Cayenne-trunk/./cayenneTestConnection=h2,jdk=JDK%201.5%20(latest),label=Ubuntu/ws/trunk/itests/cayenne-tools-itest/target/generated-tests/pairs3/org/apache/cayenne/testdo/testmap/CompoundFkTestEntity.java>
[INFO] Generating superclass file: <https://hudson.apache.org/hudson/job/Cayenne-trunk/./cayenneTestConnection=h2,jdk=JDK%201.5%20(latest),label=Ubuntu/ws/trunk/itests/cayenne-tools-itest/target/generated-tests/pairs3/org/apache/cayenne/testdo/testmap/superart/_CompoundPainting.java>
[INFO] Generating class file: <https://hudson.apache.org/hudson/job/Cayenne-trunk/./cayenneTestConnection=h2,jdk=JDK%201.5%20(latest),label=Ubuntu/ws/trunk/itests/cayenne-tools-itest/target/generated-tests/pairs3/org/apache/cayenne/testdo/testmap/CompoundPainting.java>
[INFO] Generating superclass file: <https://hudson.apache.org/hudson/job/Cayenne-trunk/./cayenneTestConnection=h2,jdk=JDK%201.5%20(latest),label=Ubuntu/ws/trunk/itests/cayenne-tools-itest/target/generated-tests/pairs3/org/apache/cayenne/testdo/testmap/superart/_CompoundPkTestEntity.java>
[INFO] Generating class file: <https://hudson.apache.org/hudson/job/Cayenne-trunk/./cayenneTestConnection=h2,jdk=JDK%201.5%20(latest),label=Ubuntu/ws/trunk/itests/cayenne-tools-itest/target/generated-tests/pairs3/org/apache/cayenne/testdo/testmap/CompoundPkTestEntity.java>
[INFO] Generating superclass file: <https://hudson.apache.org/hudson/job/Cayenne-trunk/./cayenneTestConnection=h2,jdk=JDK%201.5%20(latest),label=Ubuntu/ws/trunk/itests/cayenne-tools-itest/target/generated-tests/pairs3/org/apache/cayenne/testdo/testmap/superart/_DateTestEntity.java>
[INFO] Generating class file: <https://hudson.apache.org/hudson/job/Cayenne-trunk/./cayenneTestConnection=h2,jdk=JDK%201.5%20(latest),label=Ubuntu/ws/trunk/itests/cayenne-tools-itest/target/generated-tests/pairs3/org/apache/cayenne/testdo/testmap/DateTestEntity.java>
[INFO] Generating superclass file: <https://hudson.apache.org/hudson/job/Cayenne-trunk/./cayenneTestConnection=h2,jdk=JDK%201.5%20(latest),label=Ubuntu/ws/trunk/itests/cayenne-tools-itest/target/generated-tests/pairs3/org/apache/cayenne/testdo/testmap/superart/_DecimalPKTest1.java>
[INFO] Generating class file: <https://hudson.apache.org/hudson/job/Cayenne-trunk/./cayenneTestConnection=h2,jdk=JDK%201.5%20(latest),label=Ubuntu/ws/trunk/itests/cayenne-tools-itest/target/generated-tests/pairs3/org/apache/cayenne/testdo/testmap/DecimalPKTest1.java>
[INFO] Generating superclass file: <https://hudson.apache.org/hudson/job/Cayenne-trunk/./cayenneTestConnection=h2,jdk=JDK%201.5%20(latest),label=Ubuntu/ws/trunk/itests/cayenne-tools-itest/target/generated-tests/pairs3/org/apache/cayenne/testdo/testmap/superart/_DecimalPKTestEntity.java>
[INFO] Generating class file: <https://hudson.apache.org/hudson/job/Cayenne-trunk/./cayenneTestConnection=h2,jdk=JDK%201.5%20(latest),label=Ubuntu/ws/trunk/itests/cayenne-tools-itest/target/generated-tests/pairs3/org/apache/cayenne/testdo/testmap/DecimalPKTestEntity.java>
[INFO] Generating superclass file: <https://hudson.apache.org/hudson/job/Cayenne-trunk/./cayenneTestConnection=h2,jdk=JDK%201.5%20(latest),label=Ubuntu/ws/trunk/itests/cayenne-tools-itest/target/generated-tests/pairs3/org/apache/cayenne/testdo/testmap/superart/_EnumEntity.java>
[INFO] Generating class file: <https://hudson.apache.org/hudson/job/Cayenne-trunk/./cayenneTestConnection=h2,jdk=JDK%201.5%20(latest),label=Ubuntu/ws/trunk/itests/cayenne-tools-itest/target/generated-tests/pairs3/org/apache/cayenne/testdo/testmap/EnumEntity.java>
[INFO] Generating superclass file: <https://hudson.apache.org/hudson/job/Cayenne-trunk/./cayenneTestConnection=h2,jdk=JDK%201.5%20(latest),label=Ubuntu/ws/trunk/itests/cayenne-tools-itest/target/generated-tests/pairs3/org/apache/cayenne/testdo/testmap/superart/_Exhibit.java>
[INFO] Generating class file: <https://hudson.apache.org/hudson/job/Cayenne-trunk/./cayenneTestConnection=h2,jdk=JDK%201.5%20(latest),label=Ubuntu/ws/trunk/itests/cayenne-tools-itest/target/generated-tests/pairs3/org/apache/cayenne/testdo/testmap/Exhibit.java>
[INFO] Generating superclass file: <https://hudson.apache.org/hudson/job/Cayenne-trunk/./cayenneTestConnection=h2,jdk=JDK%201.5%20(latest),label=Ubuntu/ws/trunk/itests/cayenne-tools-itest/target/generated-tests/pairs3/org/apache/cayenne/testdo/testmap/superart/_ExtendedTypeEntity.java>
[INFO] Generating class file: <https://hudson.apache.org/hudson/job/Cayenne-trunk/./cayenneTestConnection=h2,jdk=JDK%201.5%20(latest),label=Ubuntu/ws/trunk/itests/cayenne-tools-itest/target/generated-tests/pairs3/org/apache/cayenne/testdo/testmap/ExtendedTypeEntity.java>
[INFO] Generating superclass file: <https://hudson.apache.org/hudson/job/Cayenne-trunk/./cayenneTestConnection=h2,jdk=JDK%201.5%20(latest),label=Ubuntu/ws/trunk/itests/cayenne-tools-itest/target/generated-tests/pairs3/org/apache/cayenne/testdo/testmap/superart/_Gallery.java>
[INFO] Generating class file: <https://hudson.apache.org/hudson/job/Cayenne-trunk/./cayenneTestConnection=h2,jdk=JDK%201.5%20(latest),label=Ubuntu/ws/trunk/itests/cayenne-tools-itest/target/generated-tests/pairs3/org/apache/cayenne/testdo/testmap/Gallery.java>
[INFO] Generating superclass file: <https://hudson.apache.org/hudson/job/Cayenne-trunk/./cayenneTestConnection=h2,jdk=JDK%201.5%20(latest),label=Ubuntu/ws/trunk/itests/cayenne-tools-itest/target/generated-tests/pairs3/org/apache/cayenne/testdo/testmap/superart/_GeneratedColumnCompKey.java>
[INFO] Generating class file: <https://hudson.apache.org/hudson/job/Cayenne-trunk/./cayenneTestConnection=h2,jdk=JDK%201.5%20(latest),label=Ubuntu/ws/trunk/itests/cayenne-tools-itest/target/generated-tests/pairs3/org/apache/cayenne/testdo/testmap/GeneratedColumnCompKey.java>
[INFO] Generating superclass file: <https://hudson.apache.org/hudson/job/Cayenne-trunk/./cayenneTestConnection=h2,jdk=JDK%201.5%20(latest),label=Ubuntu/ws/trunk/itests/cayenne-tools-itest/target/generated-tests/pairs3/org/apache/cayenne/testdo/testmap/superart/_GeneratedColumnCompMaster.java>
[INFO] Generating class file: <https://hudson.apache.org/hudson/job/Cayenne-trunk/./cayenneTestConnection=h2,jdk=JDK%201.5%20(latest),label=Ubuntu/ws/trunk/itests/cayenne-tools-itest/target/generated-tests/pairs3/org/apache/cayenne/testdo/testmap/GeneratedColumnCompMaster.java>
[INFO] Generating superclass file: <https://hudson.apache.org/hudson/job/Cayenne-trunk/./cayenneTestConnection=h2,jdk=JDK%201.5%20(latest),label=Ubuntu/ws/trunk/itests/cayenne-tools-itest/target/generated-tests/pairs3/org/apache/cayenne/testdo/testmap/superart/_GeneratedColumnDep.java>
[INFO] Generating class file: <https://hudson.apache.org/hudson/job/Cayenne-trunk/./cayenneTestConnection=h2,jdk=JDK%201.5%20(latest),label=Ubuntu/ws/trunk/itests/cayenne-tools-itest/target/generated-tests/pairs3/org/apache/cayenne/testdo/testmap/GeneratedColumnDep.java>
[INFO] Generating superclass file: <https://hudson.apache.org/hudson/job/Cayenne-trunk/./cayenneTestConnection=h2,jdk=JDK%201.5%20(latest),label=Ubuntu/ws/trunk/itests/cayenne-tools-itest/target/generated-tests/pairs3/org/apache/cayenne/testdo/testmap/superart/_GeneratedColumnTest2.java>
[INFO] Generating class file: <https://hudson.apache.org/hudson/job/Cayenne-trunk/./cayenneTestConnection=h2,jdk=JDK%201.5%20(latest),label=Ubuntu/ws/trunk/itests/cayenne-tools-itest/target/generated-tests/pairs3/org/apache/cayenne/testdo/testmap/GeneratedColumnTest2.java>
[INFO] Generating superclass file: <https://hudson.apache.org/hudson/job/Cayenne-trunk/./cayenneTestConnection=h2,jdk=JDK%201.5%20(latest),label=Ubuntu/ws/trunk/itests/cayenne-tools-itest/target/generated-tests/pairs3/org/apache/cayenne/testdo/testmap/superart/_GeneratedColumnTestEntity.java>
[INFO] Generating class file: <https://hudson.apache.org/hudson/job/Cayenne-trunk/./cayenneTestConnection=h2,jdk=JDK%201.5%20(latest),label=Ubuntu/ws/trunk/itests/cayenne-tools-itest/target/generated-tests/pairs3/org/apache/cayenne/testdo/testmap/GeneratedColumnTestEntity.java>
[INFO] Generating superclass file: <https://hudson.apache.org/hudson/job/Cayenne-trunk/./cayenneTestConnection=h2,jdk=JDK%201.5%20(latest),label=Ubuntu/ws/trunk/itests/cayenne-tools-itest/target/generated-tests/pairs3/org/apache/cayenne/testdo/testmap/superart/_GeneratedF1.java>
[INFO] Generating class file: <https://hudson.apache.org/hudson/job/Cayenne-trunk/./cayenneTestConnection=h2,jdk=JDK%201.5%20(latest),label=Ubuntu/ws/trunk/itests/cayenne-tools-itest/target/generated-tests/pairs3/org/apache/cayenne/testdo/testmap/GeneratedF1.java>
[INFO] Generating superclass file: <https://hudson.apache.org/hudson/job/Cayenne-trunk/./cayenneTestConnection=h2,jdk=JDK%201.5%20(latest),label=Ubuntu/ws/trunk/itests/cayenne-tools-itest/target/generated-tests/pairs3/org/apache/cayenne/testdo/testmap/superart/_GeneratedF2.java>
[INFO] Generating class file: <https://hudson.apache.org/hudson/job/Cayenne-trunk/./cayenneTestConnection=h2,jdk=JDK%201.5%20(latest),label=Ubuntu/ws/trunk/itests/cayenne-tools-itest/target/generated-tests/pairs3/org/apache/cayenne/testdo/testmap/GeneratedF2.java>
[INFO] Generating superclass file: <https://hudson.apache.org/hudson/job/Cayenne-trunk/./cayenneTestConnection=h2,jdk=JDK%201.5%20(latest),label=Ubuntu/ws/trunk/itests/cayenne-tools-itest/target/generated-tests/pairs3/org/apache/cayenne/testdo/testmap/superart/_LongEntity.java>
[INFO] Generating class file: <https://hudson.apache.org/hudson/job/Cayenne-trunk/./cayenneTestConnection=h2,jdk=JDK%201.5%20(latest),label=Ubuntu/ws/trunk/itests/cayenne-tools-itest/target/generated-tests/pairs3/org/apache/cayenne/testdo/testmap/LongEntity.java>
[INFO] Generating superclass file: <https://hudson.apache.org/hudson/job/Cayenne-trunk/./cayenneTestConnection=h2,jdk=JDK%201.5%20(latest),label=Ubuntu/ws/trunk/itests/cayenne-tools-itest/target/generated-tests/pairs3/org/apache/cayenne/testdo/testmap/superart/_MeaningfulGeneratedColumnTestEntity.java>
[INFO] Generating class file: <https://hudson.apache.org/hudson/job/Cayenne-trunk/./cayenneTestConnection=h2,jdk=JDK%201.5%20(latest),label=Ubuntu/ws/trunk/itests/cayenne-tools-itest/target/generated-tests/pairs3/org/apache/cayenne/testdo/testmap/MeaningfulGeneratedColumnTestEntity.java>
[INFO] Generating superclass file: <https://hudson.apache.org/hudson/job/Cayenne-trunk/./cayenneTestConnection=h2,jdk=JDK%201.5%20(latest),label=Ubuntu/ws/trunk/itests/cayenne-tools-itest/target/generated-tests/pairs3/org/apache/cayenne/testdo/testmap/superart/_MeaningfulPKDep.java>
[INFO] Generating class file: <https://hudson.apache.org/hudson/job/Cayenne-trunk/./cayenneTestConnection=h2,jdk=JDK%201.5%20(latest),label=Ubuntu/ws/trunk/itests/cayenne-tools-itest/target/generated-tests/pairs3/org/apache/cayenne/testdo/testmap/MeaningfulPKDep.java>
[INFO] Generating superclass file: <https://hudson.apache.org/hudson/job/Cayenne-trunk/./cayenneTestConnection=h2,jdk=JDK%201.5%20(latest),label=Ubuntu/ws/trunk/itests/cayenne-tools-itest/target/generated-tests/pairs3/org/apache/cayenne/testdo/testmap/superart/_MeaningfulPKTest1.java>
[INFO] Generating class file: <https://hudson.apache.org/hudson/job/Cayenne-trunk/./cayenneTestConnection=h2,jdk=JDK%201.5%20(latest),label=Ubuntu/ws/trunk/itests/cayenne-tools-itest/target/generated-tests/pairs3/org/apache/cayenne/testdo/testmap/MeaningfulPKTest1.java>
[INFO] Generating superclass file: <https://hudson.apache.org/hudson/job/Cayenne-trunk/./cayenneTestConnection=h2,jdk=JDK%201.5%20(latest),label=Ubuntu/ws/trunk/itests/cayenne-tools-itest/target/generated-tests/pairs3/org/apache/cayenne/testdo/testmap/superart/_MixedPersistenceStrategy.java>
[INFO] Generating class file: <https://hudson.apache.org/hudson/job/Cayenne-trunk/./cayenneTestConnection=h2,jdk=JDK%201.5%20(latest),label=Ubuntu/ws/trunk/itests/cayenne-tools-itest/target/generated-tests/pairs3/org/apache/cayenne/testdo/testmap/MixedPersistenceStrategy.java>
[INFO] Generating superclass file: <https://hudson.apache.org/hudson/job/Cayenne-trunk/./cayenneTestConnection=h2,jdk=JDK%201.5%20(latest),label=Ubuntu/ws/trunk/itests/cayenne-tools-itest/target/generated-tests/pairs3/org/apache/cayenne/testdo/testmap/superart/_MixedPersistenceStrategy2.java>
[INFO] Generating class file: <https://hudson.apache.org/hudson/job/Cayenne-trunk/./cayenneTestConnection=h2,jdk=JDK%201.5%20(latest),label=Ubuntu/ws/trunk/itests/cayenne-tools-itest/target/generated-tests/pairs3/org/apache/cayenne/testdo/testmap/MixedPersistenceStrategy2.java>
[INFO] Generating superclass file: <https://hudson.apache.org/hudson/job/Cayenne-trunk/./cayenneTestConnection=h2,jdk=JDK%201.5%20(latest),label=Ubuntu/ws/trunk/itests/cayenne-tools-itest/target/generated-tests/pairs3/org/apache/cayenne/testdo/testmap/superart/_NoPkTestEntity.java>
[INFO] Generating class file: <https://hudson.apache.org/hudson/job/Cayenne-trunk/./cayenneTestConnection=h2,jdk=JDK%201.5%20(latest),label=Ubuntu/ws/trunk/itests/cayenne-tools-itest/target/generated-tests/pairs3/org/apache/cayenne/testdo/testmap/NoPkTestEntity.java>
[INFO] Generating superclass file: <https://hudson.apache.org/hudson/job/Cayenne-trunk/./cayenneTestConnection=h2,jdk=JDK%201.5%20(latest),label=Ubuntu/ws/trunk/itests/cayenne-tools-itest/target/generated-tests/pairs3/org/apache/cayenne/testdo/testmap/superart/_Painting.java>
[INFO] Generating class file: <https://hudson.apache.org/hudson/job/Cayenne-trunk/./cayenneTestConnection=h2,jdk=JDK%201.5%20(latest),label=Ubuntu/ws/trunk/itests/cayenne-tools-itest/target/generated-tests/pairs3/org/apache/cayenne/testdo/testmap/Painting.java>
[INFO] Generating superclass file: <https://hudson.apache.org/hudson/job/Cayenne-trunk/./cayenneTestConnection=h2,jdk=JDK%201.5%20(latest),label=Ubuntu/ws/trunk/itests/cayenne-tools-itest/target/generated-tests/pairs3/org/apache/cayenne/testdo/testmap/superart/_Painting1.java>
[INFO] Generating class file: <https://hudson.apache.org/hudson/job/Cayenne-trunk/./cayenneTestConnection=h2,jdk=JDK%201.5%20(latest),label=Ubuntu/ws/trunk/itests/cayenne-tools-itest/target/generated-tests/pairs3/org/apache/cayenne/testdo/testmap/Painting1.java>
[INFO] Generating superclass file: <https://hudson.apache.org/hudson/job/Cayenne-trunk/./cayenneTestConnection=h2,jdk=JDK%201.5%20(latest),label=Ubuntu/ws/trunk/itests/cayenne-tools-itest/target/generated-tests/pairs3/org/apache/cayenne/testdo/testmap/superart/_PaintingInfo.java>
[INFO] Generating class file: <https://hudson.apache.org/hudson/job/Cayenne-trunk/./cayenneTestConnection=h2,jdk=JDK%201.5%20(latest),label=Ubuntu/ws/trunk/itests/cayenne-tools-itest/target/generated-tests/pairs3/org/apache/cayenne/testdo/testmap/PaintingInfo.java>
[INFO] Generating superclass file: <https://hudson.apache.org/hudson/job/Cayenne-trunk/./cayenneTestConnection=h2,jdk=JDK%201.5%20(latest),label=Ubuntu/ws/trunk/itests/cayenne-tools-itest/target/generated-tests/pairs3/org/apache/cayenne/testdo/testmap/superart/_PrimitivesTestEntity.java>
[INFO] Generating class file: <https://hudson.apache.org/hudson/job/Cayenne-trunk/./cayenneTestConnection=h2,jdk=JDK%201.5%20(latest),label=Ubuntu/ws/trunk/itests/cayenne-tools-itest/target/generated-tests/pairs3/org/apache/cayenne/testdo/testmap/PrimitivesTestEntity.java>
[INFO] Generating superclass file: <https://hudson.apache.org/hudson/job/Cayenne-trunk/./cayenneTestConnection=h2,jdk=JDK%201.5%20(latest),label=Ubuntu/ws/trunk/itests/cayenne-tools-itest/target/generated-tests/pairs3/org/apache/cayenne/testdo/testmap/superart/_ROArtist.java>
[INFO] Generating class file: <https://hudson.apache.org/hudson/job/Cayenne-trunk/./cayenneTestConnection=h2,jdk=JDK%201.5%20(latest),label=Ubuntu/ws/trunk/itests/cayenne-tools-itest/target/generated-tests/pairs3/org/apache/cayenne/testdo/testmap/ROArtist.java>
[INFO] Generating superclass file: <https://hudson.apache.org/hudson/job/Cayenne-trunk/./cayenneTestConnection=h2,jdk=JDK%201.5%20(latest),label=Ubuntu/ws/trunk/itests/cayenne-tools-itest/target/generated-tests/pairs3/org/apache/cayenne/testdo/testmap/superart/_ROPainting.java>
[INFO] Generating class file: <https://hudson.apache.org/hudson/job/Cayenne-trunk/./cayenneTestConnection=h2,jdk=JDK%201.5%20(latest),label=Ubuntu/ws/trunk/itests/cayenne-tools-itest/target/generated-tests/pairs3/org/apache/cayenne/testdo/testmap/ROPainting.java>
[INFO] Generating superclass file: <https://hudson.apache.org/hudson/job/Cayenne-trunk/./cayenneTestConnection=h2,jdk=JDK%201.5%20(latest),label=Ubuntu/ws/trunk/itests/cayenne-tools-itest/target/generated-tests/pairs3/org/apache/cayenne/testdo/testmap/superart/_RWCompoundPainting.java>
[INFO] Generating class file: <https://hudson.apache.org/hudson/job/Cayenne-trunk/./cayenneTestConnection=h2,jdk=JDK%201.5%20(latest),label=Ubuntu/ws/trunk/itests/cayenne-tools-itest/target/generated-tests/pairs3/org/apache/cayenne/testdo/testmap/RWCompoundPainting.java>
[INFO] Generating superclass file: <https://hudson.apache.org/hudson/job/Cayenne-trunk/./cayenneTestConnection=h2,jdk=JDK%201.5%20(latest),label=Ubuntu/ws/trunk/itests/cayenne-tools-itest/target/generated-tests/pairs3/org/apache/cayenne/testdo/testmap/superart/_ReturnTypesMap1.java>
[INFO] Generating class file: <https://hudson.apache.org/hudson/job/Cayenne-trunk/./cayenneTestConnection=h2,jdk=JDK%201.5%20(latest),label=Ubuntu/ws/trunk/itests/cayenne-tools-itest/target/generated-tests/pairs3/org/apache/cayenne/testdo/testmap/ReturnTypesMap1.java>
[INFO] Generating superclass file: <https://hudson.apache.org/hudson/job/Cayenne-trunk/./cayenneTestConnection=h2,jdk=JDK%201.5%20(latest),label=Ubuntu/ws/trunk/itests/cayenne-tools-itest/target/generated-tests/pairs3/org/apache/cayenne/testdo/testmap/superart/_ReturnTypesMap2.java>
[INFO] Generating class file: <https://hudson.apache.org/hudson/job/Cayenne-trunk/./cayenneTestConnection=h2,jdk=JDK%201.5%20(latest),label=Ubuntu/ws/trunk/itests/cayenne-tools-itest/target/generated-tests/pairs3/org/apache/cayenne/testdo/testmap/ReturnTypesMap2.java>
[INFO] Generating superclass file: <https://hudson.apache.org/hudson/job/Cayenne-trunk/./cayenneTestConnection=h2,jdk=JDK%201.5%20(latest),label=Ubuntu/ws/trunk/itests/cayenne-tools-itest/target/generated-tests/pairs3/org/apache/cayenne/testdo/testmap/superart/_SerializableEntity.java>
[INFO] Generating class file: <https://hudson.apache.org/hudson/job/Cayenne-trunk/./cayenneTestConnection=h2,jdk=JDK%201.5%20(latest),label=Ubuntu/ws/trunk/itests/cayenne-tools-itest/target/generated-tests/pairs3/org/apache/cayenne/testdo/testmap/SerializableEntity.java>
[INFO] Generating superclass file: <https://hudson.apache.org/hudson/job/Cayenne-trunk/./cayenneTestConnection=h2,jdk=JDK%201.5%20(latest),label=Ubuntu/ws/trunk/itests/cayenne-tools-itest/target/generated-tests/pairs3/org/apache/cayenne/testdo/testmap/superart/_SmallintTestEntity.java>
[INFO] Generating class file: <https://hudson.apache.org/hudson/job/Cayenne-trunk/./cayenneTestConnection=h2,jdk=JDK%201.5%20(latest),label=Ubuntu/ws/trunk/itests/cayenne-tools-itest/target/generated-tests/pairs3/org/apache/cayenne/testdo/testmap/SmallintTestEntity.java>
[INFO] Generating superclass file: <https://hudson.apache.org/hudson/job/Cayenne-trunk/./cayenneTestConnection=h2,jdk=JDK%201.5%20(latest),label=Ubuntu/ws/trunk/itests/cayenne-tools-itest/target/generated-tests/pairs3/org/apache/cayenne/testdo/testmap/superart/_SubPainting.java>
[INFO] Generating class file: <https://hudson.apache.org/hudson/job/Cayenne-trunk/./cayenneTestConnection=h2,jdk=JDK%201.5%20(latest),label=Ubuntu/ws/trunk/itests/cayenne-tools-itest/target/generated-tests/pairs3/org/apache/cayenne/testdo/testmap/SubPainting.java>
[INFO] Generating superclass file: <https://hudson.apache.org/hudson/job/Cayenne-trunk/./cayenneTestConnection=h2,jdk=JDK%201.5%20(latest),label=Ubuntu/ws/trunk/itests/cayenne-tools-itest/target/generated-tests/pairs3/org/apache/cayenne/testdo/testmap/superart/_TinyintTestEntity.java>
[INFO] Generating class file: <https://hudson.apache.org/hudson/job/Cayenne-trunk/./cayenneTestConnection=h2,jdk=JDK%201.5%20(latest),label=Ubuntu/ws/trunk/itests/cayenne-tools-itest/target/generated-tests/pairs3/org/apache/cayenne/testdo/testmap/TinyintTestEntity.java>
[INFO] Generating superclass file: <https://hudson.apache.org/hudson/job/Cayenne-trunk/./cayenneTestConnection=h2,jdk=JDK%201.5%20(latest),label=Ubuntu/ws/trunk/itests/cayenne-tools-itest/target/generated-tests/pairs3/org/apache/cayenne/testdo/testmap/superart/_UuidTestEntity.java>
[INFO] Generating class file: <https://hudson.apache.org/hudson/job/Cayenne-trunk/./cayenneTestConnection=h2,jdk=JDK%201.5%20(latest),label=Ubuntu/ws/trunk/itests/cayenne-tools-itest/target/generated-tests/pairs3/org/apache/cayenne/testdo/testmap/UuidTestEntity.java>
[INFO] [cayenne:cgen {execution: pairs-embeddables3}]
[INFO] Generating superclass file: <https://hudson.apache.org/hudson/job/Cayenne-trunk/./cayenneTestConnection=h2,jdk=JDK%201.5%20(latest),label=Ubuntu/ws/trunk/itests/cayenne-tools-itest/target/generated-tests/pairs-embeddables3/org/apache/cayenne/testdo/embeddable/auto/_EmbedEntity1.java>
[INFO] Generating class file: <https://hudson.apache.org/hudson/job/Cayenne-trunk/./cayenneTestConnection=h2,jdk=JDK%201.5%20(latest),label=Ubuntu/ws/trunk/itests/cayenne-tools-itest/target/generated-tests/pairs-embeddables3/org/apache/cayenne/testdo/embeddable/EmbedEntity1.java>
[INFO] Generating superclass file: <https://hudson.apache.org/hudson/job/Cayenne-trunk/./cayenneTestConnection=h2,jdk=JDK%201.5%20(latest),label=Ubuntu/ws/trunk/itests/cayenne-tools-itest/target/generated-tests/pairs-embeddables3/org/apache/cayenne/testdo/embeddable/auto/_Embeddable1.java>
[INFO] Generating class file: <https://hudson.apache.org/hudson/job/Cayenne-trunk/./cayenneTestConnection=h2,jdk=JDK%201.5%20(latest),label=Ubuntu/ws/trunk/itests/cayenne-tools-itest/target/generated-tests/pairs-embeddables3/org/apache/cayenne/testdo/embeddable/Embeddable1.java>
[INFO] [resources:resources {execution: default-resources}]
[INFO] Using 'UTF-8' encoding to copy filtered resources.
[INFO] skip non existing resourceDirectory <https://hudson.apache.org/hudson/job/Cayenne-trunk/./cayenneTestConnection=h2,jdk=JDK%201.5%20(latest),label=Ubuntu/ws/trunk/itests/cayenne-tools-itest/src/main/resources>
[INFO] [compiler:compile {execution: default-compile}]
[INFO] No sources to compile
[INFO] [resources:testResources {execution: default-testResources}]
[INFO] Using 'UTF-8' encoding to copy filtered resources.
[INFO] Copying 5 resources
[INFO] [compiler:testCompile {execution: default-testCompile}]
[INFO] Compiling 1 source file to <https://hudson.apache.org/hudson/job/Cayenne-trunk/./cayenneTestConnection=h2,jdk=JDK%201.5%20(latest),label=Ubuntu/ws/trunk/itests/cayenne-tools-itest/target/test-classes>
[INFO] ------------------------------------------------------------------------
[ERROR] BUILD FAILURE
[INFO] ------------------------------------------------------------------------
[INFO] Compilation failure
error: error reading /home/hudson/.m2/repository/org/apache/cayenne/cayenne-server/3.1-SNAPSHOT/cayenne-server-3.1-SNAPSHOT.jar; error in opening zip file

[INFO] ------------------------------------------------------------------------
[INFO] Trace
org.apache.maven.BuildFailureException: Compilation failure
error: error reading /home/hudson/.m2/repository/org/apache/cayenne/cayenne-server/3.1-SNAPSHOT/cayenne-server-3.1-SNAPSHOT.jar; error in opening zip file

	at org.apache.maven.lifecycle.DefaultLifecycleExecutor.executeGoals(DefaultLifecycleExecutor.java:715)
	at org.apache.maven.lifecycle.DefaultLifecycleExecutor.executeGoalWithLifecycle(DefaultLifecycleExecutor.java:556)
	at org.apache.maven.lifecycle.DefaultLifecycleExecutor.executeGoal(DefaultLifecycleExecutor.java:535)
	at org.apache.maven.lifecycle.DefaultLifecycleExecutor.executeGoalAndHandleFailures(DefaultLifecycleExecutor.java:387)
	at org.apache.maven.lifecycle.DefaultLifecycleExecutor.executeTaskSegments(DefaultLifecycleExecutor.java:348)
	at org.apache.maven.lifecycle.DefaultLifecycleExecutor.execute(DefaultLifecycleExecutor.java:180)
	at org.apache.maven.DefaultMaven.doExecute(DefaultMaven.java:328)
	at org.apache.maven.DefaultMaven.execute(DefaultMaven.java:138)
	at org.apache.maven.cli.MavenCli.main(MavenCli.java:362)
	at org.apache.maven.cli.compat.CompatibleMain.main(CompatibleMain.java:60)
	at sun.reflect.NativeMethodAccessorImpl.invoke0(Native Method)
	at sun.reflect.NativeMethodAccessorImpl.invoke(NativeMethodAccessorImpl.java:39)
	at sun.reflect.DelegatingMethodAccessorImpl.invoke(DelegatingMethodAccessorImpl.java:25)
	at java.lang.reflect.Method.invoke(Method.java:592)
	at org.codehaus.classworlds.Launcher.launchEnhanced(Launcher.java:315)
	at org.codehaus.classworlds.Launcher.launch(Launcher.java:255)
	at org.codehaus.classworlds.Launcher.mainWithExitCode(Launcher.java:430)
	at org.codehaus.classworlds.Launcher.main(Launcher.java:375)
Caused by: org.apache.maven.plugin.CompilationFailureException: Compilation failure
error: error reading /home/hudson/.m2/repository/org/apache/cayenne/cayenne-server/3.1-SNAPSHOT/cayenne-server-3.1-SNAPSHOT.jar; error in opening zip file

	at org.apache.maven.plugin.AbstractCompilerMojo.execute(AbstractCompilerMojo.java:516)
	at org.apache.maven.plugin.TestCompilerMojo.execute(TestCompilerMojo.java:102)
	at org.apache.maven.plugin.DefaultPluginManager.executeMojo(DefaultPluginManager.java:490)
	at org.apache.maven.lifecycle.DefaultLifecycleExecutor.executeGoals(DefaultLifecycleExecutor.java:694)
	... 17 more
[INFO] ------------------------------------------------------------------------
[INFO] Total time: 1 minute 34 seconds
[INFO] Finished at: Mon Mar 07 05:57:28 GMT-08:00 2011
[INFO] Final Memory: 68M/306M
[INFO] ------------------------------------------------------------------------
Recording test results


Mime
View raw message