cayenne-commits mailing list archives

Site index · List index
Message view « Date » · « Thread »
Top « Date » · « Thread »
From Apache Jenkins Server <jenk...@builds.apache.org>
Subject Build failed in Jenkins: Cayenne-trunk » HSQLDB,JDK 1.6 (latest),Ubuntu #515
Date Mon, 04 Jul 2011 13:23:29 GMT
See <https://builds.apache.org/job/Cayenne-trunk/./cayenneTestConnection=HSQLDB,jdk=JDK%201.6%20(latest),label=Ubuntu/515/changes>

Changes:

[dkazimirchyk] CAY-1461 CayenneModeler: remove ScopeMVC dependency - ObjRelationshipInfoDialog

added this to release notes

[dkazimirchyk] CAY-1461 CayenneModeler: remove ScopeMVC dependencies

removed scopemvc dependency from the main pom

------------------------------------------
Started by upstream project "Cayenne-trunk" build number 515
Building remotely on ubuntu1
Cleaning up <https://builds.apache.org/job/Cayenne-trunk/./cayenneTestConnection=HSQLDB,jdk=JDK%201.6%20(latest),label=Ubuntu/ws/trunk>
Deleting <https://builds.apache.org/job/Cayenne-trunk/./cayenneTestConnection=HSQLDB,jdk=JDK%201.6%20(latest),label=Ubuntu/ws/trunk/tutorials/tutorial-rop-client/target>
Deleting <https://builds.apache.org/job/Cayenne-trunk/./cayenneTestConnection=HSQLDB,jdk=JDK%201.6%20(latest),label=Ubuntu/ws/trunk/tutorials/tutorial-rop-server/target>
Deleting <https://builds.apache.org/job/Cayenne-trunk/./cayenneTestConnection=HSQLDB,jdk=JDK%201.6%20(latest),label=Ubuntu/ws/trunk/tutorials/tutorial/target>
Deleting <https://builds.apache.org/job/Cayenne-trunk/./cayenneTestConnection=HSQLDB,jdk=JDK%201.6%20(latest),label=Ubuntu/ws/trunk/modeler/cayenne-modeler/target>
Deleting <https://builds.apache.org/job/Cayenne-trunk/./cayenneTestConnection=HSQLDB,jdk=JDK%201.6%20(latest),label=Ubuntu/ws/trunk/modeler/maven-cayenne-modeler-plugin/target>
Deleting <https://builds.apache.org/job/Cayenne-trunk/./cayenneTestConnection=HSQLDB,jdk=JDK%201.6%20(latest),label=Ubuntu/ws/trunk/itests/cayenne-runtime-itest/target>
Deleting <https://builds.apache.org/job/Cayenne-trunk/./cayenneTestConnection=HSQLDB,jdk=JDK%201.6%20(latest),label=Ubuntu/ws/trunk/itests/cayenne-tools-itest/target>
Deleting <https://builds.apache.org/job/Cayenne-trunk/./cayenneTestConnection=HSQLDB,jdk=JDK%201.6%20(latest),label=Ubuntu/ws/trunk/docs/doc/target>
Deleting <https://builds.apache.org/job/Cayenne-trunk/./cayenneTestConnection=HSQLDB,jdk=JDK%201.6%20(latest),label=Ubuntu/ws/trunk/build-tools/cayenne-test-utilities/target>
Deleting <https://builds.apache.org/job/Cayenne-trunk/./cayenneTestConnection=HSQLDB,jdk=JDK%201.6%20(latest),label=Ubuntu/ws/trunk/build-tools/maven-cayenne-build-plugin/target>
Deleting <https://builds.apache.org/job/Cayenne-trunk/./cayenneTestConnection=HSQLDB,jdk=JDK%201.6%20(latest),label=Ubuntu/ws/trunk/build-tools/maven-cayenne-doc-plugin/target>
Deleting <https://builds.apache.org/job/Cayenne-trunk/./cayenneTestConnection=HSQLDB,jdk=JDK%201.6%20(latest),label=Ubuntu/ws/trunk/framework/cayenne-jdk1.5-unpublished/target>
Deleting <https://builds.apache.org/job/Cayenne-trunk/./cayenneTestConnection=HSQLDB,jdk=JDK%201.6%20(latest),label=Ubuntu/ws/trunk/framework/cayenne-wocompat-unpublished/target>
Deleting <https://builds.apache.org/job/Cayenne-trunk/./cayenneTestConnection=HSQLDB,jdk=JDK%201.6%20(latest),label=Ubuntu/ws/trunk/framework/cayenne-server/target>
Deleting <https://builds.apache.org/job/Cayenne-trunk/./cayenneTestConnection=HSQLDB,jdk=JDK%201.6%20(latest),label=Ubuntu/ws/trunk/framework/cayenne-project/target>
Deleting <https://builds.apache.org/job/Cayenne-trunk/./cayenneTestConnection=HSQLDB,jdk=JDK%201.6%20(latest),label=Ubuntu/ws/trunk/framework/maven-cayenne-plugin/target>
Deleting <https://builds.apache.org/job/Cayenne-trunk/./cayenneTestConnection=HSQLDB,jdk=JDK%201.6%20(latest),label=Ubuntu/ws/trunk/framework/cayenne-lifecycle/target>
Deleting <https://builds.apache.org/job/Cayenne-trunk/./cayenneTestConnection=HSQLDB,jdk=JDK%201.6%20(latest),label=Ubuntu/ws/trunk/framework/cayenne-tools/target>
Deleting <https://builds.apache.org/job/Cayenne-trunk/./cayenneTestConnection=HSQLDB,jdk=JDK%201.6%20(latest),label=Ubuntu/ws/trunk/framework/cayenne-client/target>
Deleting <https://builds.apache.org/job/Cayenne-trunk/./cayenneTestConnection=HSQLDB,jdk=JDK%201.6%20(latest),label=Ubuntu/ws/trunk/framework/cayenne-di-unpublished/target>
Deleting <https://builds.apache.org/job/Cayenne-trunk/./cayenneTestConnection=HSQLDB,jdk=JDK%201.6%20(latest),label=Ubuntu/ws/trunk/framework/cayenne-legal-unpublished/target>
Updating http://svn.apache.org/repos/asf/cayenne/main/trunk
D         modeler/cayenne-modeler/src/test/java/org/apache/cayenne/modeler/dialog
U         modeler/cayenne-modeler/src/main/java/org/apache/cayenne/modeler/Application.java
U         modeler/cayenne-modeler/src/main/java/org/apache/cayenne/modeler/dialog/ErrorDebugDialog.java
U         modeler/cayenne-modeler/src/main/java/org/apache/cayenne/modeler/dialog/datadomain/CacheSyncConfigController.java
D         modeler/cayenne-modeler/src/main/java/org/apache/cayenne/modeler/dialog/datamap/DefaultsPreferencesModel.java
D         modeler/cayenne-modeler/src/main/java/org/apache/cayenne/modeler/dialog/objentity/EntityRelationshipsModel.java
U         modeler/cayenne-modeler/src/main/java/org/apache/cayenne/modeler/dialog/AboutDialog.java
D         modeler/cayenne-modeler/src/main/java/org/apache/cayenne/modeler/util/MapModel.java
U         modeler/cayenne-modeler/src/main/java/org/apache/cayenne/modeler/util/CayenneDialog.java
U         modeler/cayenne-modeler/src/main/java/org/apache/cayenne/modeler/util/ProgressDialog.java
U         modeler/cayenne-modeler/src/main/java/org/apache/cayenne/modeler/util/ModelerUtil.java
U         modeler/cayenne-modeler/pom.xml
U         docs/doc/src/main/resources/RELEASE-NOTES.txt
U         pom.xml
At revision 1142652
[trunk] $ /home/hudson/tools/maven/latest3/bin/mvn -Dlabel=Ubuntu "-Djdk=JDK 1.6 (latest)"
-DcayenneTestConnection=HSQLDB -e clean install
[INFO] Error stacktraces are turned on.
[INFO] Scanning for projects...
[ERROR] The build could not read 2 projects -> [Help 1]
org.apache.maven.project.ProjectBuildingException: Some problems were encountered while processing
the POMs:
[ERROR] 'dependencies.dependency.version' for org.scopemvc:scopemvc:jar is missing. @ line
78, column 15
[ERROR] 'dependencies.dependency.version' for org.scopemvc:scopemvc:jar is missing. @ line
121, column 15

	at org.apache.maven.project.DefaultProjectBuilder.build(DefaultProjectBuilder.java:339)
	at org.apache.maven.DefaultMaven.collectProjects(DefaultMaven.java:632)
	at org.apache.maven.DefaultMaven.getProjectsForMavenReactor(DefaultMaven.java:581)
	at org.apache.maven.DefaultMaven.doExecute(DefaultMaven.java:233)
	at org.apache.maven.DefaultMaven.execute(DefaultMaven.java:156)
	at org.apache.maven.cli.MavenCli.execute(MavenCli.java:537)
	at org.apache.maven.cli.MavenCli.doMain(MavenCli.java:196)
	at org.apache.maven.cli.MavenCli.main(MavenCli.java:141)
	at sun.reflect.NativeMethodAccessorImpl.invoke0(Native Method)
	at sun.reflect.NativeMethodAccessorImpl.invoke(NativeMethodAccessorImpl.java:39)
	at sun.reflect.DelegatingMethodAccessorImpl.invoke(DelegatingMethodAccessorImpl.java:25)
	at java.lang.reflect.Method.invoke(Method.java:597)
	at org.codehaus.plexus.classworlds.launcher.Launcher.launchEnhanced(Launcher.java:290)
	at org.codehaus.plexus.classworlds.launcher.Launcher.launch(Launcher.java:230)
	at org.codehaus.plexus.classworlds.launcher.Launcher.mainWithExitCode(Launcher.java:409)
	at org.codehaus.plexus.classworlds.launcher.Launcher.main(Launcher.java:352)
[ERROR]   
[ERROR]   The project org.apache.cayenne.build-tools:maven-cayenne-build-plugin:3.1-SNAPSHOT
(<https://builds.apache.org/job/Cayenne-trunk/./cayenneTestConnection=HSQLDB,jdk=JDK%201.6%20(latest),label=Ubuntu/ws/trunk/build-tools/maven-cayenne-build-plugin/pom.xml)>
has 1 error
[ERROR]     'dependencies.dependency.version' for org.scopemvc:scopemvc:jar is missing. @
line 78, column 15
[ERROR]   
[ERROR]   The project org.apache.cayenne.docs:cayenne-doc:3.1-SNAPSHOT (<https://builds.apache.org/job/Cayenne-trunk/./cayenneTestConnection=HSQLDB,jdk=JDK%201.6%20(latest),label=Ubuntu/ws/trunk/docs/doc/pom.xml)>
has 1 error
[ERROR]     'dependencies.dependency.version' for org.scopemvc:scopemvc:jar is missing. @
line 121, column 15
[ERROR] 
[ERROR] Re-run Maven using the -X switch to enable full debug logging.
[ERROR] 
[ERROR] For more information about the errors and possible solutions, please read the following
articles:
[ERROR] [Help 1] http://cwiki.apache.org/confluence/display/MAVEN/ProjectBuildingException
Archiving artifacts


Mime
View raw message