cayenne-commits mailing list archives

Site index · List index
Message view « Date » · « Thread »
Top « Date » · « Thread »
From Apache Jenkins Server <jenk...@builds.apache.org>
Subject Build failed in Jenkins: Cayenne-30 » JDK 1.6 (latest),Ubuntu #130
Date Tue, 05 Jul 2011 09:33:18 GMT
See <https://builds.apache.org/job/Cayenne-30/./jdk=JDK%201.6%20(latest),label=Ubuntu/130/changes>

Changes:

[dkazimirchyk] CAY-1577 SQL queries for LIKE expressions with escape character generated with
syntax errors

patch + unit test
applied this for 3.0 branch

------------------------------------------
[...truncated 82300 lines...]
[INFO] Building jar: /x1/jenkins/jenkins-slave/workspace/Cayenne-30/jdk/JDK 1.6 (latest)/label/Ubuntu/STABLE-3.0/itests/pojo/target/pojo-3.0-SNAPSHOT.jar
[INFO] [install:install {execution: default-install}]
[INFO] Installing /x1/jenkins/jenkins-slave/workspace/Cayenne-30/jdk/JDK 1.6 (latest)/label/Ubuntu/STABLE-3.0/itests/pojo/target/pojo-3.0-SNAPSHOT.jar
to /home/jenkins/.m2/repository/org/apache/cayenne/itests/pojo/3.0-SNAPSHOT/pojo-3.0-SNAPSHOT.jar
[INFO] ------------------------------------------------------------------------
[INFO] Building Integration Tests - JPA Chapter 2
[INFO]    task-segment: [clean, install]
[INFO] ------------------------------------------------------------------------
[INFO] [clean:clean {execution: default-clean}]
[INFO] [resources:resources {execution: default-resources}]
[INFO] Using 'UTF-8' encoding to copy filtered resources.
[INFO] Copying 1 resource
[INFO] [compiler:compile {execution: default-compile}]
[INFO] Compiling 35 source files to /x1/jenkins/jenkins-slave/workspace/Cayenne-30/jdk/JDK
1.6 (latest)/label/Ubuntu/STABLE-3.0/itests/jpa-chapter2/target/classes
[INFO] [resources:testResources {execution: default-testResources}]
[INFO] Using 'UTF-8' encoding to copy filtered resources.
[INFO] Copying 1 resource
[INFO] [compiler:testCompile {execution: default-testCompile}]
[INFO] Compiling 8 source files to /x1/jenkins/jenkins-slave/workspace/Cayenne-30/jdk/JDK
1.6 (latest)/label/Ubuntu/STABLE-3.0/itests/jpa-chapter2/target/test-classes
[INFO] [surefire:test {execution: default-test}]
[INFO] Surefire report directory: /x1/jenkins/jenkins-slave/workspace/Cayenne-30/jdk/JDK 1.6
(latest)/label/Ubuntu/STABLE-3.0/itests/jpa-chapter2/target/surefire-reports
*** CayenneAgent starting...

-------------------------------------------------------
 T E S T S
-------------------------------------------------------
Running org.apache.cayenne.jpa.itest.ch2._2_1_8_2_BidiManyToOneRelationshipTest
log4j:WARN No appenders could be found for logger (org.apache.cayenne.jpa.Provider).
log4j:WARN Please initialize the log4j system properly.
Tests run: 1, Failures: 0, Errors: 0, Skipped: 0, Time elapsed: 0.592 sec
Running org.apache.cayenne.jpa.itest.ch2._2_1_8_1_BidiOneToOneRelationshipsTest
Tests run: 1, Failures: 0, Errors: 0, Skipped: 0, Time elapsed: 0.004 sec
Running org.apache.cayenne.jpa.itest.ch2._2_1_5_EmbeddableTest
Tests run: 3, Failures: 0, Errors: 0, Skipped: 0, Time elapsed: 0.095 sec
Running org.apache.cayenne.jpa.itest.ch2._2_1_1_PeristentFieldsAndPropertiesTest
Tests run: 5, Failures: 0, Errors: 0, Skipped: 0, Time elapsed: 0.012 sec
Running org.apache.cayenne.jpa.itest.ch2._2_1_4_PrimaryKeyAndIdentityTest
Tests run: 2, Failures: 0, Errors: 0, Skipped: 0, Time elapsed: 0.005 sec
Running org.apache.cayenne.jpa.itest.ch2._2_1_10_1_SingleTablePerClassTest
Tests run: 2, Failures: 0, Errors: 0, Skipped: 0, Time elapsed: 0.062 sec
Running org.apache.cayenne.jpa.itest.ch2._2_1_7_EntityRelationshipsTest
Tests run: 2, Failures: 0, Errors: 0, Skipped: 0, Time elapsed: 0.006 sec
Running org.apache.cayenne.jpa.itest.ch2._2_1_6_MappingDefaultsNonRelationshipTest
Tests run: 4, Failures: 0, Errors: 0, Skipped: 0, Time elapsed: 0.028 sec

Results :

Tests run: 20, Failures: 0, Errors: 0, Skipped: 0

[INFO] [jar:jar {execution: default-jar}]
[INFO] Building jar: /x1/jenkins/jenkins-slave/workspace/Cayenne-30/jdk/JDK 1.6 (latest)/label/Ubuntu/STABLE-3.0/itests/jpa-chapter2/target/jpa-chapter2-3.0-SNAPSHOT.jar
[INFO] [install:install {execution: default-install}]
[INFO] Installing /x1/jenkins/jenkins-slave/workspace/Cayenne-30/jdk/JDK 1.6 (latest)/label/Ubuntu/STABLE-3.0/itests/jpa-chapter2/target/jpa-chapter2-3.0-SNAPSHOT.jar
to /home/jenkins/.m2/repository/org/apache/cayenne/itests/jpa-chapter2/3.0-SNAPSHOT/jpa-chapter2-3.0-SNAPSHOT.jar
[INFO] ------------------------------------------------------------------------
[INFO] Building Integration Tests - JPA Chapter 3
[INFO]    task-segment: [clean, install]
[INFO] ------------------------------------------------------------------------
[INFO] [clean:clean {execution: default-clean}]
[INFO] [resources:resources {execution: default-resources}]
[INFO] Using 'UTF-8' encoding to copy filtered resources.
[INFO] Copying 1 resource
[INFO] [compiler:compile {execution: default-compile}]
[INFO] Compiling 9 source files to /x1/jenkins/jenkins-slave/workspace/Cayenne-30/jdk/JDK
1.6 (latest)/label/Ubuntu/STABLE-3.0/itests/jpa-chapter3/target/classes
[INFO] [resources:testResources {execution: default-testResources}]
[INFO] Using 'UTF-8' encoding to copy filtered resources.
[INFO] Copying 1 resource
[INFO] [compiler:testCompile {execution: default-testCompile}]
[INFO] Compiling 5 source files to /x1/jenkins/jenkins-slave/workspace/Cayenne-30/jdk/JDK
1.6 (latest)/label/Ubuntu/STABLE-3.0/itests/jpa-chapter3/target/test-classes
[WARNING] /x1/jenkins/jenkins-slave/workspace/Cayenne-30/jdk/JDK 1.6 (latest)/label/Ubuntu/STABLE-3.0/itests/jpa-chapter3/src/test/java/org/apache/cayenne/jpa/itest/ch3/_3_6_1_QueryAPITest.java:[30,22]
sun.java2d.pipe.SpanShapeRenderer is Sun proprietary API and may be removed in a future release

[WARNING] /x1/jenkins/jenkins-slave/workspace/Cayenne-30/jdk/JDK 1.6 (latest)/label/Ubuntu/STABLE-3.0/itests/jpa-chapter3/src/test/java/org/apache/cayenne/jpa/itest/ch3/_3_6_1_QueryAPITest.java:[30,22]
sun.java2d.pipe.SpanShapeRenderer is Sun proprietary API and may be removed in a future release

[INFO] [surefire:test {execution: default-test}]
[INFO] Surefire report directory: /x1/jenkins/jenkins-slave/workspace/Cayenne-30/jdk/JDK 1.6
(latest)/label/Ubuntu/STABLE-3.0/itests/jpa-chapter3/target/surefire-reports
*** CayenneAgent starting...

-------------------------------------------------------
 T E S T S
-------------------------------------------------------
Running org.apache.cayenne.jpa.itest.ch3._3_1_1_EntityManagerTransactionTest
log4j:WARN No appenders could be found for logger (org.apache.cayenne.jpa.Provider).
log4j:WARN Please initialize the log4j system properly.
Tests run: 1, Failures: 0, Errors: 0, Skipped: 0, Time elapsed: 0.556 sec
Running org.apache.cayenne.jpa.itest.ch3._3_1_1_EntityManagerTest
Tests run: 12, Failures: 0, Errors: 0, Skipped: 0, Time elapsed: 0.097 sec
Running org.apache.cayenne.jpa.itest.ch3._3_6_1_QueryAPITest
Tests run: 8, Failures: 0, Errors: 0, Skipped: 0, Time elapsed: 0.023 sec
Running org.apache.cayenne.jpa.itest.ch3._3_6_6_SQLQueriesTest
Tests run: 2, Failures: 0, Errors: 0, Skipped: 0, Time elapsed: 0.003 sec
Running org.apache.cayenne.jpa.itest.ch3._3_5_1_LifecycleCallbackMethodsTest
Tests run: 2, Failures: 0, Errors: 0, Skipped: 0, Time elapsed: 0.008 sec

Results :

Tests run: 25, Failures: 0, Errors: 0, Skipped: 0

[INFO] [jar:jar {execution: default-jar}]
[INFO] Building jar: /x1/jenkins/jenkins-slave/workspace/Cayenne-30/jdk/JDK 1.6 (latest)/label/Ubuntu/STABLE-3.0/itests/jpa-chapter3/target/jpa-chapter3-3.0-SNAPSHOT.jar
[INFO] [install:install {execution: default-install}]
[INFO] Installing /x1/jenkins/jenkins-slave/workspace/Cayenne-30/jdk/JDK 1.6 (latest)/label/Ubuntu/STABLE-3.0/itests/jpa-chapter3/target/jpa-chapter3-3.0-SNAPSHOT.jar
to /home/jenkins/.m2/repository/org/apache/cayenne/itests/jpa-chapter3/3.0-SNAPSHOT/jpa-chapter3-3.0-SNAPSHOT.jar
[INFO] ------------------------------------------------------------------------
[INFO] Building Integration Tests - JPA Chapter 5
[INFO]    task-segment: [clean, install]
[INFO] ------------------------------------------------------------------------
[INFO] [clean:clean {execution: default-clean}]
[INFO] [resources:resources {execution: default-resources}]
[INFO] Using 'UTF-8' encoding to copy filtered resources.
[INFO] Copying 1 resource
Downloading: http://objectstyle.org/maven2/org/apache/derby/derby/10.3.2.1/derby-10.3.2.1.pom
[INFO] Unable to find resource 'org.apache.derby:derby:pom:10.3.2.1' in repository objectstyle
(http://objectstyle.org/maven2)
Downloading: http://caucho.com/m2/org/apache/derby/derby/10.3.2.1/derby-10.3.2.1.pom
[INFO] Unable to find resource 'org.apache.derby:derby:pom:10.3.2.1' in repository caucho
(http://caucho.com/m2)
Downloading: http://repo1.maven.org/maven2/org/apache/derby/derby/10.3.2.1/derby-10.3.2.1.pom
[WARNING] Unable to get resource 'org.apache.derby:derby:pom:10.3.2.1' from repository central
(http://repo1.maven.org/maven2): Error transferring file: Connection timed out
[INFO] [compiler:compile {execution: default-compile}]
[INFO] Compiling 2 source files to /x1/jenkins/jenkins-slave/workspace/Cayenne-30/jdk/JDK
1.6 (latest)/label/Ubuntu/STABLE-3.0/itests/jpa-chapter5/target/classes
[INFO] [resources:testResources {execution: default-testResources}]
[INFO] Using 'UTF-8' encoding to copy filtered resources.
[INFO] Copying 1 resource
Downloading: http://objectstyle.org/maven2/org/apache/derby/derby/10.3.2.1/derby-10.3.2.1.jar
[INFO] Unable to find resource 'org.apache.derby:derby:jar:10.3.2.1' in repository objectstyle
(http://objectstyle.org/maven2)
Downloading: http://caucho.com/m2/org/apache/derby/derby/10.3.2.1/derby-10.3.2.1.jar
[INFO] Unable to find resource 'org.apache.derby:derby:jar:10.3.2.1' in repository caucho
(http://caucho.com/m2)
Downloading: http://repo1.maven.org/maven2/org/apache/derby/derby/10.3.2.1/derby-10.3.2.1.jar
[WARNING] Unable to get resource 'org.apache.derby:derby:jar:10.3.2.1' from repository central
(http://repo1.maven.org/maven2): Error transferring file: Connection timed out
[INFO] ------------------------------------------------------------------------
[ERROR] BUILD ERROR
[INFO] ------------------------------------------------------------------------
[INFO] Failed to resolve artifact.

Missing:
----------
1) org.apache.derby:derby:jar:10.3.2.1

  Try downloading the file manually from the project website.

  Then, install it using the command: 
      mvn install:install-file -DgroupId=org.apache.derby -DartifactId=derby -Dversion=10.3.2.1
-Dpackaging=jar -Dfile=/path/to/file

  Alternatively, if you host your own repository you can deploy the file there: 
      mvn deploy:deploy-file -DgroupId=org.apache.derby -DartifactId=derby -Dversion=10.3.2.1
-Dpackaging=jar -Dfile=/path/to/file -Durl=[url] -DrepositoryId=[id]

  Path to dependency: 
  	1) org.apache.cayenne.itests:jpa-chapter5:jar:3.0-SNAPSHOT
  	2) org.apache.derby:derby:jar:10.3.2.1

----------
1 required artifact is missing.

for artifact: 
  org.apache.cayenne.itests:jpa-chapter5:jar:3.0-SNAPSHOT

from the specified remote repositories:
  central (http://repo1.maven.org/maven2),
  apache-snapshots (http://people.apache.org/repo/m2-snapshot-repository/),
  caucho (http://caucho.com/m2),
  objectstyle (http://objectstyle.org/maven2)



[INFO] ------------------------------------------------------------------------
[INFO] Trace
org.apache.maven.lifecycle.LifecycleExecutionException: Missing:
----------
1) org.apache.derby:derby:jar:10.3.2.1

  Try downloading the file manually from the project website.

  Then, install it using the command: 
      mvn install:install-file -DgroupId=org.apache.derby -DartifactId=derby -Dversion=10.3.2.1
-Dpackaging=jar -Dfile=/path/to/file

  Alternatively, if you host your own repository you can deploy the file there: 
      mvn deploy:deploy-file -DgroupId=org.apache.derby -DartifactId=derby -Dversion=10.3.2.1
-Dpackaging=jar -Dfile=/path/to/file -Durl=[url] -DrepositoryId=[id]

  Path to dependency: 
  	1) org.apache.cayenne.itests:jpa-chapter5:jar:3.0-SNAPSHOT
  	2) org.apache.derby:derby:jar:10.3.2.1

----------
1 required artifact is missing.

for artifact: 
  org.apache.cayenne.itests:jpa-chapter5:jar:3.0-SNAPSHOT

from the specified remote repositories:
  central (http://repo1.maven.org/maven2),
  apache-snapshots (http://people.apache.org/repo/m2-snapshot-repository/),
  caucho (http://caucho.com/m2),
  objectstyle (http://objectstyle.org/maven2)


	at org.apache.maven.lifecycle.DefaultLifecycleExecutor.executeGoals(DefaultLifecycleExecutor.java:711)
	at org.apache.maven.lifecycle.DefaultLifecycleExecutor.executeGoalWithLifecycle(DefaultLifecycleExecutor.java:556)
	at org.apache.maven.lifecycle.DefaultLifecycleExecutor.executeGoal(DefaultLifecycleExecutor.java:535)
	at org.apache.maven.lifecycle.DefaultLifecycleExecutor.executeGoalAndHandleFailures(DefaultLifecycleExecutor.java:387)
	at org.apache.maven.lifecycle.DefaultLifecycleExecutor.executeTaskSegments(DefaultLifecycleExecutor.java:348)
	at org.apache.maven.lifecycle.DefaultLifecycleExecutor.execute(DefaultLifecycleExecutor.java:180)
	at org.apache.maven.DefaultMaven.doExecute(DefaultMaven.java:328)
	at org.apache.maven.DefaultMaven.execute(DefaultMaven.java:138)
	at org.apache.maven.cli.MavenCli.main(MavenCli.java:362)
	at org.apache.maven.cli.compat.CompatibleMain.main(CompatibleMain.java:60)
	at sun.reflect.NativeMethodAccessorImpl.invoke0(Native Method)
	at sun.reflect.NativeMethodAccessorImpl.invoke(NativeMethodAccessorImpl.java:39)
	at sun.reflect.DelegatingMethodAccessorImpl.invoke(DelegatingMethodAccessorImpl.java:25)
	at java.lang.reflect.Method.invoke(Method.java:597)
	at org.codehaus.classworlds.Launcher.launchEnhanced(Launcher.java:315)
	at org.codehaus.classworlds.Launcher.launch(Launcher.java:255)
	at org.codehaus.classworlds.Launcher.mainWithExitCode(Launcher.java:430)
	at org.codehaus.classworlds.Launcher.main(Launcher.java:375)
Caused by: org.apache.maven.artifact.resolver.MultipleArtifactsNotFoundException: Missing:
----------
1) org.apache.derby:derby:jar:10.3.2.1

  Try downloading the file manually from the project website.

  Then, install it using the command: 
      mvn install:install-file -DgroupId=org.apache.derby -DartifactId=derby -Dversion=10.3.2.1
-Dpackaging=jar -Dfile=/path/to/file

  Alternatively, if you host your own repository you can deploy the file there: 
      mvn deploy:deploy-file -DgroupId=org.apache.derby -DartifactId=derby -Dversion=10.3.2.1
-Dpackaging=jar -Dfile=/path/to/file -Durl=[url] -DrepositoryId=[id]

  Path to dependency: 
  	1) org.apache.cayenne.itests:jpa-chapter5:jar:3.0-SNAPSHOT
  	2) org.apache.derby:derby:jar:10.3.2.1

----------
1 required artifact is missing.

for artifact: 
  org.apache.cayenne.itests:jpa-chapter5:jar:3.0-SNAPSHOT

from the specified remote repositories:
  central (http://repo1.maven.org/maven2),
  apache-snapshots (http://people.apache.org/repo/m2-snapshot-repository/),
  caucho (http://caucho.com/m2),
  objectstyle (http://objectstyle.org/maven2)


	at org.apache.maven.artifact.resolver.DefaultArtifactResolver.resolveTransitively(DefaultArtifactResolver.java:360)
	at org.apache.maven.artifact.resolver.DefaultArtifactResolver.resolveTransitively(DefaultArtifactResolver.java:304)
	at org.apache.maven.plugin.DefaultPluginManager.resolveTransitiveDependencies(DefaultPluginManager.java:1499)
	at org.apache.maven.plugin.DefaultPluginManager.executeMojo(DefaultPluginManager.java:442)
	at org.apache.maven.lifecycle.DefaultLifecycleExecutor.executeGoals(DefaultLifecycleExecutor.java:694)
	... 17 more
[INFO] ------------------------------------------------------------------------
[INFO] Total time: 5 minutes 16 seconds
[INFO] Finished at: Tue Jul 05 09:31:14 UTC 2011
[INFO] Final Memory: 144M/452M
[INFO] ------------------------------------------------------------------------
Recording test results


Mime
View raw message