cayenne-commits mailing list archives

Site index · List index
Message view « Date » · « Thread »
Top « Date » · « Thread »
From Apache Jenkins Server <jenk...@builds.apache.org>
Subject Build failed in Jenkins: Cayenne-30 » JDK 1.5 (latest),Ubuntu #130
Date Tue, 05 Jul 2011 09:32:26 GMT
See <https://builds.apache.org/job/Cayenne-30/./jdk=JDK%201.5%20(latest),label=Ubuntu/130/changes>

Changes:

[dkazimirchyk] CAY-1577 SQL queries for LIKE expressions with escape character generated with
syntax errors

patch + unit test
applied this for 3.0 branch

------------------------------------------
[...truncated 94893 lines...]
134131/?
134715/?
135329/?
135916/?
136495/?
137083/?
137798/?
138247/?
138843/?
139443/?
140036/?
140548/?
141061/?
141572/?
142085/?
142597/?
143110/?
143630/?
144156/?
144669/?
145180/?
145693/?
146204/?
146717/?
147228/?
147740/?
148341/?
148852/?
149364/?
149969/?
150564/?
151165/?
151755/?
152043/?
152555/?
153067/?
153538/?
153561/?
154073/?
154585/?
155102/?
155552/?
156065/?
156576/?
157088/?
157600/?
158196/?
158708/?
159220/?
159809/?
160320/?
160832/?
161343/?
161929/?
162441/?
162953/?
163465/?
163980/?
164491/?
165090/?
165676/?
166188/?
166699/?
167211/?
167811/?
168322/?
168983/?
169638/?
170296/?
170878/?
171389/?
171901/?
172492/?
172966/?
173541/?
174052/?
174563/?
175155/?
175667/?
176271/?
176866/?
177380/?
177891/?
178495/?
179006/?
179570/?
180085/?
180678/?
181190/?
181801/?
182313/?
182911/?
183423/?
183934/?
184542/?
185054/?
185630/?
186142/?
186653/?
187165/?
187758/?
188306/?
188321/?
188345/?
188857/?
189368/?
189880/?
190393/?
190807/?
191304/?
191800/?
192511/?
193009/?
193639/?
195571/?
197719/?
200082/?
202302/?
205281/?
206299/?
        
[INFO] ------------------------------------------------------------------------
[ERROR] BUILD ERROR
[INFO] ------------------------------------------------------------------------
[INFO] Failed to resolve artifact.

Missing:
----------
1) wsdl4j:wsdl4j:jar:1.6.1

  Try downloading the file manually from the project website.

  Then, install it using the command: 
      mvn install:install-file -DgroupId=wsdl4j -DartifactId=wsdl4j -Dversion=1.6.1 -Dpackaging=jar
-Dfile=/path/to/file

  Alternatively, if you host your own repository you can deploy the file there: 
      mvn deploy:deploy-file -DgroupId=wsdl4j -DartifactId=wsdl4j -Dversion=1.6.1 -Dpackaging=jar
-Dfile=/path/to/file -Durl=[url] -DrepositoryId=[id]

  Path to dependency: 
  	1) org.apache.cayenne.itests:itest-common:jar:3.0-SNAPSHOT
  	2) org.apache.openejb:openejb-core:jar:3.0
  	3) wsdl4j:wsdl4j:jar:1.6.1

----------
1 required artifact is missing.

for artifact: 
  org.apache.cayenne.itests:itest-common:jar:3.0-SNAPSHOT

from the specified remote repositories:
  central (http://repo1.maven.org/maven2),
  apache-snapshots (http://people.apache.org/repo/m2-snapshot-repository/),
  objectstyle (http://objectstyle.org/maven2),
  caucho (http://caucho.com/m2)



[INFO] ------------------------------------------------------------------------
[INFO] Trace
org.apache.maven.lifecycle.LifecycleExecutionException: Missing:
----------
1) wsdl4j:wsdl4j:jar:1.6.1

  Try downloading the file manually from the project website.

  Then, install it using the command: 
      mvn install:install-file -DgroupId=wsdl4j -DartifactId=wsdl4j -Dversion=1.6.1 -Dpackaging=jar
-Dfile=/path/to/file

  Alternatively, if you host your own repository you can deploy the file there: 
      mvn deploy:deploy-file -DgroupId=wsdl4j -DartifactId=wsdl4j -Dversion=1.6.1 -Dpackaging=jar
-Dfile=/path/to/file -Durl=[url] -DrepositoryId=[id]

  Path to dependency: 
  	1) org.apache.cayenne.itests:itest-common:jar:3.0-SNAPSHOT
  	2) org.apache.openejb:openejb-core:jar:3.0
  	3) wsdl4j:wsdl4j:jar:1.6.1

----------
1 required artifact is missing.

for artifact: 
  org.apache.cayenne.itests:itest-common:jar:3.0-SNAPSHOT

from the specified remote repositories:
  central (http://repo1.maven.org/maven2),
  apache-snapshots (http://people.apache.org/repo/m2-snapshot-repository/),
  objectstyle (http://objectstyle.org/maven2),
  caucho (http://caucho.com/m2)


	at org.apache.maven.lifecycle.DefaultLifecycleExecutor.executeGoals(DefaultLifecycleExecutor.java:711)
	at org.apache.maven.lifecycle.DefaultLifecycleExecutor.executeGoalWithLifecycle(DefaultLifecycleExecutor.java:556)
	at org.apache.maven.lifecycle.DefaultLifecycleExecutor.executeGoal(DefaultLifecycleExecutor.java:535)
	at org.apache.maven.lifecycle.DefaultLifecycleExecutor.executeGoalAndHandleFailures(DefaultLifecycleExecutor.java:387)
	at org.apache.maven.lifecycle.DefaultLifecycleExecutor.executeTaskSegments(DefaultLifecycleExecutor.java:348)
	at org.apache.maven.lifecycle.DefaultLifecycleExecutor.execute(DefaultLifecycleExecutor.java:180)
	at org.apache.maven.DefaultMaven.doExecute(DefaultMaven.java:328)
	at org.apache.maven.DefaultMaven.execute(DefaultMaven.java:138)
	at org.apache.maven.cli.MavenCli.main(MavenCli.java:362)
	at org.apache.maven.cli.compat.CompatibleMain.main(CompatibleMain.java:60)
	at sun.reflect.NativeMethodAccessorImpl.invoke0(Native Method)
	at sun.reflect.NativeMethodAccessorImpl.invoke(NativeMethodAccessorImpl.java:39)
	at sun.reflect.DelegatingMethodAccessorImpl.invoke(DelegatingMethodAccessorImpl.java:25)
	at java.lang.reflect.Method.invoke(Method.java:592)
	at org.codehaus.classworlds.Launcher.launchEnhanced(Launcher.java:315)
	at org.codehaus.classworlds.Launcher.launch(Launcher.java:255)
	at org.codehaus.classworlds.Launcher.mainWithExitCode(Launcher.java:430)
	at org.codehaus.classworlds.Launcher.main(Launcher.java:375)
Caused by: org.apache.maven.artifact.resolver.MultipleArtifactsNotFoundException: Missing:
----------
1) wsdl4j:wsdl4j:jar:1.6.1

  Try downloading the file manually from the project website.

  Then, install it using the command: 
      mvn install:install-file -DgroupId=wsdl4j -DartifactId=wsdl4j -Dversion=1.6.1 -Dpackaging=jar
-Dfile=/path/to/file

  Alternatively, if you host your own repository you can deploy the file there: 
      mvn deploy:deploy-file -DgroupId=wsdl4j -DartifactId=wsdl4j -Dversion=1.6.1 -Dpackaging=jar
-Dfile=/path/to/file -Durl=[url] -DrepositoryId=[id]

  Path to dependency: 
  	1) org.apache.cayenne.itests:itest-common:jar:3.0-SNAPSHOT
  	2) org.apache.openejb:openejb-core:jar:3.0
  	3) wsdl4j:wsdl4j:jar:1.6.1

----------
1 required artifact is missing.

for artifact: 
  org.apache.cayenne.itests:itest-common:jar:3.0-SNAPSHOT

from the specified remote repositories:
  central (http://repo1.maven.org/maven2),
  apache-snapshots (http://people.apache.org/repo/m2-snapshot-repository/),
  objectstyle (http://objectstyle.org/maven2),
  caucho (http://caucho.com/m2)


	at org.apache.maven.artifact.resolver.DefaultArtifactResolver.resolveTransitively(DefaultArtifactResolver.java:360)
	at org.apache.maven.artifact.resolver.DefaultArtifactResolver.resolveTransitively(DefaultArtifactResolver.java:304)
	at org.apache.maven.plugin.DefaultPluginManager.resolveTransitiveDependencies(DefaultPluginManager.java:1499)
	at org.apache.maven.plugin.DefaultPluginManager.executeMojo(DefaultPluginManager.java:442)
	at org.apache.maven.lifecycle.DefaultLifecycleExecutor.executeGoals(DefaultLifecycleExecutor.java:694)
	... 17 more
[INFO] ------------------------------------------------------------------------
[INFO] Total time: 4 minutes 24 seconds
[INFO] Finished at: Tue Jul 05 09:30:22 GMT 2011
[INFO] Final Memory: 89M/426M
[INFO] ------------------------------------------------------------------------
Recording test results


Mime
View raw message