cayenne-commits mailing list archives

Site index · List index
Message view « Date » · « Thread »
Top « Date » · « Thread »
From Apache Jenkins Server <jenk...@builds.apache.org>
Subject Build failed in Jenkins: Cayenne-doc #261
Date Thu, 15 Sep 2011 00:27:42 GMT
See <https://builds.apache.org/job/Cayenne-doc/261/changes>

Changes:

[dkazimirchyk] CAY-1618 Create database adapters instances with proper injection

explicitly casting adapters created by AdhocObjectFactory to DbAdapter class

[dkazimirchyk] CAY-1210 mysql does not use index for case insensitive searches

case-insensitive-search.patch with some changes

[dkazimirchyk] CAY-1618 Create database adapters instances with proper injection

added tool DI module to create adapters in cayenne-tools and cayenne-maven-plugin with proper
injection

[dkazimirchyk] CAY-1618 Create database adapters instances with proper injection

db adapters sniffers refactoring + removed deprecated methods from AutoAdapter that we can't
longer support

[dkazimirchyk] CAY-1608 Implement constructor injection support for DefaultAdhocObjectFactory

release notes

------------------------------------------
[...truncated 483 lines...]
[INFO] skip non existing resourceDirectory <https://builds.apache.org/job/Cayenne-doc/ws/trunk/framework/cayenne-di-unpublished/src/test/resources>
[INFO] [compiler:testCompile {execution: default-testCompile}]
[WARNING] File encoding has not been set, using platform encoding ANSI_X3.4-1968, i.e. build
is platform dependent!
[INFO] Compiling 38 source files to <https://builds.apache.org/job/Cayenne-doc/ws/trunk/framework/cayenne-di-unpublished/target/test-classes>
[INFO] [surefire:test {execution: default-test}]
[INFO] Surefire report directory: <https://builds.apache.org/job/Cayenne-doc/ws/trunk/framework/cayenne-di-unpublished/target/surefire-reports>

-------------------------------------------------------
 T E S T S
-------------------------------------------------------
Running org.apache.cayenne.CayenneExceptionTest
Tests run: 6, Failures: 0, Errors: 0, Skipped: 0, Time elapsed: 0.029 sec
Running org.apache.cayenne.di.DIBootstrapTest
Tests run: 3, Failures: 0, Errors: 0, Skipped: 0, Time elapsed: 0.027 sec
Running org.apache.cayenne.di.spi.DefaultInjectorBindingTest
Tests run: 5, Failures: 0, Errors: 0, Skipped: 0, Time elapsed: 0.015 sec
Running org.apache.cayenne.di.KeyTest
Tests run: 3, Failures: 0, Errors: 0, Skipped: 0, Time elapsed: 0.005 sec
Running org.apache.cayenne.di.spi.DefaultInjectorInjectionTest
Tests run: 15, Failures: 0, Errors: 0, Skipped: 0, Time elapsed: 0.041 sec
Running org.apache.cayenne.di.spi.DefaultInjectorScopeTest
Tests run: 6, Failures: 0, Errors: 0, Skipped: 0, Time elapsed: 0.012 sec
Running org.apache.cayenne.di.spi.DefaultInjectorCircularInjectionTest
Tests run: 4, Failures: 0, Errors: 0, Skipped: 0, Time elapsed: 0.011 sec
Running org.apache.cayenne.di.spi.DefaultInjectorTest
Tests run: 4, Failures: 0, Errors: 0, Skipped: 0, Time elapsed: 0.006 sec
Running org.apache.cayenne.CayenneRuntimeExceptionTest
Tests run: 8, Failures: 0, Errors: 0, Skipped: 0, Time elapsed: 0.006 sec

Results :

Tests run: 54, Failures: 0, Errors: 0, Skipped: 0

[INFO] [jar:jar {execution: default-jar}]
[INFO] Building jar: <https://builds.apache.org/job/Cayenne-doc/ws/trunk/framework/cayenne-di-unpublished/target/cayenne-di-unpublished-3.1M4-SNAPSHOT.jar>
[INFO] Preparing source:jar
[WARNING] Removing: jar from forked lifecycle, to prevent recursive invocation.
[INFO] [cayenne-build:date {execution: date}]
[INFO] [source:jar {execution: bundle-source-jar}]
[INFO] org already added, skipping
[INFO] org/apache already added, skipping
[INFO] org/apache/cayenne already added, skipping
[INFO] Building jar: <https://builds.apache.org/job/Cayenne-doc/ws/trunk/framework/cayenne-di-unpublished/target/cayenne-di-unpublished-3.1M4-SNAPSHOT-sources.jar>
[INFO] org already added, skipping
[INFO] org/apache already added, skipping
[INFO] org/apache/cayenne already added, skipping
[INFO] [install:install {execution: default-install}]
[INFO] Installing <https://builds.apache.org/job/Cayenne-doc/ws/trunk/framework/cayenne-di-unpublished/target/cayenne-di-unpublished-3.1M4-SNAPSHOT.jar>
to /home/jenkins/.m2/repository/org/apache/cayenne/unpublished/cayenne-di-unpublished/3.1M4-SNAPSHOT/cayenne-di-unpublished-3.1M4-SNAPSHOT.jar
[INFO] Installing <https://builds.apache.org/job/Cayenne-doc/ws/trunk/framework/cayenne-di-unpublished/target/cayenne-di-unpublished-3.1M4-SNAPSHOT-sources.jar>
to /home/jenkins/.m2/repository/org/apache/cayenne/unpublished/cayenne-di-unpublished/3.1M4-SNAPSHOT/cayenne-di-unpublished-3.1M4-SNAPSHOT-sources.jar
[INFO] Preparing javadoc:javadoc
[INFO] [cayenne-build:date {execution: date}]
[INFO] [javadoc:javadoc {execution: default-cli}]
[WARNING] Source files encoding has not been set, using platform encoding ANSI_X3.4-1968,
i.e. build is platform dependent!
[ERROR] Error fetching link: http://java.sun.com/j2se/1.5.0/docs/api/package-list. Ignored
it.
[ERROR] Error fetching link: http://java.sun.com/j2se/1.5.0/docs/api/package-list. Ignored
it.
[INFO] 
Loading source files for package org.apache.cayenne...
Loading source files for package org.apache.cayenne.util...
Loading source files for package org.apache.cayenne.di...
Loading source files for package org.apache.cayenne.di.spi...
Constructing Javadoc information...
Standard Doclet version 1.6.0_20
Building tree for all the packages and classes...
Generating <https://builds.apache.org/job/Cayenne-doc/ws/trunk/framework/cayenne-di-unpublished/target/site/apidocs/org/apache/cayenne//CayenneException.html...>
Generating <https://builds.apache.org/job/Cayenne-doc/ws/trunk/framework/cayenne-di-unpublished/target/site/apidocs/org/apache/cayenne//CayenneRuntimeException.html...>
Generating <https://builds.apache.org/job/Cayenne-doc/ws/trunk/framework/cayenne-di-unpublished/target/site/apidocs/org/apache/cayenne//ConfigurationException.html...>
Generating <https://builds.apache.org/job/Cayenne-doc/ws/trunk/framework/cayenne-di-unpublished/target/site/apidocs/org/apache/cayenne/util//LocalizedStringsHandler.html...>
Generating <https://builds.apache.org/job/Cayenne-doc/ws/trunk/framework/cayenne-di-unpublished/target/site/apidocs/org/apache/cayenne/di//AdhocObjectFactory.html...>
Generating <https://builds.apache.org/job/Cayenne-doc/ws/trunk/framework/cayenne-di-unpublished/target/site/apidocs/org/apache/cayenne/di//BeforeScopeEnd.html...>
Generating <https://builds.apache.org/job/Cayenne-doc/ws/trunk/framework/cayenne-di-unpublished/target/site/apidocs/org/apache/cayenne/di//Binder.html...>
Generating <https://builds.apache.org/job/Cayenne-doc/ws/trunk/framework/cayenne-di-unpublished/target/site/apidocs/org/apache/cayenne/di//BindingBuilder.html...>
Generating <https://builds.apache.org/job/Cayenne-doc/ws/trunk/framework/cayenne-di-unpublished/target/site/apidocs/org/apache/cayenne/di//DIBootstrap.html...>
Generating <https://builds.apache.org/job/Cayenne-doc/ws/trunk/framework/cayenne-di-unpublished/target/site/apidocs/org/apache/cayenne/di//Inject.html...>
Generating <https://builds.apache.org/job/Cayenne-doc/ws/trunk/framework/cayenne-di-unpublished/target/site/apidocs/org/apache/cayenne/di//Injector.html...>
Generating <https://builds.apache.org/job/Cayenne-doc/ws/trunk/framework/cayenne-di-unpublished/target/site/apidocs/org/apache/cayenne/di//Key.html...>
Generating <https://builds.apache.org/job/Cayenne-doc/ws/trunk/framework/cayenne-di-unpublished/target/site/apidocs/org/apache/cayenne/di//ListBuilder.html...>
Generating <https://builds.apache.org/job/Cayenne-doc/ws/trunk/framework/cayenne-di-unpublished/target/site/apidocs/org/apache/cayenne/di//MapBuilder.html...>
Generating <https://builds.apache.org/job/Cayenne-doc/ws/trunk/framework/cayenne-di-unpublished/target/site/apidocs/org/apache/cayenne/di//Module.html...>
Generating <https://builds.apache.org/job/Cayenne-doc/ws/trunk/framework/cayenne-di-unpublished/target/site/apidocs/org/apache/cayenne/di//Provider.html...>
Generating <https://builds.apache.org/job/Cayenne-doc/ws/trunk/framework/cayenne-di-unpublished/target/site/apidocs/org/apache/cayenne/di//Scope.html...>
Generating <https://builds.apache.org/job/Cayenne-doc/ws/trunk/framework/cayenne-di-unpublished/target/site/apidocs/org/apache/cayenne/di/spi//DefaultAdhocObjectFactory.html...>
Generating <https://builds.apache.org/job/Cayenne-doc/ws/trunk/framework/cayenne-di-unpublished/target/site/apidocs/org/apache/cayenne/di/spi//DefaultInjector.html...>
Generating <https://builds.apache.org/job/Cayenne-doc/ws/trunk/framework/cayenne-di-unpublished/target/site/apidocs/org/apache/cayenne/di/spi//DefaultScope.html...>
Generating <https://builds.apache.org/job/Cayenne-doc/ws/trunk/framework/cayenne-di-unpublished/target/site/apidocs/org/apache/cayenne/di/spi//DefaultScopeProvider.html...>
Generating <https://builds.apache.org/job/Cayenne-doc/ws/trunk/framework/cayenne-di-unpublished/target/site/apidocs/org/apache/cayenne/di/spi//ScopeEventBinding.html...>
Generating <https://builds.apache.org/job/Cayenne-doc/ws/trunk/framework/cayenne-di-unpublished/target/site/apidocs/overview-frame.html...>
Generating <https://builds.apache.org/job/Cayenne-doc/ws/trunk/framework/cayenne-di-unpublished/target/site/apidocs/org/apache/cayenne//package-frame.html...>
Generating <https://builds.apache.org/job/Cayenne-doc/ws/trunk/framework/cayenne-di-unpublished/target/site/apidocs/org/apache/cayenne//package-summary.html...>
Generating <https://builds.apache.org/job/Cayenne-doc/ws/trunk/framework/cayenne-di-unpublished/target/site/apidocs/org/apache/cayenne//package-tree.html...>
Generating <https://builds.apache.org/job/Cayenne-doc/ws/trunk/framework/cayenne-di-unpublished/target/site/apidocs/org/apache/cayenne/di//package-frame.html...>
Generating <https://builds.apache.org/job/Cayenne-doc/ws/trunk/framework/cayenne-di-unpublished/target/site/apidocs/org/apache/cayenne/di//package-summary.html...>
Generating <https://builds.apache.org/job/Cayenne-doc/ws/trunk/framework/cayenne-di-unpublished/target/site/apidocs/org/apache/cayenne/di//package-tree.html...>
Generating <https://builds.apache.org/job/Cayenne-doc/ws/trunk/framework/cayenne-di-unpublished/target/site/apidocs/org/apache/cayenne/di/spi//package-frame.html...>
Generating <https://builds.apache.org/job/Cayenne-doc/ws/trunk/framework/cayenne-di-unpublished/target/site/apidocs/org/apache/cayenne/di/spi//package-summary.html...>
Generating <https://builds.apache.org/job/Cayenne-doc/ws/trunk/framework/cayenne-di-unpublished/target/site/apidocs/org/apache/cayenne/di/spi//package-tree.html...>
Generating <https://builds.apache.org/job/Cayenne-doc/ws/trunk/framework/cayenne-di-unpublished/target/site/apidocs/org/apache/cayenne/util//package-frame.html...>
Generating <https://builds.apache.org/job/Cayenne-doc/ws/trunk/framework/cayenne-di-unpublished/target/site/apidocs/org/apache/cayenne/util//package-summary.html...>
Generating <https://builds.apache.org/job/Cayenne-doc/ws/trunk/framework/cayenne-di-unpublished/target/site/apidocs/org/apache/cayenne/util//package-tree.html...>
Generating <https://builds.apache.org/job/Cayenne-doc/ws/trunk/framework/cayenne-di-unpublished/target/site/apidocs/constant-values.html...>
Generating <https://builds.apache.org/job/Cayenne-doc/ws/trunk/framework/cayenne-di-unpublished/target/site/apidocs/serialized-form.html...>
Generating <https://builds.apache.org/job/Cayenne-doc/ws/trunk/framework/cayenne-di-unpublished/target/site/apidocs/org/apache/cayenne//class-use/CayenneRuntimeException.html...>
Generating <https://builds.apache.org/job/Cayenne-doc/ws/trunk/framework/cayenne-di-unpublished/target/site/apidocs/org/apache/cayenne//class-use/CayenneException.html...>
Generating <https://builds.apache.org/job/Cayenne-doc/ws/trunk/framework/cayenne-di-unpublished/target/site/apidocs/org/apache/cayenne//class-use/ConfigurationException.html...>
Generating <https://builds.apache.org/job/Cayenne-doc/ws/trunk/framework/cayenne-di-unpublished/target/site/apidocs/org/apache/cayenne/util//class-use/LocalizedStringsHandler.html...>
Generating <https://builds.apache.org/job/Cayenne-doc/ws/trunk/framework/cayenne-di-unpublished/target/site/apidocs/org/apache/cayenne/di//class-use/Module.html...>
Generating <https://builds.apache.org/job/Cayenne-doc/ws/trunk/framework/cayenne-di-unpublished/target/site/apidocs/org/apache/cayenne/di//class-use/AdhocObjectFactory.html...>
Generating <https://builds.apache.org/job/Cayenne-doc/ws/trunk/framework/cayenne-di-unpublished/target/site/apidocs/org/apache/cayenne/di//class-use/MapBuilder.html...>
Generating <https://builds.apache.org/job/Cayenne-doc/ws/trunk/framework/cayenne-di-unpublished/target/site/apidocs/org/apache/cayenne/di//class-use/Provider.html...>
Generating <https://builds.apache.org/job/Cayenne-doc/ws/trunk/framework/cayenne-di-unpublished/target/site/apidocs/org/apache/cayenne/di//class-use/Key.html...>
Generating <https://builds.apache.org/job/Cayenne-doc/ws/trunk/framework/cayenne-di-unpublished/target/site/apidocs/org/apache/cayenne/di//class-use/Scope.html...>
Generating <https://builds.apache.org/job/Cayenne-doc/ws/trunk/framework/cayenne-di-unpublished/target/site/apidocs/org/apache/cayenne/di//class-use/BeforeScopeEnd.html...>
Generating <https://builds.apache.org/job/Cayenne-doc/ws/trunk/framework/cayenne-di-unpublished/target/site/apidocs/org/apache/cayenne/di//class-use/Inject.html...>
Generating <https://builds.apache.org/job/Cayenne-doc/ws/trunk/framework/cayenne-di-unpublished/target/site/apidocs/org/apache/cayenne/di//class-use/Injector.html...>
Generating <https://builds.apache.org/job/Cayenne-doc/ws/trunk/framework/cayenne-di-unpublished/target/site/apidocs/org/apache/cayenne/di//class-use/ListBuilder.html...>
Generating <https://builds.apache.org/job/Cayenne-doc/ws/trunk/framework/cayenne-di-unpublished/target/site/apidocs/org/apache/cayenne/di//class-use/Binder.html...>
Generating <https://builds.apache.org/job/Cayenne-doc/ws/trunk/framework/cayenne-di-unpublished/target/site/apidocs/org/apache/cayenne/di//class-use/BindingBuilder.html...>
Generating <https://builds.apache.org/job/Cayenne-doc/ws/trunk/framework/cayenne-di-unpublished/target/site/apidocs/org/apache/cayenne/di//class-use/DIBootstrap.html...>
Generating <https://builds.apache.org/job/Cayenne-doc/ws/trunk/framework/cayenne-di-unpublished/target/site/apidocs/org/apache/cayenne/di/spi//class-use/DefaultInjector.html...>
Generating <https://builds.apache.org/job/Cayenne-doc/ws/trunk/framework/cayenne-di-unpublished/target/site/apidocs/org/apache/cayenne/di/spi//class-use/DefaultScope.html...>
Generating <https://builds.apache.org/job/Cayenne-doc/ws/trunk/framework/cayenne-di-unpublished/target/site/apidocs/org/apache/cayenne/di/spi//class-use/ScopeEventBinding.html...>
Generating <https://builds.apache.org/job/Cayenne-doc/ws/trunk/framework/cayenne-di-unpublished/target/site/apidocs/org/apache/cayenne/di/spi//class-use/DefaultAdhocObjectFactory.html...>
Generating <https://builds.apache.org/job/Cayenne-doc/ws/trunk/framework/cayenne-di-unpublished/target/site/apidocs/org/apache/cayenne/di/spi//class-use/DefaultScopeProvider.html...>
Generating <https://builds.apache.org/job/Cayenne-doc/ws/trunk/framework/cayenne-di-unpublished/target/site/apidocs/org/apache/cayenne//package-use.html...>
Generating <https://builds.apache.org/job/Cayenne-doc/ws/trunk/framework/cayenne-di-unpublished/target/site/apidocs/org/apache/cayenne/di//package-use.html...>
Generating <https://builds.apache.org/job/Cayenne-doc/ws/trunk/framework/cayenne-di-unpublished/target/site/apidocs/org/apache/cayenne/di/spi//package-use.html...>
Generating <https://builds.apache.org/job/Cayenne-doc/ws/trunk/framework/cayenne-di-unpublished/target/site/apidocs/org/apache/cayenne/util//package-use.html...>
Building index for all the packages and classes...
Generating <https://builds.apache.org/job/Cayenne-doc/ws/trunk/framework/cayenne-di-unpublished/target/site/apidocs/overview-tree.html...>
Generating <https://builds.apache.org/job/Cayenne-doc/ws/trunk/framework/cayenne-di-unpublished/target/site/apidocs/index-all.html...>
Generating <https://builds.apache.org/job/Cayenne-doc/ws/trunk/framework/cayenne-di-unpublished/target/site/apidocs/deprecated-list.html...>
Building index for all classes...
Generating <https://builds.apache.org/job/Cayenne-doc/ws/trunk/framework/cayenne-di-unpublished/target/site/apidocs/allclasses-frame.html...>
Generating <https://builds.apache.org/job/Cayenne-doc/ws/trunk/framework/cayenne-di-unpublished/target/site/apidocs/allclasses-noframe.html...>
Generating <https://builds.apache.org/job/Cayenne-doc/ws/trunk/framework/cayenne-di-unpublished/target/site/apidocs/index.html...>
Generating <https://builds.apache.org/job/Cayenne-doc/ws/trunk/framework/cayenne-di-unpublished/target/site/apidocs/overview-summary.html...>
Generating <https://builds.apache.org/job/Cayenne-doc/ws/trunk/framework/cayenne-di-unpublished/target/site/apidocs/help-doc.html...>
Generating <https://builds.apache.org/job/Cayenne-doc/ws/trunk/framework/cayenne-di-unpublished/target/site/apidocs/stylesheet.css...>
1 warning
[WARNING] Javadoc Warnings
[WARNING] <https://builds.apache.org/job/Cayenne-doc/ws/trunk/framework/cayenne-di-unpublished/src/main/java/org/apache/cayenne/CayenneException.java>:59:
warning - @param argument "message" is not a parameter name.
[INFO] ------------------------------------------------------------------------
[INFO] Building Cayenne Java 1.5 Unpublished
[INFO]    task-segment: [clean, install, javadoc:javadoc]
[INFO] ------------------------------------------------------------------------
[INFO] [clean:clean {execution: default-clean}]
[INFO] [cayenne-build:date {execution: date}]
[INFO] [javacc:jjtree-javacc {execution: jjtree-ejbql}]
[WARNING] File encoding for grammars has not been configured, using platform default encoding,
i.e. build is platform dependent!
Java Compiler Compiler Version 5.0 (Tree Builder)
(type "jjtree" with no arguments for help)
Reading from file <https://builds.apache.org/job/Cayenne-doc/ws/trunk/framework/cayenne-jdk1.5-unpublished/src/main/jjtree/org/apache/cayenne/ejbql/EJBQLParser.jjt>
. . .
File "Node.java" does not exist.  Will create one.
File "EJBQLTreeConstants.java" does not exist.  Will create one.
File "JJTEJBQLState.java" does not exist.  Will create one.
Annotated grammar generated successfully in <https://builds.apache.org/job/Cayenne-doc/ws/trunk/framework/cayenne-jdk1.5-unpublished/target/javacc-1316046448071/node/EJBQLParser.jj>
Java Compiler Compiler Version 5.0 (Parser Generator)
(type "javacc" with no arguments for help)
Reading from file <https://builds.apache.org/job/Cayenne-doc/ws/trunk/framework/cayenne-jdk1.5-unpublished/target/javacc-1316046448071/node/EJBQLParser.jj>
. . .
Warning: Choice conflict in (...)* construct at line 840, column 17.
         Expansion nested within construct and expansion following construct
         have common prefixes, one of which is: "+"
         Consider using a lookahead of 2 or more for nested expansion.
Warning: Choice conflict in (...)* construct at line 849, column 17.
         Expansion nested within construct and expansion following construct
         have common prefixes, one of which is: "*"
         Consider using a lookahead of 2 or more for nested expansion.
File "TokenMgrError.java" does not exist.  Will create one.
File "ParseException.java" does not exist.  Will create one.
File "Token.java" does not exist.  Will create one.
File "JavaCharStream.java" does not exist.  Will create one.
Parser generated with 0 errors and 2 warnings.
[INFO] Processed 1 grammar
[INFO] [antrun:run {execution: default}]
[INFO] Executing tasks
[INFO] Executed tasks
[INFO] [resources:resources {execution: default-resources}]
[INFO] Using 'UTF-8' encoding to copy filtered resources.
[INFO] Copying 17 resources
[INFO] [compiler:compile {execution: default-compile}]
[WARNING] File encoding has not been set, using platform encoding ANSI_X3.4-1968, i.e. build
is platform dependent!
[INFO] Compiling 922 source files to <https://builds.apache.org/job/Cayenne-doc/ws/trunk/framework/cayenne-jdk1.5-unpublished/target/classes>
[INFO] [resources:testResources {execution: default-testResources}]
[INFO] Using 'UTF-8' encoding to copy filtered resources.
[INFO] Copying 96 resources
[INFO] [compiler:testCompile {execution: default-testCompile}]
[WARNING] File encoding has not been set, using platform encoding ANSI_X3.4-1968, i.e. build
is platform dependent!
[INFO] Compiling 923 source files to <https://builds.apache.org/job/Cayenne-doc/ws/trunk/framework/cayenne-jdk1.5-unpublished/target/test-classes>
[INFO] -------------------------------------------------------------
[ERROR] COMPILATION ERROR : 
[INFO] -------------------------------------------------------------
[ERROR] <https://builds.apache.org/job/Cayenne-doc/ws/trunk/framework/cayenne-jdk1.5-unpublished/src/test/java/org/apache/cayenne/access/trans/UpdateBatchQueryBuilderTest.java>:[73,42]
cannot find symbol
symbol  : constructor UpdateBatchQueryBuilder(java.lang.Object)
location: class org.apache.cayenne.access.trans.UpdateBatchQueryBuilder
[ERROR] <https://builds.apache.org/job/Cayenne-doc/ws/trunk/framework/cayenne-jdk1.5-unpublished/src/test/java/org/apache/cayenne/access/trans/UpdateBatchQueryBuilderTest.java>:[100,42]
cannot find symbol
symbol  : constructor UpdateBatchQueryBuilder(java.lang.Object)
location: class org.apache.cayenne.access.trans.UpdateBatchQueryBuilder
[ERROR] <https://builds.apache.org/job/Cayenne-doc/ws/trunk/framework/cayenne-jdk1.5-unpublished/src/test/java/org/apache/cayenne/dba/oracle/OraclePkGeneratorTest.java>:[43,22]
cannot find symbol
symbol  : constructor OraclePkGenerator(java.lang.Object)
location: class org.apache.cayenne.dba.oracle.OraclePkGenerator
[ERROR] <https://builds.apache.org/job/Cayenne-doc/ws/trunk/framework/cayenne-jdk1.5-unpublished/src/test/java/org/apache/cayenne/access/trans/DeleteBatchQueryBuilderTest.java>:[69,42]
cannot find symbol
symbol  : constructor DeleteBatchQueryBuilder(java.lang.Object)
location: class org.apache.cayenne.access.trans.DeleteBatchQueryBuilder
[ERROR] <https://builds.apache.org/job/Cayenne-doc/ws/trunk/framework/cayenne-jdk1.5-unpublished/src/test/java/org/apache/cayenne/access/trans/DeleteBatchQueryBuilderTest.java>:[93,42]
cannot find symbol
symbol  : constructor DeleteBatchQueryBuilder(java.lang.Object)
location: class org.apache.cayenne.access.trans.DeleteBatchQueryBuilder
[ERROR] <https://builds.apache.org/job/Cayenne-doc/ws/trunk/framework/cayenne-jdk1.5-unpublished/src/test/java/org/apache/cayenne/access/jdbc/SoftDeleteBatchQueryBuilderTest.java>:[57,15]
cannot find symbol
symbol  : method createBuilder(java.lang.Object)
location: class org.apache.cayenne.access.jdbc.SoftDeleteBatchQueryBuilderTest
[ERROR] <https://builds.apache.org/job/Cayenne-doc/ws/trunk/framework/cayenne-jdk1.5-unpublished/src/test/java/org/apache/cayenne/access/trans/InsertBatchQueryBuilderTest.java>:[59,42]
cannot find symbol
symbol  : constructor InsertBatchQueryBuilder(java.lang.Object)
location: class org.apache.cayenne.access.trans.InsertBatchQueryBuilder
[INFO] 7 errors 
[INFO] -------------------------------------------------------------
[INFO] ------------------------------------------------------------------------
[ERROR] BUILD FAILURE
[INFO] ------------------------------------------------------------------------
[INFO] Compilation failure

<https://builds.apache.org/job/Cayenne-doc/ws/trunk/framework/cayenne-jdk1.5-unpublished/src/test/java/org/apache/cayenne/access/trans/UpdateBatchQueryBuilderTest.java>:[73,42]
cannot find symbol
symbol  : constructor UpdateBatchQueryBuilder(java.lang.Object)
location: class org.apache.cayenne.access.trans.UpdateBatchQueryBuilder
<https://builds.apache.org/job/Cayenne-doc/ws/trunk/framework/cayenne-jdk1.5-unpublished/src/test/java/org/apache/cayenne/access/trans/UpdateBatchQueryBuilderTest.java>:[100,42]
cannot find symbol
symbol  : constructor UpdateBatchQueryBuilder(java.lang.Object)
location: class org.apache.cayenne.access.trans.UpdateBatchQueryBuilder
<https://builds.apache.org/job/Cayenne-doc/ws/trunk/framework/cayenne-jdk1.5-unpublished/src/test/java/org/apache/cayenne/dba/oracle/OraclePkGeneratorTest.java>:[43,22]
cannot find symbol
symbol  : constructor OraclePkGenerator(java.lang.Object)
location: class org.apache.cayenne.dba.oracle.OraclePkGenerator
<https://builds.apache.org/job/Cayenne-doc/ws/trunk/framework/cayenne-jdk1.5-unpublished/src/test/java/org/apache/cayenne/access/trans/DeleteBatchQueryBuilderTest.java>:[69,42]
cannot find symbol
symbol  : constructor DeleteBatchQueryBuilder(java.lang.Object)
location: class org.apache.cayenne.access.trans.DeleteBatchQueryBuilder
<https://builds.apache.org/job/Cayenne-doc/ws/trunk/framework/cayenne-jdk1.5-unpublished/src/test/java/org/apache/cayenne/access/trans/DeleteBatchQueryBuilderTest.java>:[93,42]
cannot find symbol
symbol  : constructor DeleteBatchQueryBuilder(java.lang.Object)
location: class org.apache.cayenne.access.trans.DeleteBatchQueryBuilder
<https://builds.apache.org/job/Cayenne-doc/ws/trunk/framework/cayenne-jdk1.5-unpublished/src/test/java/org/apache/cayenne/access/jdbc/SoftDeleteBatchQueryBuilderTest.java>:[57,15]
cannot find symbol
symbol  : method createBuilder(java.lang.Object)
location: class org.apache.cayenne.access.jdbc.SoftDeleteBatchQueryBuilderTest
<https://builds.apache.org/job/Cayenne-doc/ws/trunk/framework/cayenne-jdk1.5-unpublished/src/test/java/org/apache/cayenne/access/trans/InsertBatchQueryBuilderTest.java>:[59,42]
cannot find symbol
symbol  : constructor InsertBatchQueryBuilder(java.lang.Object)
location: class org.apache.cayenne.access.trans.InsertBatchQueryBuilder

[INFO] ------------------------------------------------------------------------
[INFO] For more information, run Maven with the -e switch
[INFO] ------------------------------------------------------------------------
[INFO] Total time: 39 seconds
[INFO] Finished at: Thu Sep 15 00:27:41 UTC 2011
[INFO] Final Memory: 81M/404M
[INFO] ------------------------------------------------------------------------
Build step 'Invoke top-level Maven targets' marked build as failure
Publishing Javadoc


Mime
View raw message