cayenne-commits mailing list archives

Site index · List index
Message view « Date » · « Thread »
Top « Date » · « Thread »
From Apache Jenkins Server <jenk...@builds.apache.org>
Subject Build failed in Jenkins: Cayenne-trunk » HSQLDB,false,JDK 1.5 (latest),Ubuntu #627
Date Mon, 12 Dec 2011 15:26:00 GMT
See <https://builds.apache.org/job/Cayenne-trunk/./cayenneTestConnection=HSQLDB,collationCi=false,jdk=JDK%201.5%20(latest),label=Ubuntu/627/changes>

Changes:

[oltka] CAY-1625 Transient objects do not work in ROP apps patch by John Huss, with some rework
by aadamchik

------------------------------------------
Started by upstream project "Cayenne-trunk" build number 627
Building remotely on ubuntu3
Cleaning up <https://builds.apache.org/job/Cayenne-trunk/./cayenneTestConnection=HSQLDB,collationCi=false,jdk=JDK%201.5%20(latest),label=Ubuntu/ws/trunk>
Deleting <https://builds.apache.org/job/Cayenne-trunk/./cayenneTestConnection=HSQLDB,collationCi=false,jdk=JDK%201.5%20(latest),label=Ubuntu/ws/trunk/tutorials/tutorial-rop-client/target>
Deleting <https://builds.apache.org/job/Cayenne-trunk/./cayenneTestConnection=HSQLDB,collationCi=false,jdk=JDK%201.5%20(latest),label=Ubuntu/ws/trunk/tutorials/tutorial-rop-server/target>
Deleting <https://builds.apache.org/job/Cayenne-trunk/./cayenneTestConnection=HSQLDB,collationCi=false,jdk=JDK%201.5%20(latest),label=Ubuntu/ws/trunk/tutorials/tutorial/target>
Deleting <https://builds.apache.org/job/Cayenne-trunk/./cayenneTestConnection=HSQLDB,collationCi=false,jdk=JDK%201.5%20(latest),label=Ubuntu/ws/trunk/modeler/cayenne-modeler/target>
Deleting <https://builds.apache.org/job/Cayenne-trunk/./cayenneTestConnection=HSQLDB,collationCi=false,jdk=JDK%201.5%20(latest),label=Ubuntu/ws/trunk/modeler/maven-cayenne-modeler-plugin/target>
Deleting <https://builds.apache.org/job/Cayenne-trunk/./cayenneTestConnection=HSQLDB,collationCi=false,jdk=JDK%201.5%20(latest),label=Ubuntu/ws/trunk/itests/cayenne-runtime-itest/target>
Deleting <https://builds.apache.org/job/Cayenne-trunk/./cayenneTestConnection=HSQLDB,collationCi=false,jdk=JDK%201.5%20(latest),label=Ubuntu/ws/trunk/itests/cayenne-tools-itest/target>
Deleting <https://builds.apache.org/job/Cayenne-trunk/./cayenneTestConnection=HSQLDB,collationCi=false,jdk=JDK%201.5%20(latest),label=Ubuntu/ws/trunk/docs/docbook/target>
Deleting <https://builds.apache.org/job/Cayenne-trunk/./cayenneTestConnection=HSQLDB,collationCi=false,jdk=JDK%201.5%20(latest),label=Ubuntu/ws/trunk/docs/docbook/getting-started/target>
Deleting <https://builds.apache.org/job/Cayenne-trunk/./cayenneTestConnection=HSQLDB,collationCi=false,jdk=JDK%201.5%20(latest),label=Ubuntu/ws/trunk/docs/docbook/cayenne-guide/target>
Deleting <https://builds.apache.org/job/Cayenne-trunk/./cayenneTestConnection=HSQLDB,collationCi=false,jdk=JDK%201.5%20(latest),label=Ubuntu/ws/trunk/docs/docbook/upgrade-guide/target>
Deleting <https://builds.apache.org/job/Cayenne-trunk/./cayenneTestConnection=HSQLDB,collationCi=false,jdk=JDK%201.5%20(latest),label=Ubuntu/ws/trunk/docs/docbook/getting-started-rop/target>
Deleting <https://builds.apache.org/job/Cayenne-trunk/./cayenneTestConnection=HSQLDB,collationCi=false,jdk=JDK%201.5%20(latest),label=Ubuntu/ws/trunk/docs/doc/target>
Deleting <https://builds.apache.org/job/Cayenne-trunk/./cayenneTestConnection=HSQLDB,collationCi=false,jdk=JDK%201.5%20(latest),label=Ubuntu/ws/trunk/build-tools/cayenne-test-utilities/target>
Deleting <https://builds.apache.org/job/Cayenne-trunk/./cayenneTestConnection=HSQLDB,collationCi=false,jdk=JDK%201.5%20(latest),label=Ubuntu/ws/trunk/build-tools/maven-cayenne-build-plugin/target>
Deleting <https://builds.apache.org/job/Cayenne-trunk/./cayenneTestConnection=HSQLDB,collationCi=false,jdk=JDK%201.5%20(latest),label=Ubuntu/ws/trunk/build-tools/maven-cayenne-doc-plugin/target>
Deleting <https://builds.apache.org/job/Cayenne-trunk/./cayenneTestConnection=HSQLDB,collationCi=false,jdk=JDK%201.5%20(latest),label=Ubuntu/ws/trunk/framework/cayenne-jdk1.5-unpublished/target>
Deleting <https://builds.apache.org/job/Cayenne-trunk/./cayenneTestConnection=HSQLDB,collationCi=false,jdk=JDK%201.5%20(latest),label=Ubuntu/ws/trunk/framework/cayenne-wocompat-unpublished/target>
Deleting <https://builds.apache.org/job/Cayenne-trunk/./cayenneTestConnection=HSQLDB,collationCi=false,jdk=JDK%201.5%20(latest),label=Ubuntu/ws/trunk/framework/cayenne-server/target>
Deleting <https://builds.apache.org/job/Cayenne-trunk/./cayenneTestConnection=HSQLDB,collationCi=false,jdk=JDK%201.5%20(latest),label=Ubuntu/ws/trunk/framework/cayenne-project/target>
Deleting <https://builds.apache.org/job/Cayenne-trunk/./cayenneTestConnection=HSQLDB,collationCi=false,jdk=JDK%201.5%20(latest),label=Ubuntu/ws/trunk/framework/maven-cayenne-plugin/target>
Deleting <https://builds.apache.org/job/Cayenne-trunk/./cayenneTestConnection=HSQLDB,collationCi=false,jdk=JDK%201.5%20(latest),label=Ubuntu/ws/trunk/framework/cayenne-lifecycle/target>
Deleting <https://builds.apache.org/job/Cayenne-trunk/./cayenneTestConnection=HSQLDB,collationCi=false,jdk=JDK%201.5%20(latest),label=Ubuntu/ws/trunk/framework/cayenne-tools/target>
Deleting <https://builds.apache.org/job/Cayenne-trunk/./cayenneTestConnection=HSQLDB,collationCi=false,jdk=JDK%201.5%20(latest),label=Ubuntu/ws/trunk/framework/cayenne-client/target>
Deleting <https://builds.apache.org/job/Cayenne-trunk/./cayenneTestConnection=HSQLDB,collationCi=false,jdk=JDK%201.5%20(latest),label=Ubuntu/ws/trunk/framework/cayenne-di-unpublished/target>
Deleting <https://builds.apache.org/job/Cayenne-trunk/./cayenneTestConnection=HSQLDB,collationCi=false,jdk=JDK%201.5%20(latest),label=Ubuntu/ws/trunk/framework/cayenne-legal-unpublished/target>
Updating http://svn.apache.org/repos/asf/cayenne/main/trunk
U         framework/cayenne-tools/src/main/resources/templates/v1_2/client-superclass.vm
At revision 1213272
[trunk] $ /home/hudson/tools/maven/latest3/bin/mvn -Dlabel=Ubuntu "-Djdk=JDK 1.5 (latest)"
-DcollationCi=false -DcayenneTestConnection=HSQLDB -e clean install
[INFO] Error stacktraces are turned on.
[INFO] Scanning for projects...
[INFO] ------------------------------------------------------------------------
[INFO] Reactor Build Order:
[INFO] 
[INFO] Cayenne
[INFO] Common Unit Test Utilities
[INFO] Cayenne Internal Build Plugin
[INFO] Cayenne Internal Documentation Build Plugin
[INFO] Cayenne Build Tools Parent
[INFO] Cayenne License and Notice Bundle
[INFO] Cayenne Dependency Injection Container
[INFO] Cayenne Java 1.5 Unpublished
[INFO] Cayenne WebObjects Compatibility Library
[INFO] Cayenne Aggregated Server Jar
[INFO] Cayenne Aggregated Client Jar
[INFO] Cayenne Project
[INFO] Cayenne Tools
[INFO] Library: cayenne-lifecycle
[INFO] Cayenne Maven Plugin
[INFO] Cayenne Framework Aggregator Project
[INFO] Cayenne Integration Tests Parent
[INFO] Integration Tests - Cayenne Runtime
[INFO] Integration Tests - Cayenne Tools
[INFO] Cayenne Modeler
[INFO] Cayenne Modeler Maven Plugin
[INFO] Cayenne Modeler Parent
[INFO] Cayenne Tutorial
[INFO] Cayenne ROP Server Tutorial
[INFO] Cayenne ROP Client Tutorial
[INFO] Cayenne Tutorials
[INFO] Cayenne Documentation
[INFO] Cayenne Documenation Parent
[INFO] Cayenne Docbook Documenation
[INFO] Docbook: Cayenne Guide
[INFO] Docbook: Getting Started with Cayenne
[INFO] Docbook: Getting Started with Cayenne ROP
[INFO] Docbook: Cayenne New Features and Upgrade Guide
[INFO]                                                                         
[INFO] ------------------------------------------------------------------------
[INFO] Building Cayenne 3.1M4-SNAPSHOT
[INFO] ------------------------------------------------------------------------
[INFO] 
[INFO] --- maven-clean-plugin:2.4.1:clean (default-clean) @ cayenne-parent ---
[INFO] 
[INFO] --- maven-install-plugin:2.3.1:install (default-install) @ cayenne-parent ---
[INFO] Installing /x1/jenkins/jenkins-slave/workspace/Cayenne-trunk/cayenneTestConnection/HSQLDB/collationCi/false/jdk/JDK
1.5 (latest)/label/Ubuntu/trunk/pom.xml to /home/jenkins/.m2/repository/org/apache/cayenne/cayenne-parent/3.1M4-SNAPSHOT/cayenne-parent-3.1M4-SNAPSHOT.pom
[INFO]                                                                         
[INFO] ------------------------------------------------------------------------
[INFO] Building Common Unit Test Utilities 3.1M4-SNAPSHOT
[INFO] ------------------------------------------------------------------------
[INFO] 
[INFO] --- maven-clean-plugin:2.4.1:clean (default-clean) @ cayenne-test-utilities ---
[INFO] 
[INFO] --- maven-resources-plugin:2.4.3:resources (default-resources) @ cayenne-test-utilities
---
[INFO] Using 'UTF-8' encoding to copy filtered resources.
[INFO] skip non existing resourceDirectory /x1/jenkins/jenkins-slave/workspace/Cayenne-trunk/cayenneTestConnection/HSQLDB/collationCi/false/jdk/JDK
1.5 (latest)/label/Ubuntu/trunk/build-tools/cayenne-test-utilities/src/main/resources
[INFO] 
[INFO] --- maven-compiler-plugin:2.3.2:compile (default-compile) @ cayenne-test-utilities
---
[WARNING] File encoding has not been set, using platform encoding ANSI_X3.4-1968, i.e. build
is platform dependent!
[INFO] Compiling 13 source files to /x1/jenkins/jenkins-slave/workspace/Cayenne-trunk/cayenneTestConnection/HSQLDB/collationCi/false/jdk/JDK
1.5 (latest)/label/Ubuntu/trunk/build-tools/cayenne-test-utilities/target/classes
[INFO] 
[INFO] --- maven-resources-plugin:2.4.3:testResources (default-testResources) @ cayenne-test-utilities
---
[INFO] Using 'UTF-8' encoding to copy filtered resources.
[INFO] skip non existing resourceDirectory /x1/jenkins/jenkins-slave/workspace/Cayenne-trunk/cayenneTestConnection/HSQLDB/collationCi/false/jdk/JDK
1.5 (latest)/label/Ubuntu/trunk/build-tools/cayenne-test-utilities/src/test/resources
[INFO] 
[INFO] --- maven-compiler-plugin:2.3.2:testCompile (default-testCompile) @ cayenne-test-utilities
---
[INFO] No sources to compile
[INFO] 
[INFO] --- maven-surefire-plugin:2.5:test (default-test) @ cayenne-test-utilities ---
[INFO] No tests to run.
[INFO] 
[INFO] --- maven-jar-plugin:2.3.1:jar (default-jar) @ cayenne-test-utilities ---
[INFO] Building jar: /x1/jenkins/jenkins-slave/workspace/Cayenne-trunk/cayenneTestConnection/HSQLDB/collationCi/false/jdk/JDK
1.5 (latest)/label/Ubuntu/trunk/build-tools/cayenne-test-utilities/target/cayenne-test-utilities-3.1M4-SNAPSHOT.jar
[INFO] 
[INFO] --- maven-install-plugin:2.3.1:install (default-install) @ cayenne-test-utilities ---
[INFO] Installing /x1/jenkins/jenkins-slave/workspace/Cayenne-trunk/cayenneTestConnection/HSQLDB/collationCi/false/jdk/JDK
1.5 (latest)/label/Ubuntu/trunk/build-tools/cayenne-test-utilities/target/cayenne-test-utilities-3.1M4-SNAPSHOT.jar
to /home/jenkins/.m2/repository/org/apache/cayenne/build-tools/cayenne-test-utilities/3.1M4-SNAPSHOT/cayenne-test-utilities-3.1M4-SNAPSHOT.jar
[INFO] Installing /x1/jenkins/jenkins-slave/workspace/Cayenne-trunk/cayenneTestConnection/HSQLDB/collationCi/false/jdk/JDK
1.5 (latest)/label/Ubuntu/trunk/build-tools/cayenne-test-utilities/pom.xml to /home/jenkins/.m2/repository/org/apache/cayenne/build-tools/cayenne-test-utilities/3.1M4-SNAPSHOT/cayenne-test-utilities-3.1M4-SNAPSHOT.pom
[INFO] ------------------------------------------------------------------------
[INFO] Reactor Summary:
[INFO] 
[INFO] Cayenne ........................................... SUCCESS [0.306s]
[INFO] Common Unit Test Utilities ........................ FAILURE [1.315s]
[INFO] Cayenne Internal Build Plugin ..................... SKIPPED
[INFO] Cayenne Internal Documentation Build Plugin ....... SKIPPED
[INFO] Cayenne Build Tools Parent ........................ SKIPPED
[INFO] Cayenne License and Notice Bundle ................. SKIPPED
[INFO] Cayenne Dependency Injection Container ............ SKIPPED
[INFO] Cayenne Java 1.5 Unpublished ...................... SKIPPED
[INFO] Cayenne WebObjects Compatibility Library .......... SKIPPED
[INFO] Cayenne Aggregated Server Jar ..................... SKIPPED
[INFO] Cayenne Aggregated Client Jar ..................... SKIPPED
[INFO] Cayenne Project ................................... SKIPPED
[INFO] Cayenne Tools ..................................... SKIPPED
[INFO] Library: cayenne-lifecycle ........................ SKIPPED
[INFO] Cayenne Maven Plugin .............................. SKIPPED
[INFO] Cayenne Framework Aggregator Project .............. SKIPPED
[INFO] Cayenne Integration Tests Parent .................. SKIPPED
[INFO] Integration Tests - Cayenne Runtime ............... SKIPPED
[INFO] Integration Tests - Cayenne Tools ................. SKIPPED
[INFO] Cayenne Modeler ................................... SKIPPED
[INFO] Cayenne Modeler Maven Plugin ...................... SKIPPED
[INFO] Cayenne Modeler Parent ............................ SKIPPED
[INFO] Cayenne Tutorial .................................. SKIPPED
[INFO] Cayenne ROP Server Tutorial ....................... SKIPPED
[INFO] Cayenne ROP Client Tutorial ....................... SKIPPED
[INFO] Cayenne Tutorials ................................. SKIPPED
[INFO] Cayenne Documentation ............................. SKIPPED
[INFO] Cayenne Documenation Parent ....................... SKIPPED
[INFO] Cayenne Docbook Documenation ...................... SKIPPED
[INFO] Docbook: Cayenne Guide ............................ SKIPPED
[INFO] Docbook: Getting Started with Cayenne ............. SKIPPED
[INFO] Docbook: Getting Started with Cayenne ROP ......... SKIPPED
[INFO] Docbook: Cayenne New Features and Upgrade Guide ... SKIPPED
[INFO] ------------------------------------------------------------------------
[INFO] BUILD FAILURE
[INFO] ------------------------------------------------------------------------
[INFO] Total time: 2.769s
[INFO] Finished at: Mon Dec 12 15:25:59 GMT 2011
[INFO] Final Memory: 10M/407M
[INFO] ------------------------------------------------------------------------
[ERROR] Failed to execute goal org.apache.maven.plugins:maven-install-plugin:2.3.1:install
(default-install) on project cayenne-test-utilities: Failed to install metadata org.apache.cayenne.build-tools:cayenne-test-utilities:3.1M4-SNAPSHOT/maven-metadata.xml:
Could not read metadata /home/jenkins/.m2/repository/org/apache/cayenne/build-tools/cayenne-test-utilities/3.1M4-SNAPSHOT/maven-metadata-local.xml:
input contained no data -> [Help 1]
org.apache.maven.lifecycle.LifecycleExecutionException: Failed to execute goal org.apache.maven.plugins:maven-install-plugin:2.3.1:install
(default-install) on project cayenne-test-utilities: Failed to install metadata org.apache.cayenne.build-tools:cayenne-test-utilities:3.1M4-SNAPSHOT/maven-metadata.xml:
Could not read metadata /home/jenkins/.m2/repository/org/apache/cayenne/build-tools/cayenne-test-utilities/3.1M4-SNAPSHOT/maven-metadata-local.xml:
input contained no data
	at org.apache.maven.lifecycle.internal.MojoExecutor.execute(MojoExecutor.java:217)
	at org.apache.maven.lifecycle.internal.MojoExecutor.execute(MojoExecutor.java:153)
	at org.apache.maven.lifecycle.internal.MojoExecutor.execute(MojoExecutor.java:145)
	at org.apache.maven.lifecycle.internal.LifecycleModuleBuilder.buildProject(LifecycleModuleBuilder.java:84)
	at org.apache.maven.lifecycle.internal.LifecycleModuleBuilder.buildProject(LifecycleModuleBuilder.java:59)
	at org.apache.maven.lifecycle.internal.LifecycleStarter.singleThreadedBuild(LifecycleStarter.java:183)
	at org.apache.maven.lifecycle.internal.LifecycleStarter.execute(LifecycleStarter.java:161)
	at org.apache.maven.DefaultMaven.doExecute(DefaultMaven.java:319)
	at org.apache.maven.DefaultMaven.execute(DefaultMaven.java:156)
	at org.apache.maven.cli.MavenCli.execute(MavenCli.java:537)
	at org.apache.maven.cli.MavenCli.doMain(MavenCli.java:196)
	at org.apache.maven.cli.MavenCli.main(MavenCli.java:141)
	at sun.reflect.NativeMethodAccessorImpl.invoke0(Native Method)
	at sun.reflect.NativeMethodAccessorImpl.invoke(NativeMethodAccessorImpl.java:39)
	at sun.reflect.DelegatingMethodAccessorImpl.invoke(DelegatingMethodAccessorImpl.java:25)
	at java.lang.reflect.Method.invoke(Method.java:592)
	at org.codehaus.plexus.classworlds.launcher.Launcher.launchEnhanced(Launcher.java:290)
	at org.codehaus.plexus.classworlds.launcher.Launcher.launch(Launcher.java:230)
	at org.codehaus.plexus.classworlds.launcher.Launcher.mainWithExitCode(Launcher.java:409)
	at org.codehaus.plexus.classworlds.launcher.Launcher.main(Launcher.java:352)
Caused by: org.apache.maven.plugin.MojoExecutionException: Failed to install metadata org.apache.cayenne.build-tools:cayenne-test-utilities:3.1M4-SNAPSHOT/maven-metadata.xml:
Could not read metadata /home/jenkins/.m2/repository/org/apache/cayenne/build-tools/cayenne-test-utilities/3.1M4-SNAPSHOT/maven-metadata-local.xml:
input contained no data
	at org.apache.maven.plugin.install.InstallMojo.execute(InstallMojo.java:139)
	at org.apache.maven.plugin.DefaultBuildPluginManager.executeMojo(DefaultBuildPluginManager.java:101)
	at org.apache.maven.lifecycle.internal.MojoExecutor.execute(MojoExecutor.java:209)
	... 19 more
Caused by: org.apache.maven.artifact.installer.ArtifactInstallationException: Failed to install
metadata org.apache.cayenne.build-tools:cayenne-test-utilities:3.1M4-SNAPSHOT/maven-metadata.xml:
Could not read metadata /home/jenkins/.m2/repository/org/apache/cayenne/build-tools/cayenne-test-utilities/3.1M4-SNAPSHOT/maven-metadata-local.xml:
input contained no data
	at org.apache.maven.artifact.installer.DefaultArtifactInstaller.install(DefaultArtifactInstaller.java:111)
	at org.apache.maven.plugin.install.InstallMojo.execute(InstallMojo.java:103)
	... 21 more
Caused by: org.sonatype.aether.installation.InstallationException: Failed to install metadata
org.apache.cayenne.build-tools:cayenne-test-utilities:3.1M4-SNAPSHOT/maven-metadata.xml: Could
not read metadata /home/jenkins/.m2/repository/org/apache/cayenne/build-tools/cayenne-test-utilities/3.1M4-SNAPSHOT/maven-metadata-local.xml:
input contained no data
	at org.sonatype.aether.impl.internal.DefaultInstaller.install(DefaultInstaller.java:317)
	at org.sonatype.aether.impl.internal.DefaultInstaller.install(DefaultInstaller.java:215)
	at org.sonatype.aether.impl.internal.DefaultInstaller.install(DefaultInstaller.java:162)
	at org.sonatype.aether.impl.internal.DefaultRepositorySystem.install(DefaultRepositorySystem.java:473)
	at org.apache.maven.artifact.installer.DefaultArtifactInstaller.install(DefaultArtifactInstaller.java:107)
	... 22 more
Caused by: org.sonatype.aether.RepositoryException: Could not read metadata /home/jenkins/.m2/repository/org/apache/cayenne/build-tools/cayenne-test-utilities/3.1M4-SNAPSHOT/maven-metadata-local.xml:
input contained no data
	at org.apache.maven.repository.internal.MavenMetadata.read(MavenMetadata.java:101)
	at org.apache.maven.repository.internal.MavenMetadata.merge(MavenMetadata.java:69)
	at org.sonatype.aether.impl.internal.DefaultInstaller.install(DefaultInstaller.java:305)
	... 26 more
Caused by: java.io.EOFException: input contained no data
	at org.codehaus.plexus.util.xml.pull.MXParser.fillBuf(MXParser.java:3005)
	at org.codehaus.plexus.util.xml.pull.MXParser.more(MXParser.java:3048)
	at org.codehaus.plexus.util.xml.pull.MXParser.parseProlog(MXParser.java:1422)
	at org.codehaus.plexus.util.xml.pull.MXParser.nextImpl(MXParser.java:1407)
	at org.codehaus.plexus.util.xml.pull.MXParser.next(MXParser.java:1105)
	at org.apache.maven.artifact.repository.metadata.io.xpp3.MetadataXpp3Reader.read(MetadataXpp3Reader.java:1193)
	at org.apache.maven.artifact.repository.metadata.io.xpp3.MetadataXpp3Reader.read(MetadataXpp3Reader.java:1122)
	at org.apache.maven.repository.internal.MavenMetadata.read(MavenMetadata.java:97)
	... 28 more
[ERROR] 
[ERROR] Re-run Maven using the -X switch to enable full debug logging.
[ERROR] 
[ERROR] For more information about the errors and possible solutions, please read the following
articles:
[ERROR] [Help 1] http://cwiki.apache.org/confluence/display/MAVEN/MojoExecutionException
[ERROR] 
[ERROR] After correcting the problems, you can resume the build with the command
[ERROR]   mvn <goals> -rf :cayenne-test-utilities
Build step 'Invoke top-level Maven targets' marked build as failure
Archiving artifacts


Mime
View raw message