cayenne-commits mailing list archives

Site index · List index
Message view « Date » · « Thread »
Top « Date » · « Thread »
From Apache Jenkins Server <jenk...@builds.apache.org>
Subject Build failed in Jenkins: Cayenne-trunk » h2,JDK 1.7 (latest),Ubuntu #769
Date Thu, 11 Oct 2012 18:23:45 GMT
See <https://builds.apache.org/job/Cayenne-trunk/./cayenneTestConnection=h2,jdk=JDK%201.7%20(latest),label=Ubuntu/769/changes>

Changes:

[aadamchik] CAY-1747 New algorithm for tracking changes to DbEntities underlying flattened
attributes and relationships

+ apache headers

[aadamchik] CAY-1747 New algorithm for tracking changes to DbEntities underlying flattened
attributes and relationships

cleaning up DbArcId - removing redundant constructor arg

[aadamchik] iCAY-1747 New algorithm for tracking changes to DbEntities underlying flattened
attributes and relationships

using DbRelationship instead of 'name' in DbArcId

[aadamchik] CAY-1746 Two InsertBatchQueries generated for a single DbEntity insert when this
DbEntity has a flattened attribute and a flattened relationship

DbArcId implementation for tracking flattened DbEntity changes
(cherry picked from commit a52431bb10c4a49123cac8cabe9d124cd61f3c1d)

[aadamchik] CAY-1746 Two InsertBatchQueries generated for a single DbEntity insert when this
DbEntity has a flattened attribute and a flattened relationship

a test without subclass attribute ... this works

------------------------------------------
[...truncated 114957 lines...]
Oct 11, 2012 6:23:41 PM org.apache.cayenne.log.CommonsJdbcEventLogger logSelectCount
INFO: === returned 1 row. - took 1 ms.
Oct 11, 2012 6:23:41 PM org.apache.cayenne.log.CommonsJdbcEventLogger logCommitTransaction
INFO: +++ transaction committed.
Oct 11, 2012 6:23:41 PM org.apache.cayenne.test.jdbc.UtilityLogger log
INFO: update ARTIST set ARTIST_NAME = ? where ARTIST_ID = ?
Oct 11, 2012 6:23:41 PM org.apache.cayenne.log.CommonsJdbcEventLogger logBeginTransaction
INFO: --- transaction started.
Oct 11, 2012 6:23:41 PM org.apache.cayenne.log.CommonsJdbcEventLogger logQuery
INFO: SELECT t0.DATE_OF_BIRTH, t0.ARTIST_ID, t0.ARTIST_NAME FROM ARTIST t0
Oct 11, 2012 6:23:41 PM org.apache.cayenne.log.CommonsJdbcEventLogger logSelectCount
INFO: === returned 1 row. - took 0 ms.
Oct 11, 2012 6:23:41 PM org.apache.cayenne.log.CommonsJdbcEventLogger logCommitTransaction
INFO: +++ transaction committed.
Tests run: 4, Failures: 0, Errors: 0, Skipped: 0, Time elapsed: 0.046 sec
Running org.apache.cayenne.access.NestedDataContextParentPeerEventsTest
Oct 11, 2012 6:23:41 PM org.apache.cayenne.configuration.XMLDataChannelDescriptorLoader load
INFO: Loading XML configuration resource from <https://builds.apache.org/job/Cayenne-trunk/./cayenneTestConnection=h2,jdk=JDK%201.7%20(latest),label=Ubuntu/ws/trunk/framework/cayenne-jdk1.5-unpublished/target/test-classes/cayenne-relationships.xml>
Oct 11, 2012 6:23:41 PM org.apache.cayenne.configuration.XMLDataChannelDescriptorLoader$DataChannelChildrenHandler
createChildTagHandler
INFO: Loading XML DataMap resource from <https://builds.apache.org/job/Cayenne-trunk/./cayenneTestConnection=h2,jdk=JDK%201.7%20(latest),label=Ubuntu/ws/trunk/framework/cayenne-jdk1.5-unpublished/target/test-classes/relationships.map.xml>
Oct 11, 2012 6:23:41 PM org.apache.cayenne.map.EntityResolver applyDBLayerDefaults
INFO: added runtime complimentary DbRelationship from DELETE_RULE_TEST3 to DELETE_RULE_TEST1
Oct 11, 2012 6:23:41 PM org.apache.cayenne.map.EntityResolver applyObjectLayerDefaults
INFO: added runtime complimentary ObjRelationship from FlattenedTest3 to FlattenedTest1
Oct 11, 2012 6:23:41 PM org.apache.cayenne.map.EntityResolver applyObjectLayerDefaults
INFO: added runtime complimentary ObjRelationship from FlattenedTest4 to FlattenedTest1
Oct 11, 2012 6:23:41 PM org.apache.cayenne.log.CommonsJdbcEventLogger logBeginTransaction
INFO: --- transaction started.
Oct 11, 2012 6:23:41 PM org.apache.cayenne.log.CommonsJdbcEventLogger logQuery
INFO: SELECT NEXT_ID FROM AUTO_PK_SUPPORT WHERE TABLE_NAME = 'MASTER'
Oct 11, 2012 6:23:41 PM org.apache.cayenne.log.CommonsJdbcEventLogger logSelectCount
INFO: === returned 1 row. - took 0 ms.
Oct 11, 2012 6:23:41 PM org.apache.cayenne.log.CommonsJdbcEventLogger logQuery
INFO: UPDATE AUTO_PK_SUPPORT SET NEXT_ID = NEXT_ID + 20 WHERE TABLE_NAME = 'MASTER'
Oct 11, 2012 6:23:41 PM org.apache.cayenne.log.CommonsJdbcEventLogger logUpdateCount
INFO: === updated 1 row.
Oct 11, 2012 6:23:41 PM org.apache.cayenne.log.CommonsJdbcEventLogger logQuery
INFO: INSERT INTO MASTER (ID, NAME) VALUES (?, ?)
Oct 11, 2012 6:23:41 PM org.apache.cayenne.log.CommonsJdbcEventLogger logQueryParameters
INFO: [bind: 1->ID:200, 2->NAME:'X']
Oct 11, 2012 6:23:41 PM org.apache.cayenne.log.CommonsJdbcEventLogger logUpdateCount
INFO: === updated 1 row.
Oct 11, 2012 6:23:41 PM org.apache.cayenne.log.CommonsJdbcEventLogger logCommitTransaction
INFO: +++ transaction committed.
Oct 11, 2012 6:23:41 PM org.apache.cayenne.log.CommonsJdbcEventLogger logBeginTransaction
INFO: --- transaction started.
Oct 11, 2012 6:23:41 PM org.apache.cayenne.log.CommonsJdbcEventLogger logQuery
INFO: UPDATE MASTER SET NAME = ? WHERE ID = ?
Oct 11, 2012 6:23:41 PM org.apache.cayenne.log.CommonsJdbcEventLogger logQueryParameters
INFO: [bind: 1->NAME:'Y', 2->ID:200]
Oct 11, 2012 6:23:41 PM org.apache.cayenne.log.CommonsJdbcEventLogger logUpdateCount
INFO: === updated 1 row.
Oct 11, 2012 6:23:41 PM org.apache.cayenne.log.CommonsJdbcEventLogger logCommitTransaction
INFO: +++ transaction committed.
Oct 11, 2012 6:23:41 PM org.apache.cayenne.configuration.XMLDataChannelDescriptorLoader load
INFO: Loading XML configuration resource from <https://builds.apache.org/job/Cayenne-trunk/./cayenneTestConnection=h2,jdk=JDK%201.7%20(latest),label=Ubuntu/ws/trunk/framework/cayenne-jdk1.5-unpublished/target/test-classes/cayenne-relationships.xml>
Oct 11, 2012 6:23:41 PM org.apache.cayenne.configuration.XMLDataChannelDescriptorLoader$DataChannelChildrenHandler
createChildTagHandler
INFO: Loading XML DataMap resource from <https://builds.apache.org/job/Cayenne-trunk/./cayenneTestConnection=h2,jdk=JDK%201.7%20(latest),label=Ubuntu/ws/trunk/framework/cayenne-jdk1.5-unpublished/target/test-classes/relationships.map.xml>
Oct 11, 2012 6:23:41 PM org.apache.cayenne.map.EntityResolver applyDBLayerDefaults
INFO: added runtime complimentary DbRelationship from DELETE_RULE_TEST3 to DELETE_RULE_TEST1
Oct 11, 2012 6:23:41 PM org.apache.cayenne.map.EntityResolver applyObjectLayerDefaults
INFO: added runtime complimentary ObjRelationship from FlattenedTest3 to FlattenedTest1
Oct 11, 2012 6:23:41 PM org.apache.cayenne.map.EntityResolver applyObjectLayerDefaults
INFO: added runtime complimentary ObjRelationship from FlattenedTest4 to FlattenedTest1
Oct 11, 2012 6:23:41 PM org.apache.cayenne.log.CommonsJdbcEventLogger logBeginTransaction
INFO: --- transaction started.
Oct 11, 2012 6:23:41 PM org.apache.cayenne.log.CommonsJdbcEventLogger logQuery
INFO: SELECT NEXT_ID FROM AUTO_PK_SUPPORT WHERE TABLE_NAME = 'CHILD'
Oct 11, 2012 6:23:41 PM org.apache.cayenne.log.CommonsJdbcEventLogger logSelectCount
INFO: === returned 1 row. - took 1 ms.
Oct 11, 2012 6:23:41 PM org.apache.cayenne.log.CommonsJdbcEventLogger logQuery
INFO: UPDATE AUTO_PK_SUPPORT SET NEXT_ID = NEXT_ID + 20 WHERE TABLE_NAME = 'CHILD'
Oct 11, 2012 6:23:41 PM org.apache.cayenne.log.CommonsJdbcEventLogger logUpdateCount
INFO: === updated 1 row.
Oct 11, 2012 6:23:41 PM org.apache.cayenne.log.CommonsJdbcEventLogger logQuery
INFO: INSERT INTO MASTER (ID, NAME) VALUES (?, ?)
Oct 11, 2012 6:23:41 PM org.apache.cayenne.log.CommonsJdbcEventLogger logQueryParameters
INFO: [bind: 1->ID:201, 2->NAME:'Y']
Oct 11, 2012 6:23:41 PM org.apache.cayenne.log.CommonsJdbcEventLogger logUpdateCount
INFO: === updated 1 row.
Oct 11, 2012 6:23:41 PM org.apache.cayenne.log.CommonsJdbcEventLogger logQueryParameters
INFO: [bind: 1->ID:202, 2->NAME:'X']
Oct 11, 2012 6:23:41 PM org.apache.cayenne.log.CommonsJdbcEventLogger logUpdateCount
INFO: === updated 1 row.
Oct 11, 2012 6:23:41 PM org.apache.cayenne.log.CommonsJdbcEventLogger logQuery
INFO: INSERT INTO CHILD (ID, MASTER_ID) VALUES (?, ?)
Oct 11, 2012 6:23:41 PM org.apache.cayenne.log.CommonsJdbcEventLogger logQueryParameters
INFO: [bind: 1->ID:200, 2->MASTER_ID:202]
Oct 11, 2012 6:23:41 PM org.apache.cayenne.log.CommonsJdbcEventLogger logUpdateCount
INFO: === updated 1 row.
Oct 11, 2012 6:23:41 PM org.apache.cayenne.log.CommonsJdbcEventLogger logCommitTransaction
INFO: +++ transaction committed.
Oct 11, 2012 6:23:41 PM org.apache.cayenne.log.CommonsJdbcEventLogger logBeginTransaction
INFO: --- transaction started.
Oct 11, 2012 6:23:41 PM org.apache.cayenne.log.CommonsJdbcEventLogger logQuery
INFO: UPDATE CHILD SET MASTER_ID = ? WHERE ID = ?
Oct 11, 2012 6:23:41 PM org.apache.cayenne.log.CommonsJdbcEventLogger logQueryParameters
INFO: [bind: 1->MASTER_ID:201, 2->ID:200]
Oct 11, 2012 6:23:41 PM org.apache.cayenne.log.CommonsJdbcEventLogger logUpdateCount
INFO: === updated 1 row.
Oct 11, 2012 6:23:41 PM org.apache.cayenne.log.CommonsJdbcEventLogger logCommitTransaction
INFO: +++ transaction committed.
Oct 11, 2012 6:23:41 PM org.apache.cayenne.configuration.XMLDataChannelDescriptorLoader load
INFO: Loading XML configuration resource from <https://builds.apache.org/job/Cayenne-trunk/./cayenneTestConnection=h2,jdk=JDK%201.7%20(latest),label=Ubuntu/ws/trunk/framework/cayenne-jdk1.5-unpublished/target/test-classes/cayenne-relationships.xml>
Oct 11, 2012 6:23:41 PM org.apache.cayenne.configuration.XMLDataChannelDescriptorLoader$DataChannelChildrenHandler
createChildTagHandler
INFO: Loading XML DataMap resource from <https://builds.apache.org/job/Cayenne-trunk/./cayenneTestConnection=h2,jdk=JDK%201.7%20(latest),label=Ubuntu/ws/trunk/framework/cayenne-jdk1.5-unpublished/target/test-classes/relationships.map.xml>
Oct 11, 2012 6:23:41 PM org.apache.cayenne.map.EntityResolver applyDBLayerDefaults
INFO: added runtime complimentary DbRelationship from DELETE_RULE_TEST3 to DELETE_RULE_TEST1
Oct 11, 2012 6:23:41 PM org.apache.cayenne.map.EntityResolver applyObjectLayerDefaults
INFO: added runtime complimentary ObjRelationship from FlattenedTest3 to FlattenedTest1
Oct 11, 2012 6:23:41 PM org.apache.cayenne.map.EntityResolver applyObjectLayerDefaults
INFO: added runtime complimentary ObjRelationship from FlattenedTest4 to FlattenedTest1
Oct 11, 2012 6:23:41 PM org.apache.cayenne.log.CommonsJdbcEventLogger logBeginTransaction
INFO: --- transaction started.
Oct 11, 2012 6:23:41 PM org.apache.cayenne.log.CommonsJdbcEventLogger logQuery
INFO: INSERT INTO MASTER (ID, NAME) VALUES (?, ?)
Oct 11, 2012 6:23:41 PM org.apache.cayenne.log.CommonsJdbcEventLogger logQueryParameters
INFO: [bind: 1->ID:203, 2->NAME:'X']
Oct 11, 2012 6:23:41 PM org.apache.cayenne.log.CommonsJdbcEventLogger logUpdateCount
INFO: === updated 1 row.
Oct 11, 2012 6:23:41 PM org.apache.cayenne.log.CommonsJdbcEventLogger logQuery
INFO: INSERT INTO CHILD (ID, MASTER_ID) VALUES (?, ?)
Oct 11, 2012 6:23:41 PM org.apache.cayenne.log.CommonsJdbcEventLogger logQueryParameters
INFO: [bind: 1->ID:201, 2->MASTER_ID:NULL]
Oct 11, 2012 6:23:41 PM org.apache.cayenne.log.CommonsJdbcEventLogger logUpdateCount
INFO: === updated 1 row.
Oct 11, 2012 6:23:41 PM org.apache.cayenne.log.CommonsJdbcEventLogger logQueryParameters
INFO: [bind: 1->ID:202, 2->MASTER_ID:203]
Oct 11, 2012 6:23:41 PM org.apache.cayenne.log.CommonsJdbcEventLogger logUpdateCount
INFO: === updated 1 row.
Oct 11, 2012 6:23:41 PM org.apache.cayenne.log.CommonsJdbcEventLogger logCommitTransaction
INFO: +++ transaction committed.
Oct 11, 2012 6:23:41 PM org.apache.cayenne.log.CommonsJdbcEventLogger logBeginTransaction
INFO: --- transaction started.
Oct 11, 2012 6:23:41 PM org.apache.cayenne.log.CommonsJdbcEventLogger logQuery
INFO: UPDATE CHILD SET MASTER_ID = ? WHERE ID = ?
Oct 11, 2012 6:23:41 PM org.apache.cayenne.log.CommonsJdbcEventLogger logQueryParameters
INFO: [bind: 1->MASTER_ID:203, 2->ID:201]
Oct 11, 2012 6:23:41 PM org.apache.cayenne.log.CommonsJdbcEventLogger logUpdateCount
INFO: === updated 1 row.
Oct 11, 2012 6:23:41 PM org.apache.cayenne.log.CommonsJdbcEventLogger logCommitTransaction
INFO: +++ transaction committed.
Oct 11, 2012 6:23:42 PM org.apache.cayenne.log.CommonsJdbcEventLogger logBeginTransaction
INFO: --- transaction started.
Oct 11, 2012 6:23:42 PM org.apache.cayenne.log.CommonsJdbcEventLogger logQuery
INFO: SELECT t0.MASTER_ID, t0.ID FROM CHILD t0 WHERE t0.MASTER_ID = ? [bind: 1->MASTER_ID:203]
Oct 11, 2012 6:23:42 PM org.apache.cayenne.log.CommonsJdbcEventLogger logSelectCount
INFO: === returned 2 rows. - took 0 ms.
Oct 11, 2012 6:23:42 PM org.apache.cayenne.log.CommonsJdbcEventLogger logCommitTransaction
INFO: +++ transaction committed.
Tests run: 3, Failures: 0, Errors: 0, Skipped: 0, Time elapsed: 0.936 sec
Running org.apache.cayenne.DataRowTest
Tests run: 2, Failures: 0, Errors: 0, Skipped: 0, Time elapsed: 0.002 sec
Running org.apache.cayenne.access.types.EnumTypeTest
Tests run: 7, Failures: 0, Errors: 0, Skipped: 0, Time elapsed: 0.002 sec

Results :

Failed tests: 
  testDeadlock(org.apache.cayenne.access.NestedDataContext_DeadlockTest)

Tests run: 2110, Failures: 1, Errors: 0, Skipped: 0

[INFO] ------------------------------------------------------------------------
[INFO] Reactor Summary:
[INFO] 
[INFO] Cayenne ........................................... SUCCESS [0.470s]
[INFO] Common Unit Test Utilities ........................ SUCCESS [2.610s]
[INFO] Cayenne Internal Build Plugin ..................... SUCCESS [2.007s]
[INFO] Cayenne Build Tools Parent ........................ SUCCESS [0.012s]
[INFO] Cayenne License and Notice Bundle ................. SUCCESS [0.695s]
[INFO] Cayenne Dependency Injection Container ............ SUCCESS [3.358s]
[INFO] Cayenne Java 1.5 Unpublished ...................... FAILURE [1:44.263s]
[INFO] Cayenne WebObjects Compatibility Library .......... SKIPPED
[INFO] Cayenne Aggregated Server Jar ..................... SKIPPED
[INFO] Cayenne Aggregated Client Jar ..................... SKIPPED
[INFO] Cayenne Project ................................... SKIPPED
[INFO] Cayenne Tools ..................................... SKIPPED
[INFO] Library: cayenne-lifecycle ........................ SKIPPED
[INFO] Cayenne Maven Plugin .............................. SKIPPED
[INFO] Cayenne Framework Aggregator Project .............. SKIPPED
[INFO] Cayenne Integration Tests Parent .................. SKIPPED
[INFO] Integration Tests - Cayenne Runtime ............... SKIPPED
[INFO] Integration Tests - Cayenne Tools ................. SKIPPED
[INFO] Cayenne Modeler ................................... SKIPPED
[INFO] Cayenne Modeler Maven Plugin ...................... SKIPPED
[INFO] Cayenne Modeler Parent ............................ SKIPPED
[INFO] Cayenne Tutorial .................................. SKIPPED
[INFO] Cayenne ROP Server Tutorial ....................... SKIPPED
[INFO] Cayenne ROP Client Tutorial ....................... SKIPPED
[INFO] Cayenne Tutorials ................................. SKIPPED
[INFO] Cayenne Documentation ............................. SKIPPED
[INFO] Cayenne Documenation Parent ....................... SKIPPED
[INFO] Cayenne Docbook Documentation ..................... SKIPPED
[INFO] Docbook: Cayenne Guide ............................ SKIPPED
[INFO] Docbook: Getting Started with Cayenne ............. SKIPPED
[INFO] Docbook: Getting Started with Cayenne ROP ......... SKIPPED
[INFO] Docbook: Cayenne New Features and Upgrade Guide ... SKIPPED
[INFO] ------------------------------------------------------------------------
[INFO] BUILD FAILURE
[INFO] ------------------------------------------------------------------------
[INFO] Total time: 1:54.788s
[INFO] Finished at: Thu Oct 11 18:23:42 UTC 2012
[INFO] Final Memory: 49M/529M
[INFO] ------------------------------------------------------------------------
[ERROR] Failed to execute goal org.apache.maven.plugins:maven-surefire-plugin:2.5:test (default-test)
on project cayenne-jdk1.5-unpublished: There are test failures.
[ERROR] 
[ERROR] Please refer to <https://builds.apache.org/job/Cayenne-trunk/./cayenneTestConnection=h2,jdk=JDK%201.7%20(latest),label=Ubuntu/ws/trunk/framework/cayenne-jdk1.5-unpublished/target/surefire-reports>
for the individual test results.
[ERROR] -> [Help 1]
org.apache.maven.lifecycle.LifecycleExecutionException: Failed to execute goal org.apache.maven.plugins:maven-surefire-plugin:2.5:test
(default-test) on project cayenne-jdk1.5-unpublished: There are test failures.

Please refer to <https://builds.apache.org/job/Cayenne-trunk/./cayenneTestConnection=h2,jdk=JDK%201.7%20(latest),label=Ubuntu/ws/trunk/framework/cayenne-jdk1.5-unpublished/target/surefire-reports>
for the individual test results.
	at org.apache.maven.lifecycle.internal.MojoExecutor.execute(MojoExecutor.java:213)
	at org.apache.maven.lifecycle.internal.MojoExecutor.execute(MojoExecutor.java:153)
	at org.apache.maven.lifecycle.internal.MojoExecutor.execute(MojoExecutor.java:145)
	at org.apache.maven.lifecycle.internal.LifecycleModuleBuilder.buildProject(LifecycleModuleBuilder.java:84)
	at org.apache.maven.lifecycle.internal.LifecycleModuleBuilder.buildProject(LifecycleModuleBuilder.java:59)
	at org.apache.maven.lifecycle.internal.LifecycleStarter.singleThreadedBuild(LifecycleStarter.java:183)
	at org.apache.maven.lifecycle.internal.LifecycleStarter.execute(LifecycleStarter.java:161)
	at org.apache.maven.DefaultMaven.doExecute(DefaultMaven.java:319)
	at org.apache.maven.DefaultMaven.execute(DefaultMaven.java:156)
	at org.apache.maven.cli.MavenCli.execute(MavenCli.java:537)
	at org.apache.maven.cli.MavenCli.doMain(MavenCli.java:196)
	at org.apache.maven.cli.MavenCli.main(MavenCli.java:141)
	at sun.reflect.NativeMethodAccessorImpl.invoke0(Native Method)
	at sun.reflect.NativeMethodAccessorImpl.invoke(NativeMethodAccessorImpl.java:57)
	at sun.reflect.DelegatingMethodAccessorImpl.invoke(DelegatingMethodAccessorImpl.java:43)
	at java.lang.reflect.Method.invoke(Method.java:601)
	at org.codehaus.plexus.classworlds.launcher.Launcher.launchEnhanced(Launcher.java:290)
	at org.codehaus.plexus.classworlds.launcher.Launcher.launch(Launcher.java:230)
	at org.codehaus.plexus.classworlds.launcher.Launcher.mainWithExitCode(Launcher.java:409)
	at org.codehaus.plexus.classworlds.launcher.Launcher.main(Launcher.java:352)
Caused by: org.apache.maven.plugin.MojoFailureException: There are test failures.

Please refer to <https://builds.apache.org/job/Cayenne-trunk/./cayenneTestConnection=h2,jdk=JDK%201.7%20(latest),label=Ubuntu/ws/trunk/framework/cayenne-jdk1.5-unpublished/target/surefire-reports>
for the individual test results.
	at org.apache.maven.plugin.surefire.SurefirePlugin.execute(SurefirePlugin.java:629)
	at org.apache.maven.plugin.DefaultBuildPluginManager.executeMojo(DefaultBuildPluginManager.java:101)
	at org.apache.maven.lifecycle.internal.MojoExecutor.execute(MojoExecutor.java:209)
	... 19 more
[ERROR] 
[ERROR] Re-run Maven using the -X switch to enable full debug logging.
[ERROR] 
[ERROR] For more information about the errors and possible solutions, please read the following
articles:
[ERROR] [Help 1] http://cwiki.apache.org/confluence/display/MAVEN/MojoFailureException
[ERROR] 
[ERROR] After correcting the problems, you can resume the build with the command
[ERROR]   mvn <goals> -rf :cayenne-jdk1.5-unpublished
Build step 'Invoke top-level Maven targets' marked build as failure
Archiving artifacts

Mime
View raw message