cayenne-commits mailing list archives

Site index · List index
Message view « Date » · « Thread »
Top « Date » · « Thread »
From Apache Jenkins Server <jenk...@builds.apache.org>
Subject Build failed in Jenkins: Cayenne-trunk » h2,JDK 1.7 (latest),Ubuntu #772
Date Thu, 18 Oct 2012 08:34:20 GMT
See <https://builds.apache.org/job/Cayenne-trunk/./cayenneTestConnection=h2,jdk=JDK%201.7%20(latest),label=Ubuntu/772/changes>

Changes:

[aadamchik] CAY-1742 ObjRelationship inspector says "ObjAttribute Inspector"

[aadamchik] CAY-1742 ObjRelationship inspector says "ObjAttribute Inspector"

------------------------------------------
[...truncated 120497 lines...]
	Max. connections in the pool: 1
Oct 18, 2012 8:34:11 AM org.apache.cayenne.configuration.server.DataDomainProvider createAndInitDataDomain
INFO: setting DataNode 'lifecycle-db' as default, used by all unlinked DataMaps
Oct 18, 2012 8:34:11 AM org.apache.cayenne.test.jdbc.UtilityLogger log
INFO: delete from E1
Oct 18, 2012 8:34:11 AM org.apache.cayenne.log.CommonsJdbcEventLogger logConnect
INFO: Opening connection: jdbc:hsqldb:mem:lifecycle
	Login: sa
	Password: *******
Oct 18, 2012 8:34:11 AM org.apache.cayenne.log.CommonsJdbcEventLogger logConnectSuccess
INFO: +++ Connecting: SUCCESS.
Oct 18, 2012 8:34:11 AM org.apache.cayenne.log.CommonsJdbcEventLogger log
INFO: Detected and installed adapter: org.apache.cayenne.dba.hsqldb.HSQLDBAdapter
Oct 18, 2012 8:34:11 AM org.apache.cayenne.access.dbsync.CreateIfNoSchemaStrategy processSchemaUpdate
INFO: Full or partial schema detected, skipping tables creation
Oct 18, 2012 8:34:11 AM org.apache.cayenne.test.jdbc.UtilityLogger log
INFO: INSERT INTO E1 (ID) VALUES (?)
Oct 18, 2012 8:34:11 AM org.apache.cayenne.test.jdbc.UtilityLogger log
INFO: INSERT INTO E1 (ID) VALUES (?)
Oct 18, 2012 8:34:11 AM org.apache.cayenne.log.CommonsJdbcEventLogger logBeginTransaction
INFO: --- transaction started.
Oct 18, 2012 8:34:11 AM org.apache.cayenne.log.CommonsJdbcEventLogger logQuery
INFO: SELECT t0.ID FROM E1 t0 WHERE (t0.ID = ?) OR (t0.ID = ?) OR (t0.ID = ?) [bind: 1->ID:4,
2->ID:5, 3->ID:3]
Oct 18, 2012 8:34:11 AM org.apache.cayenne.log.CommonsJdbcEventLogger logSelectCount
INFO: === returned 2 rows. - took 2 ms.
Oct 18, 2012 8:34:11 AM org.apache.cayenne.log.CommonsJdbcEventLogger logCommitTransaction
INFO: +++ transaction committed.
Oct 18, 2012 8:34:11 AM org.apache.cayenne.configuration.XMLDataChannelDescriptorLoader load
INFO: Loading XML configuration resource from <https://builds.apache.org/job/Cayenne-trunk/./cayenneTestConnection=h2,jdk=JDK%201.7%20(latest),label=Ubuntu/ws/trunk/framework/cayenne-lifecycle/target/test-classes/cayenne-lifecycle.xml>
Oct 18, 2012 8:34:11 AM org.apache.cayenne.configuration.XMLDataChannelDescriptorLoader$DataChannelChildrenHandler
createChildTagHandler
INFO: Loading XML DataMap resource from <https://builds.apache.org/job/Cayenne-trunk/./cayenneTestConnection=h2,jdk=JDK%201.7%20(latest),label=Ubuntu/ws/trunk/framework/cayenne-lifecycle/target/test-classes/lifecycle-map.map.xml>
Oct 18, 2012 8:34:11 AM org.apache.cayenne.configuration.XMLDataChannelDescriptorLoader$DataSourceChildrenHandler
createChildTagHandler
INFO: loading user name and password.
Oct 18, 2012 8:34:11 AM org.apache.cayenne.map.EntityResolver applyObjectLayerDefaults
INFO: added runtime complimentary ObjRelationship from Auditable1 to AuditableChild2
Oct 18, 2012 8:34:11 AM org.apache.cayenne.log.CommonsJdbcEventLogger logPoolCreated
INFO: Created connection pool: jdbc:hsqldb:mem:lifecycle
	Driver class: org.hsqldb.jdbcDriver
	Min. connections in the pool: 1
	Max. connections in the pool: 1
Oct 18, 2012 8:34:11 AM org.apache.cayenne.configuration.server.DataDomainProvider createAndInitDataDomain
INFO: setting DataNode 'lifecycle-db' as default, used by all unlinked DataMaps
Oct 18, 2012 8:34:11 AM org.apache.cayenne.test.jdbc.UtilityLogger log
INFO: delete from E1
Oct 18, 2012 8:34:11 AM org.apache.cayenne.log.CommonsJdbcEventLogger logConnect
INFO: Opening connection: jdbc:hsqldb:mem:lifecycle
	Login: sa
	Password: *******
Oct 18, 2012 8:34:11 AM org.apache.cayenne.log.CommonsJdbcEventLogger logConnectSuccess
INFO: +++ Connecting: SUCCESS.
Oct 18, 2012 8:34:11 AM org.apache.cayenne.log.CommonsJdbcEventLogger log
INFO: Detected and installed adapter: org.apache.cayenne.dba.hsqldb.HSQLDBAdapter
Oct 18, 2012 8:34:11 AM org.apache.cayenne.access.dbsync.CreateIfNoSchemaStrategy processSchemaUpdate
INFO: Full or partial schema detected, skipping tables creation
Oct 18, 2012 8:34:11 AM org.apache.cayenne.test.jdbc.UtilityLogger log
INFO: INSERT INTO E1 (ID) VALUES (?)
Oct 18, 2012 8:34:11 AM org.apache.cayenne.test.jdbc.UtilityLogger log
INFO: INSERT INTO E1 (ID) VALUES (?)
Oct 18, 2012 8:34:11 AM org.apache.cayenne.test.jdbc.UtilityLogger log
INFO: delete from E2
Oct 18, 2012 8:34:11 AM org.apache.cayenne.test.jdbc.UtilityLogger log
INFO: INSERT INTO E2 (ID) VALUES (?)
Oct 18, 2012 8:34:11 AM org.apache.cayenne.test.jdbc.UtilityLogger log
INFO: INSERT INTO E2 (ID) VALUES (?)
Oct 18, 2012 8:34:11 AM org.apache.cayenne.test.jdbc.UtilityLogger log
INFO: INSERT INTO E2 (ID) VALUES (?)
Oct 18, 2012 8:34:11 AM org.apache.cayenne.log.CommonsJdbcEventLogger logBeginTransaction
INFO: --- transaction started.
Oct 18, 2012 8:34:11 AM org.apache.cayenne.log.CommonsJdbcEventLogger logQuery
INFO: SELECT t0.ID FROM E2 t0 WHERE t0.ID = ? [bind: 1->ID:6]
Oct 18, 2012 8:34:11 AM org.apache.cayenne.log.CommonsJdbcEventLogger logSelectCount
INFO: === returned 1 row. - took 2 ms.
Oct 18, 2012 8:34:11 AM org.apache.cayenne.log.CommonsJdbcEventLogger logQuery
INFO: SELECT t0.ID FROM E1 t0 WHERE (t0.ID = ?) OR (t0.ID = ?) OR (t0.ID = ?) [bind: 1->ID:4,
2->ID:5, 3->ID:3]
Oct 18, 2012 8:34:11 AM org.apache.cayenne.log.CommonsJdbcEventLogger logSelectCount
INFO: === returned 2 rows. - took 2 ms.
Oct 18, 2012 8:34:11 AM org.apache.cayenne.log.CommonsJdbcEventLogger logCommitTransaction
INFO: +++ transaction committed.
Tests run: 3, Failures: 0, Errors: 0, Skipped: 0, Time elapsed: 0.092 sec

Results :

Tests run: 27, Failures: 0, Errors: 0, Skipped: 0

[INFO] 
[INFO] --- maven-jar-plugin:2.3.1:jar (default-jar) @ cayenne-lifecycle ---
[INFO] Building jar: <https://builds.apache.org/job/Cayenne-trunk/./cayenneTestConnection=h2,jdk=JDK%201.7%20(latest),label=Ubuntu/772/artifact/trunk/framework/cayenne-lifecycle/target/cayenne-lifecycle-3.2M1-SNAPSHOT.jar>
[INFO] 
[INFO] >>> maven-source-plugin:2.1.2:jar (bundle-source-jar) @ cayenne-lifecycle
>>>
[INFO] 
[INFO] <<< maven-source-plugin:2.1.2:jar (bundle-source-jar) @ cayenne-lifecycle
<<<
[INFO] 
[INFO] --- maven-source-plugin:2.1.2:jar (bundle-source-jar) @ cayenne-lifecycle ---
[INFO] org already added, skipping
[INFO] org/apache already added, skipping
[INFO] org/apache/cayenne already added, skipping
[INFO] org/apache/cayenne/lifecycle already added, skipping
[INFO] org/apache/cayenne/lifecycle/id already added, skipping
[INFO] org/apache/cayenne/lifecycle/changeset already added, skipping
[INFO] org/apache/cayenne/lifecycle/cache already added, skipping
[INFO] org/apache/cayenne/lifecycle/audit already added, skipping
[INFO] org/apache/cayenne/lifecycle/relationship already added, skipping
[INFO] org/apache/cayenne/lifecycle/sort already added, skipping
[INFO] Building jar: <https://builds.apache.org/job/Cayenne-trunk/./cayenneTestConnection=h2,jdk=JDK%201.7%20(latest),label=Ubuntu/772/artifact/trunk/framework/cayenne-lifecycle/target/cayenne-lifecycle-3.2M1-SNAPSHOT-sources.jar>
[INFO] org already added, skipping
[INFO] org/apache already added, skipping
[INFO] org/apache/cayenne already added, skipping
[INFO] org/apache/cayenne/lifecycle already added, skipping
[INFO] org/apache/cayenne/lifecycle/id already added, skipping
[INFO] org/apache/cayenne/lifecycle/changeset already added, skipping
[INFO] org/apache/cayenne/lifecycle/cache already added, skipping
[INFO] org/apache/cayenne/lifecycle/audit already added, skipping
[INFO] org/apache/cayenne/lifecycle/relationship already added, skipping
[INFO] org/apache/cayenne/lifecycle/sort already added, skipping
[INFO] 
[INFO] --- maven-install-plugin:2.3.1:install (default-install) @ cayenne-lifecycle ---
[INFO] Installing <https://builds.apache.org/job/Cayenne-trunk/./cayenneTestConnection=h2,jdk=JDK%201.7%20(latest),label=Ubuntu/772/artifact/trunk/framework/cayenne-lifecycle/target/cayenne-lifecycle-3.2M1-SNAPSHOT.jar>
to /home/jenkins/.m2/repository/org/apache/cayenne/cayenne-lifecycle/3.2M1-SNAPSHOT/cayenne-lifecycle-3.2M1-SNAPSHOT.jar
[INFO] Installing <https://builds.apache.org/job/Cayenne-trunk/./cayenneTestConnection=h2,jdk=JDK%201.7%20(latest),label=Ubuntu/ws/trunk/framework/cayenne-lifecycle/pom.xml>
to /home/jenkins/.m2/repository/org/apache/cayenne/cayenne-lifecycle/3.2M1-SNAPSHOT/cayenne-lifecycle-3.2M1-SNAPSHOT.pom
[INFO] Installing <https://builds.apache.org/job/Cayenne-trunk/./cayenneTestConnection=h2,jdk=JDK%201.7%20(latest),label=Ubuntu/772/artifact/trunk/framework/cayenne-lifecycle/target/cayenne-lifecycle-3.2M1-SNAPSHOT-sources.jar>
to /home/jenkins/.m2/repository/org/apache/cayenne/cayenne-lifecycle/3.2M1-SNAPSHOT/cayenne-lifecycle-3.2M1-SNAPSHOT-sources.jar
[INFO]                                                                         
[INFO] ------------------------------------------------------------------------
[INFO] Building Cayenne Maven Plugin 3.2M1-SNAPSHOT
[INFO] ------------------------------------------------------------------------
[INFO] 
[INFO] --- maven-clean-plugin:2.4.1:clean (default-clean) @ maven-cayenne-plugin ---
[INFO] 
[INFO] --- maven-plugin-plugin:2.7:descriptor (default-descriptor) @ maven-cayenne-plugin
---
[WARNING] Using platform encoding (ANSI_X3.4-1968 actually) to read mojo metadata, i.e. build
is platform dependent!
[INFO] Applying mojo extractor for language: java
[INFO] Mojo extractor for language: java found 3 mojo descriptors.
[INFO] Applying mojo extractor for language: bsh
[INFO] Mojo extractor for language: bsh found 0 mojo descriptors.
[INFO] 
[INFO] --- maven-resources-plugin:2.4.3:resources (default-resources) @ maven-cayenne-plugin
---
[INFO] Using 'UTF-8' encoding to copy filtered resources.
[INFO] Copying 1 resource
[INFO] 
[INFO] --- maven-compiler-plugin:2.3.2:compile (default-compile) @ maven-cayenne-plugin ---
[WARNING] File encoding has not been set, using platform encoding ANSI_X3.4-1968, i.e. build
is platform dependent!
[INFO] Compiling 4 source files to <https://builds.apache.org/job/Cayenne-trunk/./cayenneTestConnection=h2,jdk=JDK%201.7%20(latest),label=Ubuntu/ws/trunk/framework/maven-cayenne-plugin/target/classes>
[INFO] 
[INFO] --- maven-resources-plugin:2.4.3:testResources (default-testResources) @ maven-cayenne-plugin
---
[INFO] Using 'UTF-8' encoding to copy filtered resources.
[INFO] Copying 3 resources
[INFO] 
[INFO] --- maven-compiler-plugin:2.3.2:testCompile (default-testCompile) @ maven-cayenne-plugin
---
[WARNING] File encoding has not been set, using platform encoding ANSI_X3.4-1968, i.e. build
is platform dependent!
[INFO] Compiling 1 source file to <https://builds.apache.org/job/Cayenne-trunk/./cayenneTestConnection=h2,jdk=JDK%201.7%20(latest),label=Ubuntu/ws/trunk/framework/maven-cayenne-plugin/target/test-classes>
[INFO] 
[INFO] --- maven-surefire-plugin:2.5:test (default-test) @ maven-cayenne-plugin ---
[INFO] Surefire report directory: <https://builds.apache.org/job/Cayenne-trunk/./cayenneTestConnection=h2,jdk=JDK%201.7%20(latest),label=Ubuntu/ws/trunk/framework/maven-cayenne-plugin/target/surefire-reports>

-------------------------------------------------------
 T E S T S
-------------------------------------------------------
Running org.apache.cayenne.tools.CayenneGeneratorMojoTest
[INFO] Generating superclass file: <https://builds.apache.org/job/Cayenne-trunk/./cayenneTestConnection=h2,jdk=JDK%201.7%20(latest),label=Ubuntu/ws/trunk/framework/maven-cayenne-plugin/target/cayenneGeneratedClasses/superPkg/_TestEntity.txt>
[INFO] Generating class file: <https://builds.apache.org/job/Cayenne-trunk/./cayenneTestConnection=h2,jdk=JDK%201.7%20(latest),label=Ubuntu/ws/trunk/framework/maven-cayenne-plugin/target/cayenneGeneratedClasses/pack/TestEntity.txt>
[INFO] Generating superclass file: <https://builds.apache.org/job/Cayenne-trunk/./cayenneTestConnection=h2,jdk=JDK%201.7%20(latest),label=Ubuntu/ws/trunk/framework/maven-cayenne-plugin/target/cayenneGeneratedClasses/superPkg/_Embeddable.txt>
[INFO] Generating class file: <https://builds.apache.org/job/Cayenne-trunk/./cayenneTestConnection=h2,jdk=JDK%201.7%20(latest),label=Ubuntu/ws/trunk/framework/maven-cayenne-plugin/target/cayenneGeneratedClasses/pack/Embeddable.txt>
[INFO] Generating superclass file: <https://builds.apache.org/job/Cayenne-trunk/./cayenneTestConnection=h2,jdk=JDK%201.7%20(latest),label=Ubuntu/ws/trunk/framework/maven-cayenne-plugin/target/cayenneGeneratedClasses/superPkg/_TestDomainMap.txt>
[INFO] Generating class file: <https://builds.apache.org/job/Cayenne-trunk/./cayenneTestConnection=h2,jdk=JDK%201.7%20(latest),label=Ubuntu/ws/trunk/framework/maven-cayenne-plugin/target/cayenneGeneratedClasses/pack/TestDomainMap.txt>
Tests run: 1, Failures: 0, Errors: 0, Skipped: 0, Time elapsed: 0.781 sec

Results :

Tests run: 1, Failures: 0, Errors: 0, Skipped: 0

[INFO] 
[INFO] --- maven-jar-plugin:2.3.1:jar (default-jar) @ maven-cayenne-plugin ---
[INFO] Building jar: <https://builds.apache.org/job/Cayenne-trunk/./cayenneTestConnection=h2,jdk=JDK%201.7%20(latest),label=Ubuntu/ws/trunk/framework/maven-cayenne-plugin/target/maven-cayenne-plugin-3.2M1-SNAPSHOT.jar>
[INFO] 
[INFO] --- maven-plugin-plugin:2.7:addPluginArtifactMetadata (default-addPluginArtifactMetadata)
@ maven-cayenne-plugin ---
[INFO] 
[INFO] --- maven-install-plugin:2.3.1:install (default-install) @ maven-cayenne-plugin ---
[INFO] Installing <https://builds.apache.org/job/Cayenne-trunk/./cayenneTestConnection=h2,jdk=JDK%201.7%20(latest),label=Ubuntu/ws/trunk/framework/maven-cayenne-plugin/target/maven-cayenne-plugin-3.2M1-SNAPSHOT.jar>
to /home/jenkins/.m2/repository/org/apache/cayenne/plugins/maven-cayenne-plugin/3.2M1-SNAPSHOT/maven-cayenne-plugin-3.2M1-SNAPSHOT.jar
[INFO] Installing <https://builds.apache.org/job/Cayenne-trunk/./cayenneTestConnection=h2,jdk=JDK%201.7%20(latest),label=Ubuntu/ws/trunk/framework/maven-cayenne-plugin/pom.xml>
to /home/jenkins/.m2/repository/org/apache/cayenne/plugins/maven-cayenne-plugin/3.2M1-SNAPSHOT/maven-cayenne-plugin-3.2M1-SNAPSHOT.pom
[INFO]                                                                         
[INFO] ------------------------------------------------------------------------
[INFO] Building Cayenne Framework Aggregator Project 3.2M1-SNAPSHOT
[INFO] ------------------------------------------------------------------------
[INFO] 
[INFO] --- maven-clean-plugin:2.4.1:clean (default-clean) @ cayenne-framework-parent ---
[INFO] 
[INFO] --- maven-install-plugin:2.3.1:install (default-install) @ cayenne-framework-parent
---
[INFO] Installing <https://builds.apache.org/job/Cayenne-trunk/./cayenneTestConnection=h2,jdk=JDK%201.7%20(latest),label=Ubuntu/ws/trunk/framework/pom.xml>
to /home/jenkins/.m2/repository/org/apache/cayenne/parents/cayenne-framework-parent/3.2M1-SNAPSHOT/cayenne-framework-parent-3.2M1-SNAPSHOT.pom
[INFO]                                                                         
[INFO] ------------------------------------------------------------------------
[INFO] Building Cayenne Integration Tests Parent 3.2M1-SNAPSHOT
[INFO] ------------------------------------------------------------------------
[INFO] 
[INFO] --- maven-clean-plugin:2.4.1:clean (default-clean) @ cayenne-itests-parent ---
[INFO] 
[INFO] --- maven-install-plugin:2.3.1:install (default-install) @ cayenne-itests-parent ---
[INFO] Installing <https://builds.apache.org/job/Cayenne-trunk/./cayenneTestConnection=h2,jdk=JDK%201.7%20(latest),label=Ubuntu/ws/trunk/itests/pom.xml>
to /home/jenkins/.m2/repository/org/apache/cayenne/itests/cayenne-itests-parent/3.2M1-SNAPSHOT/cayenne-itests-parent-3.2M1-SNAPSHOT.pom
[INFO]                                                                         
[INFO] ------------------------------------------------------------------------
[INFO] Building Integration Tests - Cayenne Runtime 3.2M1-SNAPSHOT
[INFO] ------------------------------------------------------------------------
[INFO] 
[INFO] --- maven-clean-plugin:2.4.1:clean (default-clean) @ cayenne-runtime-itest ---
[INFO] 
[INFO] --- maven-resources-plugin:2.4.3:resources (default-resources) @ cayenne-runtime-itest
---
[INFO] Using 'UTF-8' encoding to copy filtered resources.
[INFO] Copying 3 resources
[INFO] 
[INFO] --- maven-compiler-plugin:2.3.2:compile (default-compile) @ cayenne-runtime-itest ---
[WARNING] File encoding has not been set, using platform encoding ANSI_X3.4-1968, i.e. build
is platform dependent!
[INFO] Compiling 6 source files to <https://builds.apache.org/job/Cayenne-trunk/./cayenneTestConnection=h2,jdk=JDK%201.7%20(latest),label=Ubuntu/ws/trunk/itests/cayenne-runtime-itest/target/classes>
[INFO] 
[INFO] --- maven-resources-plugin:2.4.3:testResources (default-testResources) @ cayenne-runtime-itest
---
[INFO] Using 'UTF-8' encoding to copy filtered resources.
[INFO] skip non existing resourceDirectory <https://builds.apache.org/job/Cayenne-trunk/./cayenneTestConnection=h2,jdk=JDK%201.7%20(latest),label=Ubuntu/ws/trunk/itests/cayenne-runtime-itest/src/test/resources>
[INFO] 
[INFO] --- maven-compiler-plugin:2.3.2:testCompile (default-testCompile) @ cayenne-runtime-itest
---
[WARNING] File encoding has not been set, using platform encoding ANSI_X3.4-1968, i.e. build
is platform dependent!
[INFO] Compiling 1 source file to <https://builds.apache.org/job/Cayenne-trunk/./cayenneTestConnection=h2,jdk=JDK%201.7%20(latest),label=Ubuntu/ws/trunk/itests/cayenne-runtime-itest/target/test-classes>
[ERROR] PermGen space -> [Help 1]
java.lang.OutOfMemoryError: PermGen space
	at org.apache.maven.plugin.AbstractCompilerMojo.execute(AbstractCompilerMojo.java:610)
	at org.apache.maven.plugin.TestCompilerMojo.execute(TestCompilerMojo.java:161)
	at org.apache.maven.plugin.DefaultBuildPluginManager.executeMojo(DefaultBuildPluginManager.java:101)
	at org.apache.maven.lifecycle.internal.MojoExecutor.execute(MojoExecutor.java:209)
	at org.apache.maven.lifecycle.internal.MojoExecutor.execute(MojoExecutor.java:153)
	at org.apache.maven.lifecycle.internal.MojoExecutor.execute(MojoExecutor.java:145)
	at org.apache.maven.lifecycle.internal.LifecycleModuleBuilder.buildProject(LifecycleModuleBuilder.java:84)
	at org.apache.maven.lifecycle.internal.LifecycleModuleBuilder.buildProject(LifecycleModuleBuilder.java:59)
	at org.apache.maven.lifecycle.internal.LifecycleStarter.singleThreadedBuild(LifecycleStarter.java:183)
	at org.apache.maven.lifecycle.internal.LifecycleStarter.execute(LifecycleStarter.java:161)
	at org.apache.maven.DefaultMaven.doExecute(DefaultMaven.java:319)
	at org.apache.maven.DefaultMaven.execute(DefaultMaven.java:156)
	at org.apache.maven.cli.MavenCli.execute(MavenCli.java:537)
	at org.apache.maven.cli.MavenCli.doMain(MavenCli.java:196)
	at org.apache.maven.cli.MavenCli.main(MavenCli.java:141)
	at sun.reflect.NativeMethodAccessorImpl.invoke0(Native Method)
	at sun.reflect.NativeMethodAccessorImpl.invoke(NativeMethodAccessorImpl.java:57)
	at sun.reflect.DelegatingMethodAccessorImpl.invoke(DelegatingMethodAccessorImpl.java:43)
	at java.lang.reflect.Method.invoke(Method.java:601)
	at org.codehaus.plexus.classworlds.launcher.Launcher.launchEnhanced(Launcher.java:290)
	at org.codehaus.plexus.classworlds.launcher.Launcher.launch(Launcher.java:230)
	at org.codehaus.plexus.classworlds.launcher.Launcher.mainWithExitCode(Launcher.java:409)
	at org.codehaus.plexus.classworlds.launcher.Launcher.main(Launcher.java:352)
[ERROR] 
[ERROR] Re-run Maven using the -X switch to enable full debug logging.
[ERROR] 
[ERROR] For more information about the errors and possible solutions, please read the following
articles:
[ERROR] [Help 1] http://cwiki.apache.org/confluence/display/MAVEN/OutOfMemoryError
Build step 'Invoke top-level Maven targets' marked build as failure
Archiving artifacts

Mime
View raw message