cayenne-commits mailing list archives

Site index · List index
Message view « Date » · « Thread »
Top « Date » · « Thread »
From Apache Jenkins Server <jenk...@builds.apache.org>
Subject Build failed in Jenkins: Cayenne-trunk » HSQLDB,JDK 1.5 (latest),Ubuntu #823
Date Sat, 15 Dec 2012 05:48:15 GMT
See <https://builds.apache.org/job/Cayenne-trunk/./cayenneTestConnection=HSQLDB,jdk=JDK%201.5%20(latest),label=Ubuntu/823/changes>

Changes:

[johnthuss] Minimize compiler warnings about missing type parameter for SelectQuery

[johnthuss] CAY-1294 Generify query

Adds type parameter to SelectQuery to indicate query result type,
along with a new 'select' method on ObjectContext.

------------------------------------------
[...truncated 138758 lines...]
2091 KB   
2095 KB   
2099 KB   
2103 KB   
2107 KB   
2111 KB   
2115 KB   
2119 KB   
2123 KB   
2127 KB   
2131 KB   
2135 KB   
2139 KB   
2143 KB   
2147 KB   
2151 KB   
2155 KB   
2159 KB   
2163 KB   
2167 KB   
2171 KB   
2175 KB   
2179 KB   
2183 KB   
2187 KB   
2191 KB   
2195 KB   
2199 KB   
2203 KB   
2207 KB   
2211 KB   
2215 KB   
2219 KB   
2223 KB   
2227 KB   
2231 KB   
2235 KB   
2239 KB   
2243 KB   
2247 KB   
2251 KB   
2255 KB   
2259 KB   
2263 KB   
2267 KB   
2271 KB   
2275 KB   
2279 KB   
2283 KB   
2287 KB   
2291 KB   
2295 KB   
2299 KB   
2303 KB   
2307 KB   
2311 KB   
2315 KB   
2319 KB   
2323 KB   
2327 KB   
2331 KB   
2335 KB   
2339 KB   
2343 KB   
2347 KB   
2351 KB   
2355 KB   
2359 KB   
2363 KB   
2367 KB   
2371 KB   
2375 KB   
2379 KB   
2383 KB   
2387 KB   
2391 KB   
2395 KB   
2399 KB   
2403 KB   
2407 KB   
2411 KB   
2415 KB   
2419 KB   
2423 KB   
2427 KB   
2431 KB   
2435 KB   
2439 KB   
2443 KB   
2447 KB   
2451 KB   
2454 KB   
          
Downloaded: http://repo1.maven.org/maven2/org/apache/derby/derby/10.5.3.0_1/derby-10.5.3.0_1.jar
(2454 KB at 7965.3 KB/sec)
[INFO] 
[INFO] --- maven-clean-plugin:2.4.1:clean (default-clean) @ tutorial ---
Downloading: http://repo1.maven.org/maven2/org/codehaus/plexus/plexus-utils/2.0.5/plexus-utils-2.0.5.jar
          
Downloaded: http://repo1.maven.org/maven2/org/codehaus/plexus/plexus-utils/2.0.5/plexus-utils-2.0.5.jar
(0 B at 0.0 KB/sec)
[INFO] 
[INFO] --- maven-resources-plugin:2.4.3:resources (default-resources) @ tutorial ---
Downloading: http://repo1.maven.org/maven2/org/apache/maven/reporting/maven-reporting-api/2.0.6/maven-reporting-api-2.0.6.jar
Downloading: http://repo1.maven.org/maven2/org/apache/maven/doxia/doxia-sink-api/1.0-alpha-7/doxia-sink-api-1.0-alpha-7.jar
Downloading: http://repo1.maven.org/maven2/commons-cli/commons-cli/1.0/commons-cli-1.0.jar
Downloading: http://repo1.maven.org/maven2/org/codehaus/plexus/plexus-interactivity-api/1.0-alpha-4/plexus-interactivity-api-1.0-alpha-4.jar
Downloading: http://repo1.maven.org/maven2/junit/junit/3.8.1/junit-3.8.1.jar
          
Downloaded: http://repo1.maven.org/maven2/org/apache/maven/reporting/maven-reporting-api/2.0.6/maven-reporting-api-2.0.6.jar
(0 B at 0.0 KB/sec)
Downloading: http://repo1.maven.org/maven2/org/apache/maven/shared/maven-filtering/1.0-beta-4/maven-filtering-1.0-beta-4.jar
          
          
Downloaded: http://repo1.maven.org/maven2/commons-cli/commons-cli/1.0/commons-cli-1.0.jar
(0 B at 0.0 KB/sec)
Downloaded: http://repo1.maven.org/maven2/org/apache/maven/doxia/doxia-sink-api/1.0-alpha-7/doxia-sink-api-1.0-alpha-7.jar
(0 B at 0.0 KB/sec)
Downloading: http://repo1.maven.org/maven2/org/sonatype/plexus/plexus-build-api/0.0.4/plexus-build-api-0.0.4.jar
Downloading: http://repo1.maven.org/maven2/org/codehaus/plexus/plexus-interpolation/1.13/plexus-interpolation-1.13.jar
          
Downloaded: http://repo1.maven.org/maven2/org/codehaus/plexus/plexus-interactivity-api/1.0-alpha-4/plexus-interactivity-api-1.0-alpha-4.jar
(0 B at 0.0 KB/sec)
          
          
Downloaded: http://repo1.maven.org/maven2/junit/junit/3.8.1/junit-3.8.1.jar (0 B at 0.0 KB/sec)
Downloaded: http://repo1.maven.org/maven2/org/apache/maven/shared/maven-filtering/1.0-beta-4/maven-filtering-1.0-beta-4.jar
(0 B at 0.0 KB/sec)
          
Downloaded: http://repo1.maven.org/maven2/org/sonatype/plexus/plexus-build-api/0.0.4/plexus-build-api-0.0.4.jar
(0 B at 0.0 KB/sec)
          
Downloaded: http://repo1.maven.org/maven2/org/codehaus/plexus/plexus-interpolation/1.13/plexus-interpolation-1.13.jar
(0 B at 0.0 KB/sec)
[WARNING] Using platform encoding (ANSI_X3.4-1968 actually) to copy filtered resources, i.e.
build is platform dependent!
[INFO] Copying 2 resources
[INFO] 
[INFO] --- maven-compiler-plugin:2.3.2:compile (default-compile) @ tutorial ---
Downloading: http://repo1.maven.org/maven2/org/codehaus/plexus/plexus-compiler-api/1.8.1/plexus-compiler-api-1.8.1.jar
Downloading: http://repo1.maven.org/maven2/org/codehaus/plexus/plexus-compiler-manager/1.8.1/plexus-compiler-manager-1.8.1.jar
Downloading: http://repo1.maven.org/maven2/org/codehaus/plexus/plexus-compiler-javac/1.8.1/plexus-compiler-javac-1.8.1.jar
          
          
Downloaded: http://repo1.maven.org/maven2/org/codehaus/plexus/plexus-compiler-api/1.8.1/plexus-compiler-api-1.8.1.jar
(0 B at 0.0 KB/sec)
Downloaded: http://repo1.maven.org/maven2/org/codehaus/plexus/plexus-compiler-manager/1.8.1/plexus-compiler-manager-1.8.1.jar
(0 B at 0.0 KB/sec)
          
Downloaded: http://repo1.maven.org/maven2/org/codehaus/plexus/plexus-compiler-javac/1.8.1/plexus-compiler-javac-1.8.1.jar
(0 B at 0.0 KB/sec)
[WARNING] File encoding has not been set, using platform encoding ANSI_X3.4-1968, i.e. build
is platform dependent!
[INFO] Compiling 9 source files to /x1/jenkins/jenkins-slave/workspace/Cayenne-trunk/cayenneTestConnection/HSQLDB/jdk/JDK
1.5 (latest)/label/Ubuntu/trunk/tutorials/tutorial/target/classes
[INFO] -------------------------------------------------------------
[ERROR] COMPILATION ERROR : 
[INFO] -------------------------------------------------------------
[ERROR] /x1/jenkins/jenkins-slave/workspace/Cayenne-trunk/cayenneTestConnection/HSQLDB/jdk/JDK
1.5 (latest)/label/Ubuntu/trunk/tutorials/tutorial/src/main/java/org/apache/cayenne/tutorial/Main.java:[82,59]
cannot find symbol
symbol  : method from(java.lang.Class<org.apache.cayenne.tutorial.persistent.Painting>,<nulltype>)
location: class org.apache.cayenne.query.SelectQuery
[ERROR] /x1/jenkins/jenkins-slave/workspace/Cayenne-trunk/cayenneTestConnection/HSQLDB/jdk/JDK
1.5 (latest)/label/Ubuntu/trunk/tutorials/tutorial/src/main/java/org/apache/cayenne/tutorial/Main.java:[87,59]
cannot find symbol
symbol  : method from(java.lang.Class<org.apache.cayenne.tutorial.persistent.Painting>,org.apache.cayenne.exp.Expression)
location: class org.apache.cayenne.query.SelectQuery
[ERROR] /x1/jenkins/jenkins-slave/workspace/Cayenne-trunk/cayenneTestConnection/HSQLDB/jdk/JDK
1.5 (latest)/label/Ubuntu/trunk/tutorials/tutorial/src/main/java/org/apache/cayenne/tutorial/Main.java:[97,59]
cannot find symbol
symbol  : method from(java.lang.Class<org.apache.cayenne.tutorial.persistent.Painting>,org.apache.cayenne.exp.Expression)
location: class org.apache.cayenne.query.SelectQuery
[ERROR] /x1/jenkins/jenkins-slave/workspace/Cayenne-trunk/cayenneTestConnection/HSQLDB/jdk/JDK
1.5 (latest)/label/Ubuntu/trunk/tutorials/tutorial/src/main/java/org/apache/cayenne/tutorial/Main.java:[105,64]
cannot find symbol
symbol  : method from(java.lang.Class<org.apache.cayenne.tutorial.persistent.Artist>,org.apache.cayenne.exp.Expression)
location: class org.apache.cayenne.query.SelectQuery
[INFO] 4 errors 
[INFO] -------------------------------------------------------------
[INFO] ------------------------------------------------------------------------
[INFO] Reactor Summary:
[INFO] 
[INFO] Cayenne ........................................... SUCCESS [10.518s]
[INFO] Common Unit Test Utilities ........................ SUCCESS [27.999s]
[INFO] Cayenne Internal Build Plugin ..................... SUCCESS [31.761s]
[INFO] Cayenne Build Tools Parent ........................ SUCCESS [0.004s]
[INFO] Cayenne License and Notice Bundle ................. SUCCESS [7.423s]
[INFO] Cayenne Dependency Injection Container ............ SUCCESS [2.550s]
[INFO] Cayenne Java 1.5 Unpublished ...................... SUCCESS [1:55.580s]
[INFO] Cayenne WebObjects Compatibility Library .......... SUCCESS [1.679s]
[INFO] Cayenne Aggregated Server Jar ..................... SUCCESS [1.976s]
[INFO] Cayenne Aggregated Client Jar ..................... SUCCESS [1.452s]
[INFO] Cayenne Project ................................... SUCCESS [1.693s]
[INFO] Cayenne Tools ..................................... SUCCESS [13.171s]
[INFO] Library: cayenne-lifecycle ........................ SUCCESS [2.865s]
[INFO] Cayenne Maven Plugin .............................. SUCCESS [8.634s]
[INFO] Cayenne Framework Aggregator Project .............. SUCCESS [0.003s]
[INFO] Cayenne Integration Tests Parent .................. SUCCESS [0.004s]
[INFO] Integration Tests - Cayenne Runtime ............... SUCCESS [1.474s]
[INFO] Integration Tests - Cayenne Tools ................. SUCCESS [1.625s]
[INFO] Cayenne Modeler ................................... SUCCESS [8.744s]
[INFO] Cayenne Modeler Maven Plugin ...................... SUCCESS [0.382s]
[INFO] Cayenne Modeler Parent ............................ SUCCESS [0.004s]
[INFO] Cayenne Tutorial .................................. FAILURE [1.282s]
[INFO] Cayenne ROP Server Tutorial ....................... SKIPPED
[INFO] Cayenne ROP Client Tutorial ....................... SKIPPED
[INFO] Cayenne Tutorials ................................. SKIPPED
[INFO] Cayenne Documentation ............................. SKIPPED
[INFO] Cayenne Documenation Parent ....................... SKIPPED
[INFO] Cayenne Docbook Documentation ..................... SKIPPED
[INFO] Docbook: Cayenne Guide ............................ SKIPPED
[INFO] Docbook: Getting Started with Cayenne ............. SKIPPED
[INFO] Docbook: Getting Started with Cayenne ROP ......... SKIPPED
[INFO] Docbook: Cayenne New Features and Upgrade Guide ... SKIPPED
[INFO] ------------------------------------------------------------------------
[INFO] BUILD FAILURE
[INFO] ------------------------------------------------------------------------
[INFO] Total time: 4:08.227s
[INFO] Finished at: Sat Dec 15 05:48:14 GMT 2012
[INFO] Final Memory: 33M/86M
[INFO] ------------------------------------------------------------------------
[ERROR] Failed to execute goal org.apache.maven.plugins:maven-compiler-plugin:2.3.2:compile
(default-compile) on project tutorial: Compilation failure: Compilation failure:
[ERROR] /x1/jenkins/jenkins-slave/workspace/Cayenne-trunk/cayenneTestConnection/HSQLDB/jdk/JDK
1.5 (latest)/label/Ubuntu/trunk/tutorials/tutorial/src/main/java/org/apache/cayenne/tutorial/Main.java:[82,59]
cannot find symbol
[ERROR] symbol  : method from(java.lang.Class<org.apache.cayenne.tutorial.persistent.Painting>,<nulltype>)
[ERROR] location: class org.apache.cayenne.query.SelectQuery
[ERROR] /x1/jenkins/jenkins-slave/workspace/Cayenne-trunk/cayenneTestConnection/HSQLDB/jdk/JDK
1.5 (latest)/label/Ubuntu/trunk/tutorials/tutorial/src/main/java/org/apache/cayenne/tutorial/Main.java:[87,59]
cannot find symbol
[ERROR] symbol  : method from(java.lang.Class<org.apache.cayenne.tutorial.persistent.Painting>,org.apache.cayenne.exp.Expression)
[ERROR] location: class org.apache.cayenne.query.SelectQuery
[ERROR] /x1/jenkins/jenkins-slave/workspace/Cayenne-trunk/cayenneTestConnection/HSQLDB/jdk/JDK
1.5 (latest)/label/Ubuntu/trunk/tutorials/tutorial/src/main/java/org/apache/cayenne/tutorial/Main.java:[97,59]
cannot find symbol
[ERROR] symbol  : method from(java.lang.Class<org.apache.cayenne.tutorial.persistent.Painting>,org.apache.cayenne.exp.Expression)
[ERROR] location: class org.apache.cayenne.query.SelectQuery
[ERROR] /x1/jenkins/jenkins-slave/workspace/Cayenne-trunk/cayenneTestConnection/HSQLDB/jdk/JDK
1.5 (latest)/label/Ubuntu/trunk/tutorials/tutorial/src/main/java/org/apache/cayenne/tutorial/Main.java:[105,64]
cannot find symbol
[ERROR] symbol  : method from(java.lang.Class<org.apache.cayenne.tutorial.persistent.Artist>,org.apache.cayenne.exp.Expression)
[ERROR] location: class org.apache.cayenne.query.SelectQuery
[ERROR] -> [Help 1]
org.apache.maven.lifecycle.LifecycleExecutionException: Failed to execute goal org.apache.maven.plugins:maven-compiler-plugin:2.3.2:compile
(default-compile) on project tutorial: Compilation failure
	at org.apache.maven.lifecycle.internal.MojoExecutor.execute(MojoExecutor.java:213)
	at org.apache.maven.lifecycle.internal.MojoExecutor.execute(MojoExecutor.java:153)
	at org.apache.maven.lifecycle.internal.MojoExecutor.execute(MojoExecutor.java:145)
	at org.apache.maven.lifecycle.internal.LifecycleModuleBuilder.buildProject(LifecycleModuleBuilder.java:84)
	at org.apache.maven.lifecycle.internal.LifecycleModuleBuilder.buildProject(LifecycleModuleBuilder.java:59)
	at org.apache.maven.lifecycle.internal.LifecycleStarter.singleThreadedBuild(LifecycleStarter.java:183)
	at org.apache.maven.lifecycle.internal.LifecycleStarter.execute(LifecycleStarter.java:161)
	at org.apache.maven.DefaultMaven.doExecute(DefaultMaven.java:319)
	at org.apache.maven.DefaultMaven.execute(DefaultMaven.java:156)
	at org.apache.maven.cli.MavenCli.execute(MavenCli.java:537)
	at org.apache.maven.cli.MavenCli.doMain(MavenCli.java:196)
	at org.apache.maven.cli.MavenCli.main(MavenCli.java:141)
	at sun.reflect.NativeMethodAccessorImpl.invoke0(Native Method)
	at sun.reflect.NativeMethodAccessorImpl.invoke(NativeMethodAccessorImpl.java:39)
	at sun.reflect.DelegatingMethodAccessorImpl.invoke(DelegatingMethodAccessorImpl.java:25)
	at java.lang.reflect.Method.invoke(Method.java:592)
	at org.codehaus.plexus.classworlds.launcher.Launcher.launchEnhanced(Launcher.java:290)
	at org.codehaus.plexus.classworlds.launcher.Launcher.launch(Launcher.java:230)
	at org.codehaus.plexus.classworlds.launcher.Launcher.mainWithExitCode(Launcher.java:409)
	at org.codehaus.plexus.classworlds.launcher.Launcher.main(Launcher.java:352)
Caused by: org.apache.maven.plugin.CompilationFailureException: Compilation failure
	at org.apache.maven.plugin.AbstractCompilerMojo.execute(AbstractCompilerMojo.java:656)
	at org.apache.maven.plugin.CompilerMojo.execute(CompilerMojo.java:128)
	at org.apache.maven.plugin.DefaultBuildPluginManager.executeMojo(DefaultBuildPluginManager.java:101)
	at org.apache.maven.lifecycle.internal.MojoExecutor.execute(MojoExecutor.java:209)
	... 19 more
[ERROR] 
[ERROR] Re-run Maven using the -X switch to enable full debug logging.
[ERROR] 
[ERROR] For more information about the errors and possible solutions, please read the following
articles:
[ERROR] [Help 1] http://cwiki.apache.org/confluence/display/MAVEN/MojoFailureException
[ERROR] 
[ERROR] After correcting the problems, you can resume the build with the command
[ERROR]   mvn <goals> -rf :tutorial
Build step 'Invoke top-level Maven targets' marked build as failure

Mime
View raw message