cayenne-commits mailing list archives

Site index · List index
Message view « Date » · « Thread »
Top « Date » · « Thread »
From Apache Jenkins Server <jenk...@builds.apache.org>
Subject Build failed in Jenkins: Cayenne-trunk » HSQLDB,JDK 1.5 (latest),Ubuntu #824
Date Sat, 15 Dec 2012 14:51:21 GMT
See <https://builds.apache.org/job/Cayenne-trunk/./cayenneTestConnection=HSQLDB,jdk=JDK%201.5%20(latest),label=Ubuntu/824/changes>

Changes:

[johnthuss] Fix tutorial build

------------------------------------------
[...truncated 125610 lines...]
86 KB   102 KB   25 KB   50 KB   
                                 
Downloaded: http://repo1.maven.org/maven2/org/codehaus/plexus/plexus-io/1.0.1/plexus-io-1.0.1.jar
(50 KB at 1774.1 KB/sec)
89 KB   102 KB   25 KB           
93 KB   102 KB   25 KB   
93 KB   106 KB   25 KB   
97 KB   106 KB   25 KB   
97 KB   110 KB   25 KB   
101 KB   110 KB   25 KB   
101 KB   114 KB   25 KB   
101 KB   118 KB   25 KB   
105 KB   118 KB   25 KB   
105 KB   121 KB   25 KB   
109 KB   123 KB   25 KB   
109 KB   123 KB   25 KB   
109 KB   127 KB   25 KB   
113 KB   127 KB   25 KB   
113 KB   131 KB   25 KB   
113 KB   135 KB   25 KB   
117 KB   135 KB   25 KB   
117 KB   139 KB   25 KB   
121 KB   143 KB   25 KB   
121 KB   143 KB   25 KB   
121 KB   146 KB   25 KB   
124 KB   146 KB   25 KB   
128 KB   149 KB   25 KB   
128 KB   149 KB   25 KB   
128 KB   153 KB   25 KB   
132 KB   157 KB   25 KB   
132 KB   157 KB   25 KB   
132 KB   161 KB   25 KB   
136 KB   161 KB   25 KB   
136 KB   165 KB   25 KB   
136 KB   169 KB   25 KB   
140 KB   169 KB   25 KB   
140 KB   173 KB   25 KB   
140 KB   177 KB   25 KB   
144 KB   177 KB   25 KB   
144 KB   178 KB   25 KB   
148 KB   178 KB   25 KB   
152 KB   178 KB   25 KB   
156 KB   178 KB   25 KB   
160 KB   178 KB   25 KB   
164 KB   178 KB   25 KB   
168 KB   178 KB   25 KB   
171 KB   178 KB   25 KB   
173 KB   178 KB   25 KB   
177 KB   178 KB   25 KB   
181 KB   178 KB   25 KB   
185 KB   178 KB   25 KB   
187 KB   178 KB   25 KB   
188 KB   178 KB   25 KB   
191 KB   178 KB   25 KB   
195 KB   178 KB   25 KB   
199 KB   178 KB   25 KB   
203 KB   178 KB   25 KB   
207 KB   178 KB   25 KB   
211 KB   178 KB   25 KB   
215 KB   178 KB   25 KB   
219 KB   178 KB   25 KB   
223 KB   178 KB   25 KB   
                          
Downloaded: http://repo1.maven.org/maven2/org/codehaus/plexus/plexus-archiver/1.2/plexus-archiver-1.2.jar
(178 KB at 3624.1 KB/sec)
224 KB   25 KB            
227 KB   25 KB   
231 KB   25 KB   
235 KB   25 KB   
239 KB   25 KB   
243 KB   25 KB   
244 KB   25 KB   
248 KB   25 KB   
252 KB   25 KB   
256 KB   25 KB   
260 KB   25 KB   
264 KB   25 KB   
265 KB   25 KB   
269 KB   25 KB   
273 KB   25 KB   
277 KB   25 KB   
281 KB   25 KB   
285 KB   25 KB   
289 KB   25 KB   
290 KB   25 KB   
294 KB   25 KB   
298 KB   25 KB   
302 KB   25 KB   
306 KB   25 KB   
310 KB   25 KB   
314 KB   25 KB   
318 KB   25 KB   
322 KB   25 KB   
326 KB   25 KB   
330 KB   25 KB   
334 KB   25 KB   
338 KB   25 KB   
342 KB   25 KB   
346 KB   25 KB   
350 KB   25 KB   
354 KB   25 KB   
358 KB   25 KB   
361 KB   25 KB   
365 KB   25 KB   
367 KB   25 KB   
371 KB   25 KB   
375 KB   25 KB   
379 KB   25 KB   
383 KB   25 KB   
387 KB   25 KB   
391 KB   25 KB   
395 KB   25 KB   
399 KB   25 KB   
403 KB   25 KB   
407 KB   25 KB   
411 KB   25 KB   
415 KB   25 KB   
419 KB   25 KB   
422 KB   25 KB   
                 
Downloaded: http://repo1.maven.org/maven2/com/thoughtworks/xstream/xstream/1.3.1/xstream-1.3.1.jar
(422 KB at 5771.2 KB/sec)
                 
Downloaded: http://repo1.maven.org/maven2/xpp3/xpp3_min/1.1.4c/xpp3_min-1.1.4c.jar (25 KB
at 195.0 KB/sec)
[INFO] Packaging webapp
[INFO] Assembling webapp [tutorial-rop-server] in [/x1/jenkins/jenkins-slave/workspace/Cayenne-trunk/cayenneTestConnection/HSQLDB/jdk/JDK
1.5 (latest)/label/Ubuntu/trunk/tutorials/tutorial-rop-server/target/tutorial-rop-server-3.2M1-SNAPSHOT]
[INFO] Processing war project
[INFO] Copying webapp resources [/x1/jenkins/jenkins-slave/workspace/Cayenne-trunk/cayenneTestConnection/HSQLDB/jdk/JDK
1.5 (latest)/label/Ubuntu/trunk/tutorials/tutorial-rop-server/src/main/webapp]
[INFO] Webapp assembled in [172 msecs]
[INFO] Building war: /x1/jenkins/jenkins-slave/workspace/Cayenne-trunk/cayenneTestConnection/HSQLDB/jdk/JDK
1.5 (latest)/label/Ubuntu/trunk/tutorials/tutorial-rop-server/target/tutorial-rop-server-3.2M1-SNAPSHOT.war
[INFO] WEB-INF/web.xml already added, skipping
[INFO] 
[INFO] --- maven-install-plugin:2.3.1:install (default-install) @ tutorial-rop-server ---
[INFO] Installing /x1/jenkins/jenkins-slave/workspace/Cayenne-trunk/cayenneTestConnection/HSQLDB/jdk/JDK
1.5 (latest)/label/Ubuntu/trunk/tutorials/tutorial-rop-server/target/tutorial-rop-server-3.2M1-SNAPSHOT.war
to <https://builds.apache.org/job/Cayenne-trunk/./cayenneTestConnection=HSQLDB,jdk=JDK%201.5%20(latest),label=Ubuntu/ws/.repository/org/apache/cayenne/tutorial-rop-server/3.2M1-SNAPSHOT/tutorial-rop-server-3.2M1-SNAPSHOT.war>
[INFO] Installing /x1/jenkins/jenkins-slave/workspace/Cayenne-trunk/cayenneTestConnection/HSQLDB/jdk/JDK
1.5 (latest)/label/Ubuntu/trunk/tutorials/tutorial-rop-server/pom.xml to <https://builds.apache.org/job/Cayenne-trunk/./cayenneTestConnection=HSQLDB,jdk=JDK%201.5%20(latest),label=Ubuntu/ws/.repository/org/apache/cayenne/tutorial-rop-server/3.2M1-SNAPSHOT/tutorial-rop-server-3.2M1-SNAPSHOT.pom>
[INFO]                                                                         
[INFO] ------------------------------------------------------------------------
[INFO] Building Cayenne ROP Client Tutorial 3.2M1-SNAPSHOT
[INFO] ------------------------------------------------------------------------
[INFO] 
[INFO] --- maven-clean-plugin:2.4.1:clean (default-clean) @ tutorial-rop-client ---
[INFO] 
[INFO] --- maven-resources-plugin:2.4.3:resources (default-resources) @ tutorial-rop-client
---
[WARNING] Using platform encoding (ANSI_X3.4-1968 actually) to copy filtered resources, i.e.
build is platform dependent!
[INFO] Copying 1 resource
[INFO] 
[INFO] --- maven-compiler-plugin:2.3.2:compile (default-compile) @ tutorial-rop-client ---
[WARNING] File encoding has not been set, using platform encoding ANSI_X3.4-1968, i.e. build
is platform dependent!
[INFO] Compiling 9 source files to /x1/jenkins/jenkins-slave/workspace/Cayenne-trunk/cayenneTestConnection/HSQLDB/jdk/JDK
1.5 (latest)/label/Ubuntu/trunk/tutorials/tutorial-rop-client/target/classes
[INFO] -------------------------------------------------------------
[ERROR] COMPILATION ERROR : 
[INFO] -------------------------------------------------------------
[ERROR] /x1/jenkins/jenkins-slave/workspace/Cayenne-trunk/cayenneTestConnection/HSQLDB/jdk/JDK
1.5 (latest)/label/Ubuntu/trunk/tutorials/tutorial-rop-client/src/main/java/org/apache/cayenne/tutorial/persistent/client/Main.java:[81,59]
cannot find symbol
symbol  : method from(java.lang.Class<org.apache.cayenne.tutorial.persistent.client.Painting>,<nulltype>)
location: class org.apache.cayenne.query.SelectQuery
[ERROR] /x1/jenkins/jenkins-slave/workspace/Cayenne-trunk/cayenneTestConnection/HSQLDB/jdk/JDK
1.5 (latest)/label/Ubuntu/trunk/tutorials/tutorial-rop-client/src/main/java/org/apache/cayenne/tutorial/persistent/client/Main.java:[86,59]
cannot find symbol
symbol  : method from(java.lang.Class<org.apache.cayenne.tutorial.persistent.client.Painting>,org.apache.cayenne.exp.Expression)
location: class org.apache.cayenne.query.SelectQuery
[ERROR] /x1/jenkins/jenkins-slave/workspace/Cayenne-trunk/cayenneTestConnection/HSQLDB/jdk/JDK
1.5 (latest)/label/Ubuntu/trunk/tutorials/tutorial-rop-client/src/main/java/org/apache/cayenne/tutorial/persistent/client/Main.java:[94,64]
cannot find symbol
symbol  : method from(java.lang.Class<org.apache.cayenne.tutorial.persistent.client.Artist>,org.apache.cayenne.exp.Expression)
location: class org.apache.cayenne.query.SelectQuery
[INFO] 3 errors 
[INFO] -------------------------------------------------------------
[INFO] ------------------------------------------------------------------------
[INFO] Reactor Summary:
[INFO] 
[INFO] Cayenne ........................................... SUCCESS [0.737s]
[INFO] Common Unit Test Utilities ........................ SUCCESS [1.860s]
[INFO] Cayenne Internal Build Plugin ..................... SUCCESS [3.907s]
[INFO] Cayenne Build Tools Parent ........................ SUCCESS [0.021s]
[INFO] Cayenne License and Notice Bundle ................. SUCCESS [3.149s]
[INFO] Cayenne Dependency Injection Container ............ SUCCESS [2.750s]
[INFO] Cayenne Java 1.5 Unpublished ...................... SUCCESS [1:22.957s]
[INFO] Cayenne WebObjects Compatibility Library .......... SUCCESS [2.435s]
[INFO] Cayenne Aggregated Server Jar ..................... SUCCESS [1.808s]
[INFO] Cayenne Aggregated Client Jar ..................... SUCCESS [1.416s]
[INFO] Cayenne Project ................................... SUCCESS [2.328s]
[INFO] Cayenne Tools ..................................... SUCCESS [4.952s]
[INFO] Library: cayenne-lifecycle ........................ SUCCESS [3.416s]
[INFO] Cayenne Maven Plugin .............................. SUCCESS [2.243s]
[INFO] Cayenne Framework Aggregator Project .............. SUCCESS [0.008s]
[INFO] Cayenne Integration Tests Parent .................. SUCCESS [0.017s]
[INFO] Integration Tests - Cayenne Runtime ............... SUCCESS [1.766s]
[INFO] Integration Tests - Cayenne Tools ................. SUCCESS [2.004s]
[INFO] Cayenne Modeler ................................... SUCCESS [9.145s]
[INFO] Cayenne Modeler Maven Plugin ...................... SUCCESS [0.485s]
[INFO] Cayenne Modeler Parent ............................ SUCCESS [0.006s]
[INFO] Cayenne Tutorial .................................. SUCCESS [2.522s]
[INFO] Cayenne ROP Server Tutorial ....................... SUCCESS [2.157s]
[INFO] Cayenne ROP Client Tutorial ....................... FAILURE [0.496s]
[INFO] Cayenne Tutorials ................................. SKIPPED
[INFO] Cayenne Documentation ............................. SKIPPED
[INFO] Cayenne Documenation Parent ....................... SKIPPED
[INFO] Cayenne Docbook Documentation ..................... SKIPPED
[INFO] Docbook: Cayenne Guide ............................ SKIPPED
[INFO] Docbook: Getting Started with Cayenne ............. SKIPPED
[INFO] Docbook: Getting Started with Cayenne ROP ......... SKIPPED
[INFO] Docbook: Cayenne New Features and Upgrade Guide ... SKIPPED
[INFO] ------------------------------------------------------------------------
[INFO] BUILD FAILURE
[INFO] ------------------------------------------------------------------------
[INFO] Total time: 2:14.303s
[INFO] Finished at: Sat Dec 15 14:51:21 GMT 2012
[INFO] Final Memory: 38M/95M
[INFO] ------------------------------------------------------------------------
[ERROR] Failed to execute goal org.apache.maven.plugins:maven-compiler-plugin:2.3.2:compile
(default-compile) on project tutorial-rop-client: Compilation failure: Compilation failure:
[ERROR] /x1/jenkins/jenkins-slave/workspace/Cayenne-trunk/cayenneTestConnection/HSQLDB/jdk/JDK
1.5 (latest)/label/Ubuntu/trunk/tutorials/tutorial-rop-client/src/main/java/org/apache/cayenne/tutorial/persistent/client/Main.java:[81,59]
cannot find symbol
[ERROR] symbol  : method from(java.lang.Class<org.apache.cayenne.tutorial.persistent.client.Painting>,<nulltype>)
[ERROR] location: class org.apache.cayenne.query.SelectQuery
[ERROR] /x1/jenkins/jenkins-slave/workspace/Cayenne-trunk/cayenneTestConnection/HSQLDB/jdk/JDK
1.5 (latest)/label/Ubuntu/trunk/tutorials/tutorial-rop-client/src/main/java/org/apache/cayenne/tutorial/persistent/client/Main.java:[86,59]
cannot find symbol
[ERROR] symbol  : method from(java.lang.Class<org.apache.cayenne.tutorial.persistent.client.Painting>,org.apache.cayenne.exp.Expression)
[ERROR] location: class org.apache.cayenne.query.SelectQuery
[ERROR] /x1/jenkins/jenkins-slave/workspace/Cayenne-trunk/cayenneTestConnection/HSQLDB/jdk/JDK
1.5 (latest)/label/Ubuntu/trunk/tutorials/tutorial-rop-client/src/main/java/org/apache/cayenne/tutorial/persistent/client/Main.java:[94,64]
cannot find symbol
[ERROR] symbol  : method from(java.lang.Class<org.apache.cayenne.tutorial.persistent.client.Artist>,org.apache.cayenne.exp.Expression)
[ERROR] location: class org.apache.cayenne.query.SelectQuery
[ERROR] -> [Help 1]
org.apache.maven.lifecycle.LifecycleExecutionException: Failed to execute goal org.apache.maven.plugins:maven-compiler-plugin:2.3.2:compile
(default-compile) on project tutorial-rop-client: Compilation failure
	at org.apache.maven.lifecycle.internal.MojoExecutor.execute(MojoExecutor.java:213)
	at org.apache.maven.lifecycle.internal.MojoExecutor.execute(MojoExecutor.java:153)
	at org.apache.maven.lifecycle.internal.MojoExecutor.execute(MojoExecutor.java:145)
	at org.apache.maven.lifecycle.internal.LifecycleModuleBuilder.buildProject(LifecycleModuleBuilder.java:84)
	at org.apache.maven.lifecycle.internal.LifecycleModuleBuilder.buildProject(LifecycleModuleBuilder.java:59)
	at org.apache.maven.lifecycle.internal.LifecycleStarter.singleThreadedBuild(LifecycleStarter.java:183)
	at org.apache.maven.lifecycle.internal.LifecycleStarter.execute(LifecycleStarter.java:161)
	at org.apache.maven.DefaultMaven.doExecute(DefaultMaven.java:319)
	at org.apache.maven.DefaultMaven.execute(DefaultMaven.java:156)
	at org.apache.maven.cli.MavenCli.execute(MavenCli.java:537)
	at org.apache.maven.cli.MavenCli.doMain(MavenCli.java:196)
	at org.apache.maven.cli.MavenCli.main(MavenCli.java:141)
	at sun.reflect.NativeMethodAccessorImpl.invoke0(Native Method)
	at sun.reflect.NativeMethodAccessorImpl.invoke(NativeMethodAccessorImpl.java:39)
	at sun.reflect.DelegatingMethodAccessorImpl.invoke(DelegatingMethodAccessorImpl.java:25)
	at java.lang.reflect.Method.invoke(Method.java:592)
	at org.codehaus.plexus.classworlds.launcher.Launcher.launchEnhanced(Launcher.java:290)
	at org.codehaus.plexus.classworlds.launcher.Launcher.launch(Launcher.java:230)
	at org.codehaus.plexus.classworlds.launcher.Launcher.mainWithExitCode(Launcher.java:409)
	at org.codehaus.plexus.classworlds.launcher.Launcher.main(Launcher.java:352)
Caused by: org.apache.maven.plugin.CompilationFailureException: Compilation failure
	at org.apache.maven.plugin.AbstractCompilerMojo.execute(AbstractCompilerMojo.java:656)
	at org.apache.maven.plugin.CompilerMojo.execute(CompilerMojo.java:128)
	at org.apache.maven.plugin.DefaultBuildPluginManager.executeMojo(DefaultBuildPluginManager.java:101)
	at org.apache.maven.lifecycle.internal.MojoExecutor.execute(MojoExecutor.java:209)
	... 19 more
[ERROR] 
[ERROR] Re-run Maven using the -X switch to enable full debug logging.
[ERROR] 
[ERROR] For more information about the errors and possible solutions, please read the following
articles:
[ERROR] [Help 1] http://cwiki.apache.org/confluence/display/MAVEN/MojoFailureException
[ERROR] 
[ERROR] After correcting the problems, you can resume the build with the command
[ERROR]   mvn <goals> -rf :tutorial-rop-client
Build step 'Invoke top-level Maven targets' marked build as failure

Mime
View raw message