cayenne-commits mailing list archives

Site index · List index
Message view « Date » · « Thread »
Top « Date » · « Thread »
From Apache Jenkins Server <jenk...@builds.apache.org>
Subject Build failed in Jenkins: Cayenne-trunk » derby,JDK 1.7 (latest),Ubuntu #912
Date Sun, 21 Jul 2013 16:25:22 GMT
See <https://builds.apache.org/job/Cayenne-trunk/./cayenneTestConnection=derby,jdk=JDK%201.7%20(latest),label=Ubuntu/912/changes>

Changes:

[aadamchik] CAY-1853 Drop java 1.5 support in Cayenne 3.2

[aadamchik] CAY-1853 Drop java 1.5 support in Cayenne 3.2

[aadamchik] CAY-1853 Drop java 1.5 support in Cayenne 3.2

[aadamchik] cleaning up Javadocs configs

[aadamchik] CAY-1853 Drop java 1.5 support in Cayenne 3.2

------------------------------------------
[...truncated 131350 lines...]
[INFO] Generating class file: <https://builds.apache.org/job/Cayenne-trunk/./cayenneTestConnection=derby,jdk=JDK%201.7%20(latest),label=Ubuntu/ws/trunk/itests/cayenne-tools-itest/target/generated-tests/pairs1-client/org/apache/cayenne/testdo/testmap/client/BinaryPKTest1.java>
[INFO] Generating superclass file: <https://builds.apache.org/job/Cayenne-trunk/./cayenneTestConnection=derby,jdk=JDK%201.7%20(latest),label=Ubuntu/ws/trunk/itests/cayenne-tools-itest/target/generated-tests/pairs1-client/org/apache/cayenne/testdo/testmap/client/superart/_BinaryPKTest2.java>
[INFO] Generating class file: <https://builds.apache.org/job/Cayenne-trunk/./cayenneTestConnection=derby,jdk=JDK%201.7%20(latest),label=Ubuntu/ws/trunk/itests/cayenne-tools-itest/target/generated-tests/pairs1-client/org/apache/cayenne/testdo/testmap/client/BinaryPKTest2.java>
[INFO] Generating superclass file: <https://builds.apache.org/job/Cayenne-trunk/./cayenneTestConnection=derby,jdk=JDK%201.7%20(latest),label=Ubuntu/ws/trunk/itests/cayenne-tools-itest/target/generated-tests/pairs1-client/org/apache/cayenne/testdo/testmap/client/superart/_BitNumberTestEntity.java>
[INFO] Generating class file: <https://builds.apache.org/job/Cayenne-trunk/./cayenneTestConnection=derby,jdk=JDK%201.7%20(latest),label=Ubuntu/ws/trunk/itests/cayenne-tools-itest/target/generated-tests/pairs1-client/org/apache/cayenne/testdo/testmap/client/BitNumberTestEntity.java>
[INFO] Generating superclass file: <https://builds.apache.org/job/Cayenne-trunk/./cayenneTestConnection=derby,jdk=JDK%201.7%20(latest),label=Ubuntu/ws/trunk/itests/cayenne-tools-itest/target/generated-tests/pairs1-client/org/apache/cayenne/testdo/testmap/client/superart/_BitTestEntity.java>
[INFO] Generating class file: <https://builds.apache.org/job/Cayenne-trunk/./cayenneTestConnection=derby,jdk=JDK%201.7%20(latest),label=Ubuntu/ws/trunk/itests/cayenne-tools-itest/target/generated-tests/pairs1-client/org/apache/cayenne/testdo/testmap/client/BitTestEntity.java>
[INFO] Generating superclass file: <https://builds.apache.org/job/Cayenne-trunk/./cayenneTestConnection=derby,jdk=JDK%201.7%20(latest),label=Ubuntu/ws/trunk/itests/cayenne-tools-itest/target/generated-tests/pairs1-client/org/apache/cayenne/testdo/testmap/client/superart/_BlobTestEntity.java>
[INFO] Generating class file: <https://builds.apache.org/job/Cayenne-trunk/./cayenneTestConnection=derby,jdk=JDK%201.7%20(latest),label=Ubuntu/ws/trunk/itests/cayenne-tools-itest/target/generated-tests/pairs1-client/org/apache/cayenne/testdo/testmap/client/BlobTestEntity.java>
[INFO] Generating superclass file: <https://builds.apache.org/job/Cayenne-trunk/./cayenneTestConnection=derby,jdk=JDK%201.7%20(latest),label=Ubuntu/ws/trunk/itests/cayenne-tools-itest/target/generated-tests/pairs1-client/org/apache/cayenne/testdo/testmap/client/superart/_BooleanTestEntity.java>
[INFO] Generating class file: <https://builds.apache.org/job/Cayenne-trunk/./cayenneTestConnection=derby,jdk=JDK%201.7%20(latest),label=Ubuntu/ws/trunk/itests/cayenne-tools-itest/target/generated-tests/pairs1-client/org/apache/cayenne/testdo/testmap/client/BooleanTestEntity.java>
[INFO] Generating superclass file: <https://builds.apache.org/job/Cayenne-trunk/./cayenneTestConnection=derby,jdk=JDK%201.7%20(latest),label=Ubuntu/ws/trunk/itests/cayenne-tools-itest/target/generated-tests/pairs1-client/org/apache/cayenne/testdo/testmap/client/superart/_CalendarEntity.java>
[INFO] Generating class file: <https://builds.apache.org/job/Cayenne-trunk/./cayenneTestConnection=derby,jdk=JDK%201.7%20(latest),label=Ubuntu/ws/trunk/itests/cayenne-tools-itest/target/generated-tests/pairs1-client/org/apache/cayenne/testdo/testmap/client/CalendarEntity.java>
[INFO] Generating superclass file: <https://builds.apache.org/job/Cayenne-trunk/./cayenneTestConnection=derby,jdk=JDK%201.7%20(latest),label=Ubuntu/ws/trunk/itests/cayenne-tools-itest/target/generated-tests/pairs1-client/org/apache/cayenne/testdo/testmap/client/superart/_CharFkTestEntity.java>
[INFO] Generating class file: <https://builds.apache.org/job/Cayenne-trunk/./cayenneTestConnection=derby,jdk=JDK%201.7%20(latest),label=Ubuntu/ws/trunk/itests/cayenne-tools-itest/target/generated-tests/pairs1-client/org/apache/cayenne/testdo/testmap/client/CharFkTestEntity.java>
[INFO] Generating superclass file: <https://builds.apache.org/job/Cayenne-trunk/./cayenneTestConnection=derby,jdk=JDK%201.7%20(latest),label=Ubuntu/ws/trunk/itests/cayenne-tools-itest/target/generated-tests/pairs1-client/org/apache/cayenne/testdo/testmap/client/superart/_CharPkTestEntity.java>
[INFO] Generating class file: <https://builds.apache.org/job/Cayenne-trunk/./cayenneTestConnection=derby,jdk=JDK%201.7%20(latest),label=Ubuntu/ws/trunk/itests/cayenne-tools-itest/target/generated-tests/pairs1-client/org/apache/cayenne/testdo/testmap/client/CharPkTestEntity.java>
[INFO] Generating superclass file: <https://builds.apache.org/job/Cayenne-trunk/./cayenneTestConnection=derby,jdk=JDK%201.7%20(latest),label=Ubuntu/ws/trunk/itests/cayenne-tools-itest/target/generated-tests/pairs1-client/org/apache/cayenne/testdo/testmap/client/superart/_CharacterEntity.java>
[INFO] Generating class file: <https://builds.apache.org/job/Cayenne-trunk/./cayenneTestConnection=derby,jdk=JDK%201.7%20(latest),label=Ubuntu/ws/trunk/itests/cayenne-tools-itest/target/generated-tests/pairs1-client/org/apache/cayenne/testdo/testmap/client/CharacterEntity.java>
[INFO] Generating superclass file: <https://builds.apache.org/job/Cayenne-trunk/./cayenneTestConnection=derby,jdk=JDK%201.7%20(latest),label=Ubuntu/ws/trunk/itests/cayenne-tools-itest/target/generated-tests/pairs1-client/org/apache/cayenne/testdo/testmap/client/superart/_ClobTestEntity.java>
[INFO] Generating class file: <https://builds.apache.org/job/Cayenne-trunk/./cayenneTestConnection=derby,jdk=JDK%201.7%20(latest),label=Ubuntu/ws/trunk/itests/cayenne-tools-itest/target/generated-tests/pairs1-client/org/apache/cayenne/testdo/testmap/client/ClobTestEntity.java>
[INFO] Generating superclass file: <https://builds.apache.org/job/Cayenne-trunk/./cayenneTestConnection=derby,jdk=JDK%201.7%20(latest),label=Ubuntu/ws/trunk/itests/cayenne-tools-itest/target/generated-tests/pairs1-client/org/apache/cayenne/testdo/testmap/client/superart/_ClobTestRelation.java>
[INFO] Generating class file: <https://builds.apache.org/job/Cayenne-trunk/./cayenneTestConnection=derby,jdk=JDK%201.7%20(latest),label=Ubuntu/ws/trunk/itests/cayenne-tools-itest/target/generated-tests/pairs1-client/org/apache/cayenne/testdo/testmap/client/ClobTestRelation.java>
[INFO] Generating superclass file: <https://builds.apache.org/job/Cayenne-trunk/./cayenneTestConnection=derby,jdk=JDK%201.7%20(latest),label=Ubuntu/ws/trunk/itests/cayenne-tools-itest/target/generated-tests/pairs1-client/org/apache/cayenne/testdo/testmap/client/superart/_CompoundFkTestEntity.java>
[INFO] Generating class file: <https://builds.apache.org/job/Cayenne-trunk/./cayenneTestConnection=derby,jdk=JDK%201.7%20(latest),label=Ubuntu/ws/trunk/itests/cayenne-tools-itest/target/generated-tests/pairs1-client/org/apache/cayenne/testdo/testmap/client/CompoundFkTestEntity.java>
[INFO] Generating superclass file: <https://builds.apache.org/job/Cayenne-trunk/./cayenneTestConnection=derby,jdk=JDK%201.7%20(latest),label=Ubuntu/ws/trunk/itests/cayenne-tools-itest/target/generated-tests/pairs1-client/org/apache/cayenne/testdo/testmap/client/superart/_CompoundPainting.java>
[INFO] Generating class file: <https://builds.apache.org/job/Cayenne-trunk/./cayenneTestConnection=derby,jdk=JDK%201.7%20(latest),label=Ubuntu/ws/trunk/itests/cayenne-tools-itest/target/generated-tests/pairs1-client/org/apache/cayenne/testdo/testmap/client/CompoundPainting.java>
[INFO] Generating superclass file: <https://builds.apache.org/job/Cayenne-trunk/./cayenneTestConnection=derby,jdk=JDK%201.7%20(latest),label=Ubuntu/ws/trunk/itests/cayenne-tools-itest/target/generated-tests/pairs1-client/org/apache/cayenne/testdo/testmap/client/superart/_CompoundPkTestEntity.java>
[INFO] Generating class file: <https://builds.apache.org/job/Cayenne-trunk/./cayenneTestConnection=derby,jdk=JDK%201.7%20(latest),label=Ubuntu/ws/trunk/itests/cayenne-tools-itest/target/generated-tests/pairs1-client/org/apache/cayenne/testdo/testmap/client/CompoundPkTestEntity.java>
[INFO] Generating superclass file: <https://builds.apache.org/job/Cayenne-trunk/./cayenneTestConnection=derby,jdk=JDK%201.7%20(latest),label=Ubuntu/ws/trunk/itests/cayenne-tools-itest/target/generated-tests/pairs1-client/org/apache/cayenne/testdo/testmap/client/superart/_DateTestEntity.java>
[INFO] Generating class file: <https://builds.apache.org/job/Cayenne-trunk/./cayenneTestConnection=derby,jdk=JDK%201.7%20(latest),label=Ubuntu/ws/trunk/itests/cayenne-tools-itest/target/generated-tests/pairs1-client/org/apache/cayenne/testdo/testmap/client/DateTestEntity.java>
[INFO] Generating superclass file: <https://builds.apache.org/job/Cayenne-trunk/./cayenneTestConnection=derby,jdk=JDK%201.7%20(latest),label=Ubuntu/ws/trunk/itests/cayenne-tools-itest/target/generated-tests/pairs1-client/org/apache/cayenne/testdo/testmap/client/superart/_DecimalPKTest1.java>
[INFO] Generating class file: <https://builds.apache.org/job/Cayenne-trunk/./cayenneTestConnection=derby,jdk=JDK%201.7%20(latest),label=Ubuntu/ws/trunk/itests/cayenne-tools-itest/target/generated-tests/pairs1-client/org/apache/cayenne/testdo/testmap/client/DecimalPKTest1.java>
[INFO] Generating superclass file: <https://builds.apache.org/job/Cayenne-trunk/./cayenneTestConnection=derby,jdk=JDK%201.7%20(latest),label=Ubuntu/ws/trunk/itests/cayenne-tools-itest/target/generated-tests/pairs1-client/org/apache/cayenne/testdo/testmap/client/superart/_DecimalPKTestEntity.java>
[INFO] Generating class file: <https://builds.apache.org/job/Cayenne-trunk/./cayenneTestConnection=derby,jdk=JDK%201.7%20(latest),label=Ubuntu/ws/trunk/itests/cayenne-tools-itest/target/generated-tests/pairs1-client/org/apache/cayenne/testdo/testmap/client/DecimalPKTestEntity.java>
[INFO] Generating superclass file: <https://builds.apache.org/job/Cayenne-trunk/./cayenneTestConnection=derby,jdk=JDK%201.7%20(latest),label=Ubuntu/ws/trunk/itests/cayenne-tools-itest/target/generated-tests/pairs1-client/org/apache/cayenne/testdo/testmap/client/superart/_EnumEntity.java>
[INFO] Generating class file: <https://builds.apache.org/job/Cayenne-trunk/./cayenneTestConnection=derby,jdk=JDK%201.7%20(latest),label=Ubuntu/ws/trunk/itests/cayenne-tools-itest/target/generated-tests/pairs1-client/org/apache/cayenne/testdo/testmap/client/EnumEntity.java>
[INFO] Generating superclass file: <https://builds.apache.org/job/Cayenne-trunk/./cayenneTestConnection=derby,jdk=JDK%201.7%20(latest),label=Ubuntu/ws/trunk/itests/cayenne-tools-itest/target/generated-tests/pairs1-client/org/apache/cayenne/testdo/testmap/client/superart/_Exhibit.java>
[INFO] Generating class file: <https://builds.apache.org/job/Cayenne-trunk/./cayenneTestConnection=derby,jdk=JDK%201.7%20(latest),label=Ubuntu/ws/trunk/itests/cayenne-tools-itest/target/generated-tests/pairs1-client/org/apache/cayenne/testdo/testmap/client/Exhibit.java>
[INFO] Generating superclass file: <https://builds.apache.org/job/Cayenne-trunk/./cayenneTestConnection=derby,jdk=JDK%201.7%20(latest),label=Ubuntu/ws/trunk/itests/cayenne-tools-itest/target/generated-tests/pairs1-client/org/apache/cayenne/testdo/testmap/client/superart/_ExtendedTypeEntity.java>
[INFO] Generating class file: <https://builds.apache.org/job/Cayenne-trunk/./cayenneTestConnection=derby,jdk=JDK%201.7%20(latest),label=Ubuntu/ws/trunk/itests/cayenne-tools-itest/target/generated-tests/pairs1-client/org/apache/cayenne/testdo/testmap/client/ExtendedTypeEntity.java>
[INFO] Generating superclass file: <https://builds.apache.org/job/Cayenne-trunk/./cayenneTestConnection=derby,jdk=JDK%201.7%20(latest),label=Ubuntu/ws/trunk/itests/cayenne-tools-itest/target/generated-tests/pairs1-client/org/apache/cayenne/testdo/testmap/client/superart/_Gallery.java>
[INFO] Generating class file: <https://builds.apache.org/job/Cayenne-trunk/./cayenneTestConnection=derby,jdk=JDK%201.7%20(latest),label=Ubuntu/ws/trunk/itests/cayenne-tools-itest/target/generated-tests/pairs1-client/org/apache/cayenne/testdo/testmap/client/Gallery.java>
[INFO] Generating superclass file: <https://builds.apache.org/job/Cayenne-trunk/./cayenneTestConnection=derby,jdk=JDK%201.7%20(latest),label=Ubuntu/ws/trunk/itests/cayenne-tools-itest/target/generated-tests/pairs1-client/org/apache/cayenne/testdo/testmap/client/superart/_GeneratedColumnCompKey.java>
[INFO] Generating class file: <https://builds.apache.org/job/Cayenne-trunk/./cayenneTestConnection=derby,jdk=JDK%201.7%20(latest),label=Ubuntu/ws/trunk/itests/cayenne-tools-itest/target/generated-tests/pairs1-client/org/apache/cayenne/testdo/testmap/client/GeneratedColumnCompKey.java>
[INFO] Generating superclass file: <https://builds.apache.org/job/Cayenne-trunk/./cayenneTestConnection=derby,jdk=JDK%201.7%20(latest),label=Ubuntu/ws/trunk/itests/cayenne-tools-itest/target/generated-tests/pairs1-client/org/apache/cayenne/testdo/testmap/client/superart/_GeneratedColumnCompMaster.java>
[INFO] Generating class file: <https://builds.apache.org/job/Cayenne-trunk/./cayenneTestConnection=derby,jdk=JDK%201.7%20(latest),label=Ubuntu/ws/trunk/itests/cayenne-tools-itest/target/generated-tests/pairs1-client/org/apache/cayenne/testdo/testmap/client/GeneratedColumnCompMaster.java>
[INFO] Generating superclass file: <https://builds.apache.org/job/Cayenne-trunk/./cayenneTestConnection=derby,jdk=JDK%201.7%20(latest),label=Ubuntu/ws/trunk/itests/cayenne-tools-itest/target/generated-tests/pairs1-client/org/apache/cayenne/testdo/testmap/client/superart/_GeneratedColumnDep.java>
[INFO] Generating class file: <https://builds.apache.org/job/Cayenne-trunk/./cayenneTestConnection=derby,jdk=JDK%201.7%20(latest),label=Ubuntu/ws/trunk/itests/cayenne-tools-itest/target/generated-tests/pairs1-client/org/apache/cayenne/testdo/testmap/client/GeneratedColumnDep.java>
[INFO] Generating superclass file: <https://builds.apache.org/job/Cayenne-trunk/./cayenneTestConnection=derby,jdk=JDK%201.7%20(latest),label=Ubuntu/ws/trunk/itests/cayenne-tools-itest/target/generated-tests/pairs1-client/org/apache/cayenne/testdo/testmap/client/superart/_GeneratedColumnTest2.java>
[INFO] Generating class file: <https://builds.apache.org/job/Cayenne-trunk/./cayenneTestConnection=derby,jdk=JDK%201.7%20(latest),label=Ubuntu/ws/trunk/itests/cayenne-tools-itest/target/generated-tests/pairs1-client/org/apache/cayenne/testdo/testmap/client/GeneratedColumnTest2.java>
[INFO] Generating superclass file: <https://builds.apache.org/job/Cayenne-trunk/./cayenneTestConnection=derby,jdk=JDK%201.7%20(latest),label=Ubuntu/ws/trunk/itests/cayenne-tools-itest/target/generated-tests/pairs1-client/org/apache/cayenne/testdo/testmap/client/superart/_GeneratedColumnTestEntity.java>
[INFO] Generating class file: <https://builds.apache.org/job/Cayenne-trunk/./cayenneTestConnection=derby,jdk=JDK%201.7%20(latest),label=Ubuntu/ws/trunk/itests/cayenne-tools-itest/target/generated-tests/pairs1-client/org/apache/cayenne/testdo/testmap/client/GeneratedColumnTestEntity.java>
[INFO] Generating superclass file: <https://builds.apache.org/job/Cayenne-trunk/./cayenneTestConnection=derby,jdk=JDK%201.7%20(latest),label=Ubuntu/ws/trunk/itests/cayenne-tools-itest/target/generated-tests/pairs1-client/org/apache/cayenne/testdo/testmap/client/superart/_GeneratedF1.java>
[INFO] Generating class file: <https://builds.apache.org/job/Cayenne-trunk/./cayenneTestConnection=derby,jdk=JDK%201.7%20(latest),label=Ubuntu/ws/trunk/itests/cayenne-tools-itest/target/generated-tests/pairs1-client/org/apache/cayenne/testdo/testmap/client/GeneratedF1.java>
[INFO] Generating superclass file: <https://builds.apache.org/job/Cayenne-trunk/./cayenneTestConnection=derby,jdk=JDK%201.7%20(latest),label=Ubuntu/ws/trunk/itests/cayenne-tools-itest/target/generated-tests/pairs1-client/org/apache/cayenne/testdo/testmap/client/superart/_GeneratedF2.java>
[INFO] Generating class file: <https://builds.apache.org/job/Cayenne-trunk/./cayenneTestConnection=derby,jdk=JDK%201.7%20(latest),label=Ubuntu/ws/trunk/itests/cayenne-tools-itest/target/generated-tests/pairs1-client/org/apache/cayenne/testdo/testmap/client/GeneratedF2.java>
[INFO] Generating superclass file: <https://builds.apache.org/job/Cayenne-trunk/./cayenneTestConnection=derby,jdk=JDK%201.7%20(latest),label=Ubuntu/ws/trunk/itests/cayenne-tools-itest/target/generated-tests/pairs1-client/org/apache/cayenne/testdo/testmap/client/superart/_LongEntity.java>
[INFO] Generating class file: <https://builds.apache.org/job/Cayenne-trunk/./cayenneTestConnection=derby,jdk=JDK%201.7%20(latest),label=Ubuntu/ws/trunk/itests/cayenne-tools-itest/target/generated-tests/pairs1-client/org/apache/cayenne/testdo/testmap/client/LongEntity.java>
[INFO] Generating superclass file: <https://builds.apache.org/job/Cayenne-trunk/./cayenneTestConnection=derby,jdk=JDK%201.7%20(latest),label=Ubuntu/ws/trunk/itests/cayenne-tools-itest/target/generated-tests/pairs1-client/org/apache/cayenne/testdo/testmap/client/superart/_MeaningfulGeneratedColumnTestEntity.java>
[INFO] Generating class file: <https://builds.apache.org/job/Cayenne-trunk/./cayenneTestConnection=derby,jdk=JDK%201.7%20(latest),label=Ubuntu/ws/trunk/itests/cayenne-tools-itest/target/generated-tests/pairs1-client/org/apache/cayenne/testdo/testmap/client/MeaningfulGeneratedColumnTestEntity.java>
[INFO] Generating superclass file: <https://builds.apache.org/job/Cayenne-trunk/./cayenneTestConnection=derby,jdk=JDK%201.7%20(latest),label=Ubuntu/ws/trunk/itests/cayenne-tools-itest/target/generated-tests/pairs1-client/org/apache/cayenne/testdo/testmap/client/superart/_MeaningfulPKDep.java>
[INFO] Generating class file: <https://builds.apache.org/job/Cayenne-trunk/./cayenneTestConnection=derby,jdk=JDK%201.7%20(latest),label=Ubuntu/ws/trunk/itests/cayenne-tools-itest/target/generated-tests/pairs1-client/org/apache/cayenne/testdo/testmap/client/MeaningfulPKDep.java>
[INFO] Generating superclass file: <https://builds.apache.org/job/Cayenne-trunk/./cayenneTestConnection=derby,jdk=JDK%201.7%20(latest),label=Ubuntu/ws/trunk/itests/cayenne-tools-itest/target/generated-tests/pairs1-client/org/apache/cayenne/testdo/testmap/client/superart/_MeaningfulPKTest1.java>
[INFO] Generating class file: <https://builds.apache.org/job/Cayenne-trunk/./cayenneTestConnection=derby,jdk=JDK%201.7%20(latest),label=Ubuntu/ws/trunk/itests/cayenne-tools-itest/target/generated-tests/pairs1-client/org/apache/cayenne/testdo/testmap/client/MeaningfulPKTest1.java>
[INFO] Generating superclass file: <https://builds.apache.org/job/Cayenne-trunk/./cayenneTestConnection=derby,jdk=JDK%201.7%20(latest),label=Ubuntu/ws/trunk/itests/cayenne-tools-itest/target/generated-tests/pairs1-client/org/apache/cayenne/testdo/testmap/client/superart/_MixedPersistenceStrategy.java>
[INFO] Generating class file: <https://builds.apache.org/job/Cayenne-trunk/./cayenneTestConnection=derby,jdk=JDK%201.7%20(latest),label=Ubuntu/ws/trunk/itests/cayenne-tools-itest/target/generated-tests/pairs1-client/org/apache/cayenne/testdo/testmap/client/MixedPersistenceStrategy.java>
[INFO] Generating superclass file: <https://builds.apache.org/job/Cayenne-trunk/./cayenneTestConnection=derby,jdk=JDK%201.7%20(latest),label=Ubuntu/ws/trunk/itests/cayenne-tools-itest/target/generated-tests/pairs1-client/org/apache/cayenne/testdo/testmap/client/superart/_MixedPersistenceStrategy2.java>
[INFO] Generating class file: <https://builds.apache.org/job/Cayenne-trunk/./cayenneTestConnection=derby,jdk=JDK%201.7%20(latest),label=Ubuntu/ws/trunk/itests/cayenne-tools-itest/target/generated-tests/pairs1-client/org/apache/cayenne/testdo/testmap/client/MixedPersistenceStrategy2.java>
[INFO] Generating superclass file: <https://builds.apache.org/job/Cayenne-trunk/./cayenneTestConnection=derby,jdk=JDK%201.7%20(latest),label=Ubuntu/ws/trunk/itests/cayenne-tools-itest/target/generated-tests/pairs1-client/org/apache/cayenne/testdo/testmap/client/superart/_NoPkTestEntity.java>
[INFO] Generating class file: <https://builds.apache.org/job/Cayenne-trunk/./cayenneTestConnection=derby,jdk=JDK%201.7%20(latest),label=Ubuntu/ws/trunk/itests/cayenne-tools-itest/target/generated-tests/pairs1-client/org/apache/cayenne/testdo/testmap/client/NoPkTestEntity.java>
[INFO] Generating superclass file: <https://builds.apache.org/job/Cayenne-trunk/./cayenneTestConnection=derby,jdk=JDK%201.7%20(latest),label=Ubuntu/ws/trunk/itests/cayenne-tools-itest/target/generated-tests/pairs1-client/org/apache/cayenne/testdo/testmap/client/superart/_Painting.java>
[INFO] Generating class file: <https://builds.apache.org/job/Cayenne-trunk/./cayenneTestConnection=derby,jdk=JDK%201.7%20(latest),label=Ubuntu/ws/trunk/itests/cayenne-tools-itest/target/generated-tests/pairs1-client/org/apache/cayenne/testdo/testmap/client/Painting.java>
[INFO] Generating superclass file: <https://builds.apache.org/job/Cayenne-trunk/./cayenneTestConnection=derby,jdk=JDK%201.7%20(latest),label=Ubuntu/ws/trunk/itests/cayenne-tools-itest/target/generated-tests/pairs1-client/org/apache/cayenne/testdo/testmap/client/superart/_Painting1.java>
[INFO] Generating class file: <https://builds.apache.org/job/Cayenne-trunk/./cayenneTestConnection=derby,jdk=JDK%201.7%20(latest),label=Ubuntu/ws/trunk/itests/cayenne-tools-itest/target/generated-tests/pairs1-client/org/apache/cayenne/testdo/testmap/client/Painting1.java>
[INFO] Generating superclass file: <https://builds.apache.org/job/Cayenne-trunk/./cayenneTestConnection=derby,jdk=JDK%201.7%20(latest),label=Ubuntu/ws/trunk/itests/cayenne-tools-itest/target/generated-tests/pairs1-client/org/apache/cayenne/testdo/testmap/client/superart/_PaintingInfo.java>
[INFO] Generating class file: <https://builds.apache.org/job/Cayenne-trunk/./cayenneTestConnection=derby,jdk=JDK%201.7%20(latest),label=Ubuntu/ws/trunk/itests/cayenne-tools-itest/target/generated-tests/pairs1-client/org/apache/cayenne/testdo/testmap/client/PaintingInfo.java>
[INFO] Generating superclass file: <https://builds.apache.org/job/Cayenne-trunk/./cayenneTestConnection=derby,jdk=JDK%201.7%20(latest),label=Ubuntu/ws/trunk/itests/cayenne-tools-itest/target/generated-tests/pairs1-client/org/apache/cayenne/testdo/testmap/client/superart/_PrimitivesTestEntity.java>
[INFO] Generating class file: <https://builds.apache.org/job/Cayenne-trunk/./cayenneTestConnection=derby,jdk=JDK%201.7%20(latest),label=Ubuntu/ws/trunk/itests/cayenne-tools-itest/target/generated-tests/pairs1-client/org/apache/cayenne/testdo/testmap/client/PrimitivesTestEntity.java>
[INFO] Generating superclass file: <https://builds.apache.org/job/Cayenne-trunk/./cayenneTestConnection=derby,jdk=JDK%201.7%20(latest),label=Ubuntu/ws/trunk/itests/cayenne-tools-itest/target/generated-tests/pairs1-client/org/apache/cayenne/testdo/testmap/client/superart/_ROArtist.java>
[INFO] Generating class file: <https://builds.apache.org/job/Cayenne-trunk/./cayenneTestConnection=derby,jdk=JDK%201.7%20(latest),label=Ubuntu/ws/trunk/itests/cayenne-tools-itest/target/generated-tests/pairs1-client/org/apache/cayenne/testdo/testmap/client/ROArtist.java>
[INFO] Generating superclass file: <https://builds.apache.org/job/Cayenne-trunk/./cayenneTestConnection=derby,jdk=JDK%201.7%20(latest),label=Ubuntu/ws/trunk/itests/cayenne-tools-itest/target/generated-tests/pairs1-client/org/apache/cayenne/testdo/testmap/client/superart/_ROPainting.java>
[INFO] Generating class file: <https://builds.apache.org/job/Cayenne-trunk/./cayenneTestConnection=derby,jdk=JDK%201.7%20(latest),label=Ubuntu/ws/trunk/itests/cayenne-tools-itest/target/generated-tests/pairs1-client/org/apache/cayenne/testdo/testmap/client/ROPainting.java>
[INFO] Generating superclass file: <https://builds.apache.org/job/Cayenne-trunk/./cayenneTestConnection=derby,jdk=JDK%201.7%20(latest),label=Ubuntu/ws/trunk/itests/cayenne-tools-itest/target/generated-tests/pairs1-client/org/apache/cayenne/testdo/testmap/client/superart/_RWCompoundPainting.java>
[INFO] Generating class file: <https://builds.apache.org/job/Cayenne-trunk/./cayenneTestConnection=derby,jdk=JDK%201.7%20(latest),label=Ubuntu/ws/trunk/itests/cayenne-tools-itest/target/generated-tests/pairs1-client/org/apache/cayenne/testdo/testmap/client/RWCompoundPainting.java>
[INFO] Generating superclass file: <https://builds.apache.org/job/Cayenne-trunk/./cayenneTestConnection=derby,jdk=JDK%201.7%20(latest),label=Ubuntu/ws/trunk/itests/cayenne-tools-itest/target/generated-tests/pairs1-client/org/apache/cayenne/testdo/testmap/client/superart/_ReturnTypesMap1.java>
[INFO] Generating class file: <https://builds.apache.org/job/Cayenne-trunk/./cayenneTestConnection=derby,jdk=JDK%201.7%20(latest),label=Ubuntu/ws/trunk/itests/cayenne-tools-itest/target/generated-tests/pairs1-client/org/apache/cayenne/testdo/testmap/client/ReturnTypesMap1.java>
[INFO] Generating superclass file: <https://builds.apache.org/job/Cayenne-trunk/./cayenneTestConnection=derby,jdk=JDK%201.7%20(latest),label=Ubuntu/ws/trunk/itests/cayenne-tools-itest/target/generated-tests/pairs1-client/org/apache/cayenne/testdo/testmap/client/superart/_ReturnTypesMap2.java>
[INFO] Generating class file: <https://builds.apache.org/job/Cayenne-trunk/./cayenneTestConnection=derby,jdk=JDK%201.7%20(latest),label=Ubuntu/ws/trunk/itests/cayenne-tools-itest/target/generated-tests/pairs1-client/org/apache/cayenne/testdo/testmap/client/ReturnTypesMap2.java>
[INFO] Generating superclass file: <https://builds.apache.org/job/Cayenne-trunk/./cayenneTestConnection=derby,jdk=JDK%201.7%20(latest),label=Ubuntu/ws/trunk/itests/cayenne-tools-itest/target/generated-tests/pairs1-client/org/apache/cayenne/testdo/testmap/client/superart/_SerializableEntity.java>
[INFO] Generating class file: <https://builds.apache.org/job/Cayenne-trunk/./cayenneTestConnection=derby,jdk=JDK%201.7%20(latest),label=Ubuntu/ws/trunk/itests/cayenne-tools-itest/target/generated-tests/pairs1-client/org/apache/cayenne/testdo/testmap/client/SerializableEntity.java>
[INFO] Generating superclass file: <https://builds.apache.org/job/Cayenne-trunk/./cayenneTestConnection=derby,jdk=JDK%201.7%20(latest),label=Ubuntu/ws/trunk/itests/cayenne-tools-itest/target/generated-tests/pairs1-client/org/apache/cayenne/testdo/testmap/client/superart/_SmallintTestEntity.java>
[INFO] Generating class file: <https://builds.apache.org/job/Cayenne-trunk/./cayenneTestConnection=derby,jdk=JDK%201.7%20(latest),label=Ubuntu/ws/trunk/itests/cayenne-tools-itest/target/generated-tests/pairs1-client/org/apache/cayenne/testdo/testmap/client/SmallintTestEntity.java>
[INFO] Generating superclass file: <https://builds.apache.org/job/Cayenne-trunk/./cayenneTestConnection=derby,jdk=JDK%201.7%20(latest),label=Ubuntu/ws/trunk/itests/cayenne-tools-itest/target/generated-tests/pairs1-client/org/apache/cayenne/testdo/testmap/client/superart/_SubPainting.java>
[INFO] Generating class file: <https://builds.apache.org/job/Cayenne-trunk/./cayenneTestConnection=derby,jdk=JDK%201.7%20(latest),label=Ubuntu/ws/trunk/itests/cayenne-tools-itest/target/generated-tests/pairs1-client/org/apache/cayenne/testdo/testmap/client/SubPainting.java>
[INFO] Generating superclass file: <https://builds.apache.org/job/Cayenne-trunk/./cayenneTestConnection=derby,jdk=JDK%201.7%20(latest),label=Ubuntu/ws/trunk/itests/cayenne-tools-itest/target/generated-tests/pairs1-client/org/apache/cayenne/testdo/testmap/client/superart/_TinyintTestEntity.java>
[INFO] Generating class file: <https://builds.apache.org/job/Cayenne-trunk/./cayenneTestConnection=derby,jdk=JDK%201.7%20(latest),label=Ubuntu/ws/trunk/itests/cayenne-tools-itest/target/generated-tests/pairs1-client/org/apache/cayenne/testdo/testmap/client/TinyintTestEntity.java>
[INFO] Generating superclass file: <https://builds.apache.org/job/Cayenne-trunk/./cayenneTestConnection=derby,jdk=JDK%201.7%20(latest),label=Ubuntu/ws/trunk/itests/cayenne-tools-itest/target/generated-tests/pairs1-client/org/apache/cayenne/testdo/testmap/client/superart/_UuidTestEntity.java>
[INFO] Generating class file: <https://builds.apache.org/job/Cayenne-trunk/./cayenneTestConnection=derby,jdk=JDK%201.7%20(latest),label=Ubuntu/ws/trunk/itests/cayenne-tools-itest/target/generated-tests/pairs1-client/org/apache/cayenne/testdo/testmap/client/UuidTestEntity.java>
[INFO] Generating superclass file: <https://builds.apache.org/job/Cayenne-trunk/./cayenneTestConnection=derby,jdk=JDK%201.7%20(latest),label=Ubuntu/ws/trunk/itests/cayenne-tools-itest/target/generated-tests/pairs1-client/org/apache/cayenne/testdo/testmap/client/superart/_TestmapClient.java>
[INFO] Generating class file: <https://builds.apache.org/job/Cayenne-trunk/./cayenneTestConnection=derby,jdk=JDK%201.7%20(latest),label=Ubuntu/ws/trunk/itests/cayenne-tools-itest/target/generated-tests/pairs1-client/org/apache/cayenne/testdo/testmap/client/TestmapClient.java>
[INFO] 
[INFO] --- maven-cayenne-plugin:3.2M2-SNAPSHOT:cgen (pairs-embeddables3) @ cayenne-tools-itest
---
[INFO] Generating superclass file: <https://builds.apache.org/job/Cayenne-trunk/./cayenneTestConnection=derby,jdk=JDK%201.7%20(latest),label=Ubuntu/ws/trunk/itests/cayenne-tools-itest/target/generated-tests/pairs-embeddables3/org/apache/cayenne/testdo/embeddable/auto/_EmbedEntity1.java>
[INFO] Generating class file: <https://builds.apache.org/job/Cayenne-trunk/./cayenneTestConnection=derby,jdk=JDK%201.7%20(latest),label=Ubuntu/ws/trunk/itests/cayenne-tools-itest/target/generated-tests/pairs-embeddables3/org/apache/cayenne/testdo/embeddable/EmbedEntity1.java>
[INFO] Generating superclass file: <https://builds.apache.org/job/Cayenne-trunk/./cayenneTestConnection=derby,jdk=JDK%201.7%20(latest),label=Ubuntu/ws/trunk/itests/cayenne-tools-itest/target/generated-tests/pairs-embeddables3/org/apache/cayenne/testdo/embeddable/auto/_Embeddable1.java>
[INFO] Generating class file: <https://builds.apache.org/job/Cayenne-trunk/./cayenneTestConnection=derby,jdk=JDK%201.7%20(latest),label=Ubuntu/ws/trunk/itests/cayenne-tools-itest/target/generated-tests/pairs-embeddables3/org/apache/cayenne/testdo/embeddable/Embeddable1.java>
[INFO] 
[INFO] --- maven-resources-plugin:2.4.3:resources (default-resources) @ cayenne-tools-itest
---
[INFO] Using 'UTF-8' encoding to copy filtered resources.
[INFO] skip non existing resourceDirectory <https://builds.apache.org/job/Cayenne-trunk/./cayenneTestConnection=derby,jdk=JDK%201.7%20(latest),label=Ubuntu/ws/trunk/itests/cayenne-tools-itest/src/main/resources>
[INFO] 
[INFO] --- maven-compiler-plugin:2.3.2:compile (default-compile) @ cayenne-tools-itest ---
[INFO] No sources to compile
[INFO] 
[INFO] --- maven-resources-plugin:2.4.3:testResources (default-testResources) @ cayenne-tools-itest
---
[INFO] Using 'UTF-8' encoding to copy filtered resources.
[INFO] Copying 7 resources
[INFO] 
[INFO] --- maven-compiler-plugin:2.3.2:testCompile (default-testCompile) @ cayenne-tools-itest
---
[WARNING] File encoding has not been set, using platform encoding ANSI_X3.4-1968, i.e. build
is platform dependent!
[INFO] Compiling 1 source file to <https://builds.apache.org/job/Cayenne-trunk/./cayenneTestConnection=derby,jdk=JDK%201.7%20(latest),label=Ubuntu/ws/trunk/itests/cayenne-tools-itest/target/test-classes>
[INFO] 
[INFO] --- maven-surefire-plugin:2.5:test (default-test) @ cayenne-tools-itest ---
[INFO] Surefire report directory: <https://builds.apache.org/job/Cayenne-trunk/./cayenneTestConnection=derby,jdk=JDK%201.7%20(latest),label=Ubuntu/ws/trunk/itests/cayenne-tools-itest/target/surefire-reports>

-------------------------------------------------------
 T E S T S
-------------------------------------------------------
Running org.apache.cayenne.tools.CayenneGeneratorIntegrationTest
Tests run: 8, Failures: 0, Errors: 0, Skipped: 0, Time elapsed: 0.037 sec

Results :

Tests run: 8, Failures: 0, Errors: 0, Skipped: 0

[INFO] 
[INFO] --- maven-jar-plugin:2.3.2:jar (default-jar) @ cayenne-tools-itest ---
[WARNING] JAR will be empty - no content was marked for inclusion!
[INFO] Building jar: <https://builds.apache.org/job/Cayenne-trunk/./cayenneTestConnection=derby,jdk=JDK%201.7%20(latest),label=Ubuntu/ws/trunk/itests/cayenne-tools-itest/target/cayenne-tools-itest-3.2M2-SNAPSHOT.jar>
[INFO] 
[INFO] --- maven-install-plugin:2.3.1:install (default-install) @ cayenne-tools-itest ---
[INFO] Installing <https://builds.apache.org/job/Cayenne-trunk/./cayenneTestConnection=derby,jdk=JDK%201.7%20(latest),label=Ubuntu/ws/trunk/itests/cayenne-tools-itest/target/cayenne-tools-itest-3.2M2-SNAPSHOT.jar>
to <https://builds.apache.org/job/Cayenne-trunk/./cayenneTestConnection=derby,jdk=JDK%201.7%20(latest),label=Ubuntu/ws/.repository/org/apache/cayenne/itests/cayenne-tools-itest/3.2M2-SNAPSHOT/cayenne-tools-itest-3.2M2-SNAPSHOT.jar>
[INFO] Installing <https://builds.apache.org/job/Cayenne-trunk/./cayenneTestConnection=derby,jdk=JDK%201.7%20(latest),label=Ubuntu/ws/trunk/itests/cayenne-tools-itest/pom.xml>
to <https://builds.apache.org/job/Cayenne-trunk/./cayenneTestConnection=derby,jdk=JDK%201.7%20(latest),label=Ubuntu/ws/.repository/org/apache/cayenne/itests/cayenne-tools-itest/3.2M2-SNAPSHOT/cayenne-tools-itest-3.2M2-SNAPSHOT.pom>
[INFO]                                                                         
[INFO] ------------------------------------------------------------------------
[INFO] Building Cayenne Modeler 3.2M2-SNAPSHOT
[INFO] ------------------------------------------------------------------------
[INFO] 
[INFO] --- maven-clean-plugin:2.4.1:clean (default-clean) @ cayenne-modeler ---
[INFO] 
[INFO] --- maven-resources-plugin:2.4.3:resources (default-resources) @ cayenne-modeler ---
[INFO] Using 'UTF-8' encoding to copy filtered resources.
[INFO] Copying 57 resources
[INFO] 
[INFO] --- maven-remote-resources-plugin:1.2:process (default) @ cayenne-modeler ---
[INFO] 
[INFO] --- maven-compiler-plugin:2.3.2:compile (default-compile) @ cayenne-modeler ---
[WARNING] File encoding has not been set, using platform encoding ANSI_X3.4-1968, i.e. build
is platform dependent!
[INFO] Compiling 466 source files to <https://builds.apache.org/job/Cayenne-trunk/./cayenneTestConnection=derby,jdk=JDK%201.7%20(latest),label=Ubuntu/ws/trunk/modeler/cayenne-modeler/target/classes>
[INFO] -------------------------------------------------------------
[ERROR] COMPILATION ERROR : 
[INFO] -------------------------------------------------------------
[ERROR] <https://builds.apache.org/job/Cayenne-trunk/./cayenneTestConnection=derby,jdk=JDK%201.7%20(latest),label=Ubuntu/ws/trunk/modeler/cayenne-modeler/src/main/java/org/apache/cayenne/modeler/editor/datanode/AdapterEditor.java>:[60,25]
error: unmappable character for encoding ASCII
[ERROR] <https://builds.apache.org/job/Cayenne-trunk/./cayenneTestConnection=derby,jdk=JDK%201.7%20(latest),label=Ubuntu/ws/trunk/modeler/cayenne-modeler/src/main/java/org/apache/cayenne/modeler/editor/datanode/AdapterEditor.java>:[60,26]
error: unmappable character for encoding ASCII
[INFO] 2 errors 
[INFO] -------------------------------------------------------------
[INFO] ------------------------------------------------------------------------
[INFO] Reactor Summary:
[INFO] 
[INFO] Cayenne ........................................... SUCCESS [1.852s]
[INFO] Common Unit Test Utilities ........................ SUCCESS [6.876s]
[INFO] Cayenne Internal Build Plugin ..................... SUCCESS [7.894s]
[INFO] Cayenne Build Tools Parent ........................ SUCCESS [0.061s]
[INFO] Cayenne License and Notice Bundle ................. SUCCESS [1.608s]
[INFO] Cayenne Dependency Injection Container ............ SUCCESS [2.811s]
[INFO] Cayenne Core Unpublished .......................... SUCCESS [1:30.929s]
[INFO] Cayenne WebObjects Compatibility Library .......... SUCCESS [3.336s]
[INFO] Cayenne Aggregated Server Jar ..................... SUCCESS [2.232s]
[INFO] Cayenne Aggregated Client Jar ..................... SUCCESS [1.686s]
[INFO] Cayenne Project ................................... SUCCESS [4.027s]
[INFO] Cayenne Tools ..................................... SUCCESS [7.643s]
[INFO] Library: cayenne-lifecycle ........................ SUCCESS [5.027s]
[INFO] Cayenne Maven Plugin .............................. SUCCESS [4.214s]
[INFO] Cayenne Framework Aggregator Project .............. SUCCESS [0.035s]
[INFO] Cayenne Integration Tests Parent .................. SUCCESS [0.085s]
[INFO] Integration Tests - Cayenne Tools ................. SUCCESS [3.073s]
[INFO] Cayenne Modeler ................................... FAILURE [2.907s]
[INFO] Cayenne Modeler Maven Plugin ...................... SKIPPED
[INFO] Cayenne Modeler Parent ............................ SKIPPED
[INFO] Cayenne Tutorial .................................. SKIPPED
[INFO] Cayenne ROP Server Tutorial ....................... SKIPPED
[INFO] Cayenne ROP Client Tutorial ....................... SKIPPED
[INFO] Cayenne Tutorials ................................. SKIPPED
[INFO] Cayenne Documentation ............................. SKIPPED
[INFO] Cayenne Documenation Parent ....................... SKIPPED
[INFO] Cayenne Docbook Documentation ..................... SKIPPED
[INFO] Docbook: Cayenne Stylesheets ...................... SKIPPED
[INFO] Docbook: Cayenne Guide ............................ SKIPPED
[INFO] Docbook: Getting Started with Cayenne ............. SKIPPED
[INFO] Docbook: Getting Started with Cayenne ROP ......... SKIPPED
[INFO] Docbook: Cayenne New Features and Upgrade Guide ... SKIPPED
[INFO] ------------------------------------------------------------------------
[INFO] BUILD FAILURE
[INFO] ------------------------------------------------------------------------
[INFO] Total time: 2:29.727s
[INFO] Finished at: Sun Jul 21 16:25:21 UTC 2013
[INFO] Final Memory: 95M/241M
[INFO] ------------------------------------------------------------------------
[ERROR] Failed to execute goal org.apache.maven.plugins:maven-compiler-plugin:2.3.2:compile
(default-compile) on project cayenne-modeler: Compilation failure: Compilation failure:
[ERROR] <https://builds.apache.org/job/Cayenne-trunk/./cayenneTestConnection=derby,jdk=JDK%201.7%20(latest),label=Ubuntu/ws/trunk/modeler/cayenne-modeler/src/main/java/org/apache/cayenne/modeler/editor/datanode/AdapterEditor.java>:[60,25]
error: unmappable character for encoding ASCII
[ERROR] <https://builds.apache.org/job/Cayenne-trunk/./cayenneTestConnection=derby,jdk=JDK%201.7%20(latest),label=Ubuntu/ws/trunk/modeler/cayenne-modeler/src/main/java/org/apache/cayenne/modeler/editor/datanode/AdapterEditor.java>:[60,26]
error: unmappable character for encoding ASCII
[ERROR] -> [Help 1]
org.apache.maven.lifecycle.LifecycleExecutionException: Failed to execute goal org.apache.maven.plugins:maven-compiler-plugin:2.3.2:compile
(default-compile) on project cayenne-modeler: Compilation failure
	at org.apache.maven.lifecycle.internal.MojoExecutor.execute(MojoExecutor.java:213)
	at org.apache.maven.lifecycle.internal.MojoExecutor.execute(MojoExecutor.java:153)
	at org.apache.maven.lifecycle.internal.MojoExecutor.execute(MojoExecutor.java:145)
	at org.apache.maven.lifecycle.internal.LifecycleModuleBuilder.buildProject(LifecycleModuleBuilder.java:84)
	at org.apache.maven.lifecycle.internal.LifecycleModuleBuilder.buildProject(LifecycleModuleBuilder.java:59)
	at org.apache.maven.lifecycle.internal.LifecycleStarter.singleThreadedBuild(LifecycleStarter.java:183)
	at org.apache.maven.lifecycle.internal.LifecycleStarter.execute(LifecycleStarter.java:161)
	at org.apache.maven.DefaultMaven.doExecute(DefaultMaven.java:320)
	at org.apache.maven.DefaultMaven.execute(DefaultMaven.java:156)
	at org.apache.maven.cli.MavenCli.execute(MavenCli.java:537)
	at org.apache.maven.cli.MavenCli.doMain(MavenCli.java:196)
	at org.apache.maven.cli.MavenCli.main(MavenCli.java:141)
	at sun.reflect.NativeMethodAccessorImpl.invoke0(Native Method)
	at sun.reflect.NativeMethodAccessorImpl.invoke(NativeMethodAccessorImpl.java:57)
	at sun.reflect.DelegatingMethodAccessorImpl.invoke(DelegatingMethodAccessorImpl.java:43)
	at java.lang.reflect.Method.invoke(Method.java:601)
	at org.codehaus.plexus.classworlds.launcher.Launcher.launchEnhanced(Launcher.java:290)
	at org.codehaus.plexus.classworlds.launcher.Launcher.launch(Launcher.java:230)
	at org.codehaus.plexus.classworlds.launcher.Launcher.mainWithExitCode(Launcher.java:409)
	at org.codehaus.plexus.classworlds.launcher.Launcher.main(Launcher.java:352)
Caused by: org.apache.maven.plugin.CompilationFailureException: Compilation failure
	at org.apache.maven.plugin.AbstractCompilerMojo.execute(AbstractCompilerMojo.java:656)
	at org.apache.maven.plugin.CompilerMojo.execute(CompilerMojo.java:128)
	at org.apache.maven.plugin.DefaultBuildPluginManager.executeMojo(DefaultBuildPluginManager.java:101)
	at org.apache.maven.lifecycle.internal.MojoExecutor.execute(MojoExecutor.java:209)
	... 19 more
[ERROR] 
[ERROR] Re-run Maven using the -X switch to enable full debug logging.
[ERROR] 
[ERROR] For more information about the errors and possible solutions, please read the following
articles:
[ERROR] [Help 1] http://cwiki.apache.org/confluence/display/MAVEN/MojoFailureException
[ERROR] 
[ERROR] After correcting the problems, you can resume the build with the command
[ERROR]   mvn <goals> -rf :cayenne-modeler
Build step 'Invoke top-level Maven targets' marked build as failure

Mime
View raw message