cayenne-commits mailing list archives

Site index · List index
Message view « Date » · « Thread »
Top « Date » · « Thread »
From Apache Jenkins Server <jenk...@builds.apache.org>
Subject Build failed in Jenkins: Cayenne-30 » JDK 1.5 (latest),Ubuntu #157
Date Tue, 09 Jul 2013 20:28:44 GMT
See <https://builds.apache.org/job/Cayenne-30/./jdk=JDK%201.5%20(latest),label=Ubuntu/157/changes>

Changes:

[aadamchik] CAY-1845  Upgrade javadoc plugin to 2.9.1

[aadamchik] CAY-1845  Upgrade javadoc plugin to 2.9.1

------------------------------------------
[...truncated 72343 lines...]
[INFO] Copying 4 resources
[INFO] [compiler:compile {execution: default-compile}]
[INFO] Compiling 106 source files to <https://builds.apache.org/job/Cayenne-30/./jdk=JDK%201.5%20(latest),label=Ubuntu/ws/STABLE-3.0/framework/cayenne-jpa-unpublished/target/classes>
[INFO] [resources:testResources {execution: default-testResources}]
[INFO] Using 'UTF-8' encoding to copy filtered resources.
[INFO] Copying 9 resources
[INFO] [compiler:testCompile {execution: default-testCompile}]
[INFO] Compiling 77 source files to <https://builds.apache.org/job/Cayenne-30/./jdk=JDK%201.5%20(latest),label=Ubuntu/ws/STABLE-3.0/framework/cayenne-jpa-unpublished/target/test-classes>
[INFO] [surefire:test {execution: default-test}]
[INFO] Surefire report directory: <https://builds.apache.org/job/Cayenne-30/./jdk=JDK%201.5%20(latest),label=Ubuntu/ws/STABLE-3.0/framework/cayenne-jpa-unpublished/target/surefire-reports>

-------------------------------------------------------
 T E S T S
-------------------------------------------------------
Running org.apache.cayenne.jpa.map.JpaRelationshipTest
Tests run: 1, Failures: 0, Errors: 0, Skipped: 0, Time elapsed: 0.025 sec
Running org.apache.cayenne.jpa.TestPersistenceProvider2
Tests run: 0, Failures: 0, Errors: 0, Skipped: 0, Time elapsed: 0.005 sec
Running org.apache.cayenne.jpa.ResourceLocalEntityManagerFactoryTest
Tests run: 1, Failures: 0, Errors: 0, Skipped: 0, Time elapsed: 0.006 sec
Running org.apache.cayenne.jpa.conf.EntityMapDefaultsProcessor1Test
Tests run: 2, Failures: 0, Errors: 0, Skipped: 0, Time elapsed: 0.105 sec
Running org.apache.cayenne.jpa.ResourceLocalEntityManagerTest
Tests run: 3, Failures: 0, Errors: 0, Skipped: 0, Time elapsed: 0.01 sec
Running org.apache.cayenne.jpa.TestManagedClass
Tests run: 0, Failures: 0, Errors: 0, Skipped: 0, Time elapsed: 0.002 sec
Running org.apache.cayenne.jpa.conf.EntityMapXMLLoaderTest
Tests run: 2, Failures: 0, Errors: 0, Skipped: 0, Time elapsed: 0.384 sec
Running org.apache.cayenne.jpa.conf.UnitDescriptorParserTest
Tests run: 7, Failures: 0, Errors: 0, Skipped: 0, Time elapsed: 0.035 sec
Running org.apache.cayenne.jpa.conf.ClassAnnotationProcessorFactoryTest
Tests run: 1, Failures: 0, Errors: 0, Skipped: 0, Time elapsed: 0.002 sec
Running org.apache.cayenne.jpa.conf.AnnotationProcessorFactoryTest
Tests run: 2, Failures: 0, Errors: 0, Skipped: 0, Time elapsed: 0.003 sec
Running org.apache.cayenne.jpa.map.JpaClassDescriptorTest
Tests run: 4, Failures: 0, Errors: 0, Skipped: 0, Time elapsed: 0.005 sec
Running org.apache.cayenne.jpa.map.JpaColumnTest
Tests run: 1, Failures: 0, Errors: 0, Skipped: 0, Time elapsed: 0.003 sec
Running org.apache.cayenne.jpa.ProviderTest
Jul 9, 2013 8:28:15 PM org.apache.cayenne.jpa.Provider createEntityManagerFactory
INFO: Extra PersistenceUnitInfo properties: {}
Jul 9, 2013 8:28:15 PM org.apache.cayenne.jpa.Provider createContainerEntityManagerFactory
WARNING: NULL JTA DataSource returned from PersistenceUnitInfo
Jul 9, 2013 8:28:15 PM org.apache.cayenne.jpa.Provider createContainerEntityManagerFactory
INFO: Extra container PersistenceUnitInfo properties: {}
Jul 9, 2013 8:28:15 PM org.apache.cayenne.jpa.Provider createContainerEntityManagerFactory
WARNING: NULL JTA DataSource returned from PersistenceUnitInfo
Jul 9, 2013 8:28:15 PM org.apache.cayenne.jpa.Provider createContainerEntityManagerFactory
INFO: Extra container PersistenceUnitInfo properties: {}
Jul 9, 2013 8:28:15 PM org.apache.cayenne.jpa.Provider createContainerEntityManagerFactory
WARNING: NULL non-JTA DataSource returned from PersistenceUnitInfo
Jul 9, 2013 8:28:15 PM org.apache.cayenne.jpa.Provider createContainerEntityManagerFactory
INFO: Extra container PersistenceUnitInfo properties: {javax.persistence.transactionType=RESOURCE_LOCAL}
Jul 9, 2013 8:28:15 PM org.apache.cayenne.jpa.Provider createContainerEntityManagerFactory
WARNING: NULL non-JTA DataSource returned from PersistenceUnitInfo
Jul 9, 2013 8:28:15 PM org.apache.cayenne.jpa.Provider createContainerEntityManagerFactory
INFO: Extra container PersistenceUnitInfo properties: {javax.persistence.transactionType=JTA}
Jul 9, 2013 8:28:15 PM org.apache.cayenne.jpa.Provider createContainerEntityManagerFactory
WARNING: NULL JTA DataSource returned from PersistenceUnitInfo
Tests run: 2, Failures: 0, Errors: 0, Skipped: 0, Time elapsed: 0.124 sec
Running org.apache.cayenne.jpa.map.EntityMapTraversalTest
Tests run: 1, Failures: 0, Errors: 0, Skipped: 0, Time elapsed: 0.004 sec
Running org.apache.cayenne.jpa.bridge.DataMapConverterTest
Tests run: 8, Failures: 0, Errors: 0, Skipped: 0, Time elapsed: 0.084 sec
Running org.apache.cayenne.jpa.JpaUnitTest
Tests run: 3, Failures: 0, Errors: 0, Skipped: 0, Time elapsed: 0.004 sec
Running org.apache.cayenne.jpa.conf.EntityMapDefaultsProcessorTest
Tests run: 6, Failures: 0, Errors: 0, Skipped: 0, Time elapsed: 0.02 sec
Running org.apache.cayenne.util.BaseTreeVisitorTest
Tests run: 1, Failures: 0, Errors: 0, Skipped: 0, Time elapsed: 0.01 sec
Running org.apache.cayenne.jpa.bridge.QueryHintsTest
Tests run: 1, Failures: 0, Errors: 0, Skipped: 0, Time elapsed: 0.003 sec
Running org.apache.cayenne.jpa.TestPersistenceProvider1
Tests run: 0, Failures: 0, Errors: 0, Skipped: 0, Time elapsed: 0.002 sec
Running org.apache.cayenne.jpa.bridge.DataMapConverterRelationshipsTest
Tests run: 2, Failures: 0, Errors: 0, Skipped: 0, Time elapsed: 0.017 sec
Running org.apache.cayenne.jpa.map.JpaTableTest
Tests run: 1, Failures: 0, Errors: 0, Skipped: 0, Time elapsed: 0.002 sec
Running org.apache.cayenne.jpa.conf.EntityMapAnnotationLoaderTest
Tests run: 4, Failures: 0, Errors: 0, Skipped: 0, Time elapsed: 0.108 sec
Running org.apache.cayenne.jpa.JpaNativeQueryTest
Tests run: 2, Failures: 0, Errors: 0, Skipped: 0, Time elapsed: 0.025 sec

Results :

Tests run: 55, Failures: 0, Errors: 0, Skipped: 0

[INFO] [jar:jar {execution: default-jar}]
[INFO] Building jar: <https://builds.apache.org/job/Cayenne-30/./jdk=JDK%201.5%20(latest),label=Ubuntu/ws/STABLE-3.0/framework/cayenne-jpa-unpublished/target/cayenne-jpa-unpublished-3.0-SNAPSHOT.jar>
[INFO] Preparing source:jar
[WARNING] Removing: jar from forked lifecycle, to prevent recursive invocation.
[INFO] No goals needed for project - skipping
[INFO] [source:jar {execution: bundle-source-jar}]
[INFO] Building jar: <https://builds.apache.org/job/Cayenne-30/./jdk=JDK%201.5%20(latest),label=Ubuntu/ws/STABLE-3.0/framework/cayenne-jpa-unpublished/target/cayenne-jpa-unpublished-3.0-SNAPSHOT-sources.jar>
[INFO] [install:install {execution: default-install}]
[INFO] Installing <https://builds.apache.org/job/Cayenne-30/./jdk=JDK%201.5%20(latest),label=Ubuntu/ws/STABLE-3.0/framework/cayenne-jpa-unpublished/target/cayenne-jpa-unpublished-3.0-SNAPSHOT.jar>
to /home/jenkins/.m2/repository/org/apache/cayenne/unpublished/cayenne-jpa-unpublished/3.0-SNAPSHOT/cayenne-jpa-unpublished-3.0-SNAPSHOT.jar
[INFO] Installing <https://builds.apache.org/job/Cayenne-30/./jdk=JDK%201.5%20(latest),label=Ubuntu/ws/STABLE-3.0/framework/cayenne-jpa-unpublished/target/cayenne-jpa-unpublished-3.0-SNAPSHOT-sources.jar>
to /home/jenkins/.m2/repository/org/apache/cayenne/unpublished/cayenne-jpa-unpublished/3.0-SNAPSHOT/cayenne-jpa-unpublished-3.0-SNAPSHOT-sources.jar
[INFO] ------------------------------------------------------------------------
[INFO] Building Cayenne Enhancer Bootstrap Agent
[INFO]    task-segment: [clean, install]
[INFO] ------------------------------------------------------------------------
[INFO] artifact org.apache.maven.plugins:maven-remote-resources-plugin: checking for updates
from objectstyle
[INFO] [clean:clean {execution: default-clean}]
[INFO] Deleting directory <https://builds.apache.org/job/Cayenne-30/./jdk=JDK%201.5%20(latest),label=Ubuntu/ws/STABLE-3.0/framework/cayenne-agent/target>
[INFO] [resources:resources {execution: default-resources}]
[INFO] Using 'UTF-8' encoding to copy filtered resources.
[INFO] Copying 1 resource
-----------------------------------------------------
this realm = app0.child-container[org.apache.maven.plugins:maven-remote-resources-plugin:1.5-SNAPSHOT]
urls[0] = file:/home/jenkins/.m2/repository/org/apache/maven/plugins/maven-remote-resources-plugin/1.5-SNAPSHOT/maven-remote-resources-plugin-1.5-SNAPSHOT.jar
urls[1] = file:/home/jenkins/.m2/repository/org/codehaus/plexus/plexus-utils/1.1/plexus-utils-1.1.jar
urls[2] = file:/home/jenkins/.m2/repository/org/codehaus/plexus/plexus-interpolation/1.12/plexus-interpolation-1.12.jar
urls[3] = file:/home/jenkins/.m2/repository/org/apache/maven/shared/maven-artifact-resolver/1.0/maven-artifact-resolver-1.0.jar
urls[4] = file:/home/jenkins/.m2/repository/org/apache/maven/shared/maven-common-artifact-filters/1.4/maven-common-artifact-filters-1.4.jar
urls[5] = file:/home/jenkins/.m2/repository/org/apache/maven/shared/maven-filtering/1.1/maven-filtering-1.1.jar
urls[6] = file:/home/jenkins/.m2/repository/org/sonatype/plexus/plexus-build-api/0.0.4/plexus-build-api-0.0.4.jar
urls[7] = file:/home/jenkins/.m2/repository/org/codehaus/plexus/plexus-resources/1.0-alpha-7/plexus-resources-1.0-alpha-7.jar
urls[8] = file:/home/jenkins/.m2/repository/org/apache/velocity/velocity/1.7/velocity-1.7.jar
urls[9] = file:/home/jenkins/.m2/repository/commons-collections/commons-collections/3.2.1/commons-collections-3.2.1.jar
urls[10] = file:/home/jenkins/.m2/repository/commons-lang/commons-lang/2.4/commons-lang-2.4.jar
Number of imports: 10
import: org.codehaus.classworlds.Entry@a6c57a42
import: org.codehaus.classworlds.Entry@12f43f3b
import: org.codehaus.classworlds.Entry@20025374
import: org.codehaus.classworlds.Entry@f8e44ca4
import: org.codehaus.classworlds.Entry@92758522
import: org.codehaus.classworlds.Entry@ebf2705b
import: org.codehaus.classworlds.Entry@bb25e54
import: org.codehaus.classworlds.Entry@bece5185
import: org.codehaus.classworlds.Entry@3fee8e37
import: org.codehaus.classworlds.Entry@3fee19d8


this realm = plexus.core
urls[0] = file:/home/hudson/tools/maven/apache-maven-2.2.1/lib/maven-2.2.1-uber.jar
Number of imports: 10
import: org.codehaus.classworlds.Entry@a6c57a42
import: org.codehaus.classworlds.Entry@12f43f3b
import: org.codehaus.classworlds.Entry@20025374
import: org.codehaus.classworlds.Entry@f8e44ca4
import: org.codehaus.classworlds.Entry@92758522
import: org.codehaus.classworlds.Entry@ebf2705b
import: org.codehaus.classworlds.Entry@bb25e54
import: org.codehaus.classworlds.Entry@bece5185
import: org.codehaus.classworlds.Entry@3fee8e37
import: org.codehaus.classworlds.Entry@3fee19d8
-----------------------------------------------------
[INFO] ------------------------------------------------------------------------
[ERROR] BUILD ERROR
[INFO] ------------------------------------------------------------------------
[INFO] Internal error in the plugin manager executing goal 'org.apache.maven.plugins:maven-remote-resources-plugin:1.5-SNAPSHOT:process':
Unable to load the mojo 'org.apache.maven.plugins:maven-remote-resources-plugin:1.5-SNAPSHOT:process'
in the plugin 'org.apache.maven.plugins:maven-remote-resources-plugin'. A required class is
missing: org/codehaus/plexus/util/Scanner
[INFO] ------------------------------------------------------------------------
[INFO] Trace
org.apache.maven.lifecycle.LifecycleExecutionException: Internal error in the plugin manager
executing goal 'org.apache.maven.plugins:maven-remote-resources-plugin:1.5-SNAPSHOT:process':
Unable to load the mojo 'org.apache.maven.plugins:maven-remote-resources-plugin:1.5-SNAPSHOT:process'
in the plugin 'org.apache.maven.plugins:maven-remote-resources-plugin'. A required class is
missing: org/codehaus/plexus/util/Scanner
	at org.apache.maven.lifecycle.DefaultLifecycleExecutor.executeGoals(DefaultLifecycleExecutor.java:698)
	at org.apache.maven.lifecycle.DefaultLifecycleExecutor.executeGoalWithLifecycle(DefaultLifecycleExecutor.java:556)
	at org.apache.maven.lifecycle.DefaultLifecycleExecutor.executeGoal(DefaultLifecycleExecutor.java:535)
	at org.apache.maven.lifecycle.DefaultLifecycleExecutor.executeGoalAndHandleFailures(DefaultLifecycleExecutor.java:387)
	at org.apache.maven.lifecycle.DefaultLifecycleExecutor.executeTaskSegments(DefaultLifecycleExecutor.java:348)
	at org.apache.maven.lifecycle.DefaultLifecycleExecutor.execute(DefaultLifecycleExecutor.java:180)
	at org.apache.maven.DefaultMaven.doExecute(DefaultMaven.java:328)
	at org.apache.maven.DefaultMaven.execute(DefaultMaven.java:138)
	at org.apache.maven.cli.MavenCli.main(MavenCli.java:362)
	at org.apache.maven.cli.compat.CompatibleMain.main(CompatibleMain.java:60)
	at sun.reflect.NativeMethodAccessorImpl.invoke0(Native Method)
	at sun.reflect.NativeMethodAccessorImpl.invoke(NativeMethodAccessorImpl.java:39)
	at sun.reflect.DelegatingMethodAccessorImpl.invoke(DelegatingMethodAccessorImpl.java:25)
	at java.lang.reflect.Method.invoke(Method.java:592)
	at org.codehaus.classworlds.Launcher.launchEnhanced(Launcher.java:315)
	at org.codehaus.classworlds.Launcher.launch(Launcher.java:255)
	at org.codehaus.classworlds.Launcher.mainWithExitCode(Launcher.java:430)
	at org.codehaus.classworlds.Launcher.main(Launcher.java:375)
Caused by: org.apache.maven.plugin.PluginManagerException: Unable to load the mojo 'org.apache.maven.plugins:maven-remote-resources-plugin:1.5-SNAPSHOT:process'
in the plugin 'org.apache.maven.plugins:maven-remote-resources-plugin'. A required class is
missing: org/codehaus/plexus/util/Scanner
	at org.apache.maven.plugin.DefaultPluginManager.getConfiguredMojo(DefaultPluginManager.java:669)
	at org.apache.maven.plugin.DefaultPluginManager.executeMojo(DefaultPluginManager.java:468)
	at org.apache.maven.lifecycle.DefaultLifecycleExecutor.executeGoals(DefaultLifecycleExecutor.java:694)
	... 17 more
Caused by: org.codehaus.plexus.component.repository.exception.ComponentLookupException: Unable
to lookup component 'org.apache.maven.plugin.Mojoorg.apache.maven.plugins:maven-remote-resources-plugin:1.5-SNAPSHOT:process',
it could not be started
	at org.codehaus.plexus.DefaultPlexusContainer.lookup(DefaultPlexusContainer.java:339)
	at org.codehaus.plexus.DefaultPlexusContainer.lookup(DefaultPlexusContainer.java:440)
	at org.apache.maven.plugin.DefaultPluginManager.getConfiguredMojo(DefaultPluginManager.java:652)
	... 19 more
Caused by: org.codehaus.plexus.component.repository.exception.ComponentLifecycleException:
Error starting component
	at org.codehaus.plexus.component.manager.AbstractComponentManager.startComponentLifecycle(AbstractComponentManager.java:109)
	at org.codehaus.plexus.component.manager.AbstractComponentManager.createComponentInstance(AbstractComponentManager.java:95)
	at org.codehaus.plexus.component.manager.PerLookupComponentManager.getComponent(PerLookupComponentManager.java:48)
	at org.codehaus.plexus.DefaultPlexusContainer.lookup(DefaultPlexusContainer.java:331)
	... 21 more
Caused by: org.codehaus.plexus.personality.plexus.lifecycle.phase.PhaseExecutionException:
Error composing component
	at org.codehaus.plexus.personality.plexus.lifecycle.phase.CompositionPhase.execute(CompositionPhase.java:33)
	at org.codehaus.plexus.lifecycle.AbstractLifecycleHandler.start(AbstractLifecycleHandler.java:101)
	at org.codehaus.plexus.component.manager.AbstractComponentManager.startComponentLifecycle(AbstractComponentManager.java:105)
	... 24 more
Caused by: org.codehaus.plexus.component.composition.CompositionException: Composition failed
of field fileFilter in object of type org.apache.maven.plugin.resources.remote.ProcessRemoteResourcesMojo
because the requirement ComponentRequirement{role='org.apache.maven.shared.filtering.MavenFileFilter',
roleHint='null', fieldName='fileFilter'} was missing
	at org.codehaus.plexus.component.composition.FieldComponentComposer.assignRequirementToField(FieldComponentComposer.java:154)
	at org.codehaus.plexus.component.composition.FieldComponentComposer.assembleComponent(FieldComponentComposer.java:73)
	at org.codehaus.plexus.component.composition.DefaultComponentComposerManager.assembleComponent(DefaultComponentComposerManager.java:68)
	at org.codehaus.plexus.DefaultPlexusContainer.composeComponent(DefaultPlexusContainer.java:1486)
	at org.codehaus.plexus.personality.plexus.lifecycle.phase.CompositionPhase.execute(CompositionPhase.java:29)
	... 26 more
Caused by: org.codehaus.plexus.component.repository.exception.ComponentLookupException: Unable
to lookup component 'org.apache.maven.shared.filtering.MavenFileFilter', it could not be started
	at org.codehaus.plexus.DefaultPlexusContainer.lookup(DefaultPlexusContainer.java:339)
	at org.codehaus.plexus.component.composition.FieldComponentComposer.assignRequirementToField(FieldComponentComposer.java:129)
	... 30 more
Caused by: org.codehaus.plexus.component.repository.exception.ComponentLifecycleException:
Error starting component
	at org.codehaus.plexus.component.manager.AbstractComponentManager.startComponentLifecycle(AbstractComponentManager.java:109)
	at org.codehaus.plexus.component.manager.AbstractComponentManager.createComponentInstance(AbstractComponentManager.java:95)
	at org.codehaus.plexus.component.manager.ClassicSingletonComponentManager.getComponent(ClassicSingletonComponentManager.java:92)
	at org.codehaus.plexus.DefaultPlexusContainer.lookup(DefaultPlexusContainer.java:331)
	... 31 more
Caused by: org.codehaus.plexus.personality.plexus.lifecycle.phase.PhaseExecutionException:
Error composing component
	at org.codehaus.plexus.personality.plexus.lifecycle.phase.CompositionPhase.execute(CompositionPhase.java:33)
	at org.codehaus.plexus.lifecycle.AbstractLifecycleHandler.start(AbstractLifecycleHandler.java:101)
	at org.codehaus.plexus.component.manager.AbstractComponentManager.startComponentLifecycle(AbstractComponentManager.java:105)
	... 34 more
Caused by: org.codehaus.plexus.component.composition.CompositionException: Composition failed
of field buildContext in object of type org.apache.maven.shared.filtering.DefaultMavenFileFilter
because the requirement ComponentRequirement{role='org.sonatype.plexus.build.incremental.BuildContext',
roleHint='', fieldName='buildContext'} was missing
	at org.codehaus.plexus.component.composition.FieldComponentComposer.assignRequirementToField(FieldComponentComposer.java:154)
	at org.codehaus.plexus.component.composition.FieldComponentComposer.assembleComponent(FieldComponentComposer.java:73)
	at org.codehaus.plexus.component.composition.DefaultComponentComposerManager.assembleComponent(DefaultComponentComposerManager.java:68)
	at org.codehaus.plexus.DefaultPlexusContainer.composeComponent(DefaultPlexusContainer.java:1486)
	at org.codehaus.plexus.personality.plexus.lifecycle.phase.CompositionPhase.execute(CompositionPhase.java:29)
	... 36 more
Caused by: org.codehaus.plexus.component.repository.exception.ComponentLookupException: Unable
to lookup component 'org.sonatype.plexus.build.incremental.BuildContext', it could not be
created
	at org.codehaus.plexus.DefaultPlexusContainer.lookup(DefaultPlexusContainer.java:335)
	at org.codehaus.plexus.component.composition.FieldComponentComposer.assignRequirementToField(FieldComponentComposer.java:129)
	... 40 more
Caused by: org.codehaus.plexus.component.factory.ComponentInstantiationException: Could not
instanciate component: role: 'org.sonatype.plexus.build.incremental.BuildContext', implementation:
'org.sonatype.plexus.build.incremental.DefaultBuildContext', role hint: 'default'
	at org.codehaus.plexus.component.factory.java.JavaComponentFactory.makeException(JavaComponentFactory.java:77)
	at org.codehaus.plexus.component.factory.java.JavaComponentFactory.newInstance(JavaComponentFactory.java:62)
	at org.codehaus.plexus.DefaultPlexusContainer.createComponentInstance(DefaultPlexusContainer.java:1464)
	at org.codehaus.plexus.component.manager.AbstractComponentManager.createComponentInstance(AbstractComponentManager.java:93)
	at org.codehaus.plexus.component.manager.ClassicSingletonComponentManager.getComponent(ClassicSingletonComponentManager.java:92)
	at org.codehaus.plexus.DefaultPlexusContainer.lookup(DefaultPlexusContainer.java:331)
	... 41 more
Caused by: java.lang.NoClassDefFoundError: org/codehaus/plexus/util/Scanner
	at java.lang.Class.getDeclaredConstructors0(Native Method)
	at java.lang.Class.privateGetDeclaredConstructors(Class.java:2357)
	at java.lang.Class.getConstructor0(Class.java:2671)
	at java.lang.Class.newInstance0(Class.java:321)
	at java.lang.Class.newInstance(Class.java:303)
	at org.codehaus.plexus.component.factory.java.JavaComponentFactory.newInstance(JavaComponentFactory.java:44)
	... 45 more
[INFO] ------------------------------------------------------------------------
[INFO] Total time: 1 minute 26 seconds
[INFO] Finished at: Tue Jul 09 20:28:18 UTC 2013
[INFO] Final Memory: 61M/338M
[INFO] ------------------------------------------------------------------------
Build step 'Invoke top-level Maven targets' marked build as failure
Recording test results

Mime
View raw message