cayenne-commits mailing list archives

Site index · List index
Message view « Date » · « Thread »
Top « Date » · « Thread »
From Apache Jenkins Server <jenk...@builds.apache.org>
Subject Build failed in Jenkins: Cayenne-31 » derby,JDK 1.5 (latest),Ubuntu #87
Date Sun, 05 Jan 2014 16:28:44 GMT
See <https://builds.apache.org/job/Cayenne-31/cayenneTestConnection=derby,jdk=JDK%201.5%20(latest),label=Ubuntu/87/changes>

Changes:

[aadamchik] Using only major version in docs metadata

otherwise Google is confused how to find docs for a given v. of Cayenne
(oops..)

[aadamchik] transferring old ROP docs

(cherry picked from commit 5d383c42f415554dda9f2f1c0a7ac1fcaaffa5fd)

[aadamchik] renaming rop chapters to start with rop-

(cherry picked from commit c878e990e4e966238055da2ca168a114fc9f3c05)

[aadamchik] updating copyright year

(cherry picked from commit ac5207877e4e6ac22f6a15ff9d2e2116011a7497)

[aadamchik] replacing confluence-style waring blocks with 'note' docbook sections

(cherry picked from commit 8364f945de5e0198372e885c0af41d5840f42dec)

[aadamchik] Using only major version in docs metadata

otherwise Google is confused how to find docs for a given v. of Cayenne

(cherry picked from commit 212afab6627714e8db6061af980db663489994ce)

------------------------------------------
[...truncated 125458 lines...]
[INFO] See /x1/jenkins/jenkins-slave/workspace/Cayenne-31/cayenneTestConnection/derby/jdk/JDK
1.5 (latest)/label/Ubuntu/stable/docs/docbook/getting-started/target/site/index for generated
file(s)
[INFO] Executing tasks
     [copy] Copying 2 files to /x1/jenkins/jenkins-slave/workspace/Cayenne-31/cayenneTestConnection/derby/jdk/JDK
1.5 (latest)/label/Ubuntu/stable/docs/docbook/getting-started/target/site/index/css
     [copy] Copying 13 files to /x1/jenkins/jenkins-slave/workspace/Cayenne-31/cayenneTestConnection/derby/jdk/JDK
1.5 (latest)/label/Ubuntu/stable/docs/docbook/getting-started/target/site/index/images
[INFO] Executed tasks
[INFO] 
[INFO] --- maven-antrun-plugin:1.7:run (cleanup-maven) @ getting-started ---
[INFO] Executing tasks

main:
[INFO] Executed tasks
[INFO] 
[INFO] --- maven-resources-plugin:2.4.3:resources (default-resources) @ getting-started ---
[INFO] Using 'UTF-8' encoding to copy filtered resources.
[INFO] Copying 30 resources
[INFO] 
[INFO] --- maven-compiler-plugin:2.3.2:compile (default-compile) @ getting-started ---
[INFO] No sources to compile
[INFO] 
[INFO] --- maven-resources-plugin:2.4.3:testResources (default-testResources) @ getting-started
---
[INFO] Using 'UTF-8' encoding to copy filtered resources.
[INFO] skip non existing resourceDirectory /x1/jenkins/jenkins-slave/workspace/Cayenne-31/cayenneTestConnection/derby/jdk/JDK
1.5 (latest)/label/Ubuntu/stable/docs/docbook/getting-started/src/test/resources
[INFO] 
[INFO] --- maven-compiler-plugin:2.3.2:testCompile (default-testCompile) @ getting-started
---
[INFO] No sources to compile
[INFO] 
[INFO] --- maven-surefire-plugin:2.5:test (default-test) @ getting-started ---
[INFO] No tests to run.
[INFO] 
[INFO] --- maven-jar-plugin:2.3.2:jar (default-jar) @ getting-started ---
[INFO] Building jar: /x1/jenkins/jenkins-slave/workspace/Cayenne-31/cayenneTestConnection/derby/jdk/JDK
1.5 (latest)/label/Ubuntu/stable/docs/docbook/getting-started/target/getting-started-3.1B3-SNAPSHOT.jar
[INFO] 
[INFO] --- maven-install-plugin:2.3.1:install (default-install) @ getting-started ---
[INFO] Installing /x1/jenkins/jenkins-slave/workspace/Cayenne-31/cayenneTestConnection/derby/jdk/JDK
1.5 (latest)/label/Ubuntu/stable/docs/docbook/getting-started/target/getting-started-3.1B3-SNAPSHOT.jar
to <https://builds.apache.org/job/Cayenne-31/cayenneTestConnection=derby,jdk=JDK%201.5%20(latest),label=Ubuntu/ws/.repository/org/apache/cayenne/docs/getting-started/3.1B3-SNAPSHOT/getting-started-3.1B3-SNAPSHOT.jar>
[INFO] Installing /x1/jenkins/jenkins-slave/workspace/Cayenne-31/cayenneTestConnection/derby/jdk/JDK
1.5 (latest)/label/Ubuntu/stable/docs/docbook/getting-started/pom.xml to <https://builds.apache.org/job/Cayenne-31/cayenneTestConnection=derby,jdk=JDK%201.5%20(latest),label=Ubuntu/ws/.repository/org/apache/cayenne/docs/getting-started/3.1B3-SNAPSHOT/getting-started-3.1B3-SNAPSHOT.pom>
[INFO]                                                                         
[INFO] ------------------------------------------------------------------------
[INFO] Building Docbook: Getting Started with Cayenne ROP 3.1B3-SNAPSHOT
[INFO] ------------------------------------------------------------------------
[INFO] 
[INFO] --- maven-clean-plugin:2.4.1:clean (default-clean) @ getting-started-rop ---
[INFO] 
[INFO] --- docbkx-maven-plugin:2.0.14:generate-pdf (build-pdf) @ getting-started-rop ---
[INFO] Processing input file: index.xml
[INFO] Applying customization parameters
[INFO] targetFileExtension pdf
[INFO] type fo
Jan 5, 2014 4:28:31 PM org.apache.fop.events.LoggingEventListener processEvent
WARNING: Font "Symbol,normal,700" not found. Substituting with "Symbol,normal,400".
Jan 5, 2014 4:28:31 PM org.apache.fop.events.LoggingEventListener processEvent
WARNING: Font "ZapfDingbats,normal,700" not found. Substituting with "ZapfDingbats,normal,400".
Jan 5, 2014 4:28:31 PM org.apache.fop.events.LoggingEventListener processEvent
WARNING: Line 1 of a paragraph overflows the available area by 22171 millipoints. (See position
39:661)
Jan 5, 2014 4:28:31 PM org.apache.fop.events.LoggingEventListener processEvent
WARNING: Line 1 of a paragraph overflows the available area by 26971 millipoints. (See position
39:661)
Jan 5, 2014 4:28:38 PM org.apache.fop.events.LoggingEventListener processEvent
WARNING: Line 1 of a paragraph overflows the available area by 22171 millipoints. (See position
81:702)
Jan 5, 2014 4:28:38 PM org.apache.fop.events.LoggingEventListener processEvent
WARNING: Line 1 of a paragraph overflows the available area by 2971 millipoints. (See position
81:702)
Jan 5, 2014 4:28:38 PM org.apache.fop.events.LoggingEventListener processEvent
WARNING: Line 1 of a paragraph overflows the available area by 2971 millipoints. (See position
120:708)
Jan 5, 2014 4:28:38 PM org.apache.fop.events.LoggingEventListener processEvent
WARNING: Line 1 of a paragraph overflows the available area by 12571 millipoints. (See position
174:668)
Jan 5, 2014 4:28:38 PM org.apache.fop.events.LoggingEventListener processEvent
WARNING: Line 1 of a paragraph overflows the available area by more than 50 points. (See position
223:632)
Jan 5, 2014 4:28:38 PM org.apache.fop.events.LoggingEventListener processEvent
WARNING: Line 1 of a paragraph overflows the available area by 7771 millipoints. (See position
246:655)
Jan 5, 2014 4:28:38 PM org.apache.fop.events.LoggingEventListener processEvent
WARNING: Line 1 of a paragraph overflows the available area by more than 50 points. (See position
246:655)
Jan 5, 2014 4:28:38 PM org.apache.fop.events.LoggingEventListener processEvent
WARNING: Content overflows the viewport of the fo:region-before on page 11 in block-progression
direction by 4904 millipoints. (See position 161:1510)
Jan 5, 2014 4:28:38 PM org.apache.fop.events.LoggingEventListener processEvent
WARNING: Content overflows the viewport of the fo:region-before on page 12 in block-progression
direction by 4904 millipoints. (See position 161:1510)
Jan 5, 2014 4:28:38 PM org.apache.fop.events.LoggingEventListener processEvent
WARNING: Content overflows the viewport of the fo:region-before on page 13 in block-progression
direction by 4904 millipoints. (See position 161:1510)
Jan 5, 2014 4:28:39 PM org.apache.fop.events.LoggingEventListener processEvent
WARNING: Line 1 of a paragraph overflows the available area by 36571 millipoints. (See position
330:1747)
Jan 5, 2014 4:28:39 PM org.apache.fop.events.LoggingEventListener processEvent
WARNING: Line 1 of a paragraph overflows the available area by 12571 millipoints. (See position
330:1747)
Jan 5, 2014 4:28:39 PM org.apache.fop.events.LoggingEventListener processEvent
WARNING: Line 1 of a paragraph overflows the available area by 36571 millipoints. (See position
330:1747)
Jan 5, 2014 4:28:39 PM org.apache.fop.events.LoggingEventListener processEvent
WARNING: Line 1 of a paragraph overflows the available area by 2971 millipoints. (See position
330:1747)
[INFO] /x1/jenkins/jenkins-slave/workspace/Cayenne-31/cayenneTestConnection/derby/jdk/JDK
1.5 (latest)/label/Ubuntu/stable/docs/docbook/getting-started-rop/target/site/index.pdf has
been generated.
[INFO] /x1/jenkins/jenkins-slave/workspace/Cayenne-31/cayenneTestConnection/derby/jdk/JDK
1.5 (latest)/label/Ubuntu/stable/docs/docbook/getting-started-rop/target/site/index.fo has
been generated.
[INFO] Executing tasks
   [delete] Deleting 1 files from /x1/jenkins/jenkins-slave/workspace/Cayenne-31/cayenneTestConnection/derby/jdk/JDK
1.5 (latest)/label/Ubuntu/stable/docs/docbook/getting-started-rop/target/site
     [move] Moving 1 file to /x1/jenkins/jenkins-slave/workspace/Cayenne-31/cayenneTestConnection/derby/jdk/JDK
1.5 (latest)/label/Ubuntu/stable/docs/docbook/getting-started-rop/target/site
[INFO] Executed tasks
[INFO] 
[INFO] --- docbkx-maven-plugin:2.0.14:generate-html (build-html) @ getting-started-rop ---
[INFO] Processing input file: index.xml
[INFO] Applying customization parameters
[INFO] Chunking output.
[INFO] See /x1/jenkins/jenkins-slave/workspace/Cayenne-31/cayenneTestConnection/derby/jdk/JDK
1.5 (latest)/label/Ubuntu/stable/docs/docbook/getting-started-rop/target/site/index for generated
file(s)
[INFO] Executing tasks
     [copy] Copying 2 files to /x1/jenkins/jenkins-slave/workspace/Cayenne-31/cayenneTestConnection/derby/jdk/JDK
1.5 (latest)/label/Ubuntu/stable/docs/docbook/getting-started-rop/target/site/index/css
     [copy] Copying 1 file to /x1/jenkins/jenkins-slave/workspace/Cayenne-31/cayenneTestConnection/derby/jdk/JDK
1.5 (latest)/label/Ubuntu/stable/docs/docbook/getting-started-rop/target/site/index/images
[INFO] Executed tasks
[INFO] 
[INFO] --- maven-antrun-plugin:1.7:run (cleanup-maven) @ getting-started-rop ---
[INFO] Executing tasks

main:
[INFO] Executed tasks
[INFO] 
[INFO] --- maven-resources-plugin:2.4.3:resources (default-resources) @ getting-started-rop
---
[INFO] Using 'UTF-8' encoding to copy filtered resources.
[INFO] Copying 12 resources
[INFO] 
[INFO] --- maven-compiler-plugin:2.3.2:compile (default-compile) @ getting-started-rop ---
[INFO] No sources to compile
[INFO] 
[INFO] --- maven-resources-plugin:2.4.3:testResources (default-testResources) @ getting-started-rop
---
[INFO] Using 'UTF-8' encoding to copy filtered resources.
[INFO] skip non existing resourceDirectory /x1/jenkins/jenkins-slave/workspace/Cayenne-31/cayenneTestConnection/derby/jdk/JDK
1.5 (latest)/label/Ubuntu/stable/docs/docbook/getting-started-rop/src/test/resources
[INFO] 
[INFO] --- maven-compiler-plugin:2.3.2:testCompile (default-testCompile) @ getting-started-rop
---
[INFO] No sources to compile
[INFO] 
[INFO] --- maven-surefire-plugin:2.5:test (default-test) @ getting-started-rop ---
[INFO] No tests to run.
[INFO] 
[INFO] --- maven-jar-plugin:2.3.2:jar (default-jar) @ getting-started-rop ---
[INFO] Building jar: /x1/jenkins/jenkins-slave/workspace/Cayenne-31/cayenneTestConnection/derby/jdk/JDK
1.5 (latest)/label/Ubuntu/stable/docs/docbook/getting-started-rop/target/getting-started-rop-3.1B3-SNAPSHOT.jar
[INFO] 
[INFO] --- maven-install-plugin:2.3.1:install (default-install) @ getting-started-rop ---
[INFO] Installing /x1/jenkins/jenkins-slave/workspace/Cayenne-31/cayenneTestConnection/derby/jdk/JDK
1.5 (latest)/label/Ubuntu/stable/docs/docbook/getting-started-rop/target/getting-started-rop-3.1B3-SNAPSHOT.jar
to <https://builds.apache.org/job/Cayenne-31/cayenneTestConnection=derby,jdk=JDK%201.5%20(latest),label=Ubuntu/ws/.repository/org/apache/cayenne/docs/getting-started-rop/3.1B3-SNAPSHOT/getting-started-rop-3.1B3-SNAPSHOT.jar>
[INFO] Installing /x1/jenkins/jenkins-slave/workspace/Cayenne-31/cayenneTestConnection/derby/jdk/JDK
1.5 (latest)/label/Ubuntu/stable/docs/docbook/getting-started-rop/pom.xml to <https://builds.apache.org/job/Cayenne-31/cayenneTestConnection=derby,jdk=JDK%201.5%20(latest),label=Ubuntu/ws/.repository/org/apache/cayenne/docs/getting-started-rop/3.1B3-SNAPSHOT/getting-started-rop-3.1B3-SNAPSHOT.pom>
[INFO]                                                                         
[INFO] ------------------------------------------------------------------------
[INFO] Building Docbook: Cayenne New Features and Upgrade Guide 3.1B3-SNAPSHOT
[INFO] ------------------------------------------------------------------------
[INFO] 
[INFO] --- maven-clean-plugin:2.4.1:clean (default-clean) @ upgrade-guide ---
[INFO] 
[INFO] --- docbkx-maven-plugin:2.0.14:generate-pdf (build-pdf) @ upgrade-guide ---
[INFO] Processing input file: index.xml
[INFO] Applying customization parameters
[INFO] targetFileExtension pdf
[INFO] type fo
Jan 5, 2014 4:28:41 PM org.apache.fop.events.LoggingEventListener processEvent
WARNING: Font "Symbol,normal,700" not found. Substituting with "Symbol,normal,400".
Jan 5, 2014 4:28:41 PM org.apache.fop.events.LoggingEventListener processEvent
WARNING: Font "ZapfDingbats,normal,700" not found. Substituting with "ZapfDingbats,normal,400".
[INFO] /x1/jenkins/jenkins-slave/workspace/Cayenne-31/cayenneTestConnection/derby/jdk/JDK
1.5 (latest)/label/Ubuntu/stable/docs/docbook/upgrade-guide/target/site/index.pdf has been
generated.
[INFO] /x1/jenkins/jenkins-slave/workspace/Cayenne-31/cayenneTestConnection/derby/jdk/JDK
1.5 (latest)/label/Ubuntu/stable/docs/docbook/upgrade-guide/target/site/index.fo has been
generated.
[INFO] Executing tasks
   [delete] Deleting 1 files from /x1/jenkins/jenkins-slave/workspace/Cayenne-31/cayenneTestConnection/derby/jdk/JDK
1.5 (latest)/label/Ubuntu/stable/docs/docbook/upgrade-guide/target/site
     [move] Moving 1 file to /x1/jenkins/jenkins-slave/workspace/Cayenne-31/cayenneTestConnection/derby/jdk/JDK
1.5 (latest)/label/Ubuntu/stable/docs/docbook/upgrade-guide/target/site
[INFO] Executed tasks
[INFO] 
[INFO] --- docbkx-maven-plugin:2.0.14:generate-html (build-html) @ upgrade-guide ---
[INFO] Processing input file: index.xml
[INFO] Applying customization parameters
[INFO] Chunking output.
[INFO] See /x1/jenkins/jenkins-slave/workspace/Cayenne-31/cayenneTestConnection/derby/jdk/JDK
1.5 (latest)/label/Ubuntu/stable/docs/docbook/upgrade-guide/target/site/index for generated
file(s)
[INFO] Executing tasks
     [copy] Copying 2 files to /x1/jenkins/jenkins-slave/workspace/Cayenne-31/cayenneTestConnection/derby/jdk/JDK
1.5 (latest)/label/Ubuntu/stable/docs/docbook/upgrade-guide/target/site/index/css
[INFO] ------------------------------------------------------------------------
[INFO] Reactor Summary:
[INFO] 
[INFO] Cayenne ........................................... SUCCESS [0.201s]
[INFO] Common Unit Test Utilities ........................ SUCCESS [1.107s]
[INFO] Cayenne Internal Build Plugin ..................... SUCCESS [1.062s]
[INFO] Cayenne Build Tools Parent ........................ SUCCESS [0.006s]
[INFO] Cayenne License and Notice Bundle ................. SUCCESS [0.548s]
[INFO] Cayenne Dependency Injection Container ............ SUCCESS [1.761s]
[INFO] Cayenne Java 1.5 Unpublished ...................... SUCCESS [1:29.171s]
[INFO] Cayenne WebObjects Compatibility Library .......... SUCCESS [2.157s]
[INFO] Cayenne Aggregated Server Jar ..................... SUCCESS [2.182s]
[INFO] Cayenne Aggregated Client Jar ..................... SUCCESS [1.664s]
[INFO] Cayenne Project ................................... SUCCESS [2.208s]
[INFO] Cayenne Tools ..................................... SUCCESS [4.023s]
[INFO] Library: cayenne-lifecycle ........................ SUCCESS [3.450s]
[INFO] Cayenne Maven Plugin .............................. SUCCESS [1.924s]
[INFO] Cayenne Framework Aggregator Project .............. SUCCESS [0.008s]
[INFO] Cayenne Integration Tests Parent .................. SUCCESS [0.009s]
[INFO] Integration Tests - Cayenne Runtime ............... SUCCESS [1.781s]
[INFO] Integration Tests - Cayenne Tools ................. SUCCESS [2.008s]
[INFO] Cayenne Modeler ................................... SUCCESS [8.379s]
[INFO] Cayenne Modeler Maven Plugin ...................... SUCCESS [0.534s]
[INFO] Cayenne Modeler Parent ............................ SUCCESS [0.006s]
[INFO] Cayenne Tutorial .................................. SUCCESS [1.363s]
[INFO] Cayenne ROP Server Tutorial ....................... SUCCESS [1.802s]
[INFO] Cayenne ROP Client Tutorial ....................... SUCCESS [0.669s]
[INFO] Cayenne Tutorials ................................. SUCCESS [0.056s]
[INFO] Cayenne Documentation ............................. SUCCESS [53.972s]
[INFO] Cayenne Documenation Parent ....................... SUCCESS [0.003s]
[INFO] Cayenne Docbook Documentation ..................... SUCCESS [0.920s]
[INFO] Docbook: Cayenne Stylesheets ...................... SUCCESS [0.216s]
[INFO] Docbook: Cayenne Guide ............................ SUCCESS [13.556s]
[INFO] Docbook: Getting Started with Cayenne ............. SUCCESS [52.117s]
[INFO] Docbook: Getting Started with Cayenne ROP ......... SUCCESS [10.457s]
[INFO] Docbook: Cayenne New Features and Upgrade Guide ... FAILURE [3.004s]
[INFO] ------------------------------------------------------------------------
[INFO] BUILD FAILURE
[INFO] ------------------------------------------------------------------------
[INFO] Total time: 4:23.172s
[INFO] Finished at: Sun Jan 05 16:28:43 GMT 2014
[INFO] Final Memory: 51M/145M
[INFO] ------------------------------------------------------------------------
[ERROR] Failed to execute goal com.agilejava.docbkx:docbkx-maven-plugin:2.0.14:generate-html
(build-html) on project upgrade-guide: Error executing ant tasks: /x1/jenkins/jenkins-slave/workspace/Cayenne-31/cayenneTestConnection/derby/jdk/JDK
1.5 (latest)/label/Ubuntu/stable/docs/docbook/upgrade-guide/src/images not found. -> [Help
1]
org.apache.maven.lifecycle.LifecycleExecutionException: Failed to execute goal com.agilejava.docbkx:docbkx-maven-plugin:2.0.14:generate-html
(build-html) on project upgrade-guide: Error executing ant tasks
	at org.apache.maven.lifecycle.internal.MojoExecutor.execute(MojoExecutor.java:217)
	at org.apache.maven.lifecycle.internal.MojoExecutor.execute(MojoExecutor.java:153)
	at org.apache.maven.lifecycle.internal.MojoExecutor.execute(MojoExecutor.java:145)
	at org.apache.maven.lifecycle.internal.LifecycleModuleBuilder.buildProject(LifecycleModuleBuilder.java:84)
	at org.apache.maven.lifecycle.internal.LifecycleModuleBuilder.buildProject(LifecycleModuleBuilder.java:59)
	at org.apache.maven.lifecycle.internal.LifecycleStarter.singleThreadedBuild(LifecycleStarter.java:183)
	at org.apache.maven.lifecycle.internal.LifecycleStarter.execute(LifecycleStarter.java:161)
	at org.apache.maven.DefaultMaven.doExecute(DefaultMaven.java:320)
	at org.apache.maven.DefaultMaven.execute(DefaultMaven.java:156)
	at org.apache.maven.cli.MavenCli.execute(MavenCli.java:537)
	at org.apache.maven.cli.MavenCli.doMain(MavenCli.java:196)
	at org.apache.maven.cli.MavenCli.main(MavenCli.java:141)
	at sun.reflect.NativeMethodAccessorImpl.invoke0(Native Method)
	at sun.reflect.NativeMethodAccessorImpl.invoke(NativeMethodAccessorImpl.java:39)
	at sun.reflect.DelegatingMethodAccessorImpl.invoke(DelegatingMethodAccessorImpl.java:25)
	at java.lang.reflect.Method.invoke(Method.java:592)
	at org.codehaus.plexus.classworlds.launcher.Launcher.launchEnhanced(Launcher.java:290)
	at org.codehaus.plexus.classworlds.launcher.Launcher.launch(Launcher.java:230)
	at org.codehaus.plexus.classworlds.launcher.Launcher.mainWithExitCode(Launcher.java:409)
	at org.codehaus.plexus.classworlds.launcher.Launcher.main(Launcher.java:352)
Caused by: org.apache.maven.plugin.MojoExecutionException: Error executing ant tasks
	at com.agilejava.docbkx.maven.AbstractTransformerMojo.executeTasks(AbstractTransformerMojo.java:604)
	at com.agilejava.docbkx.maven.AbstractTransformerMojo.postProcess(AbstractTransformerMojo.java:441)
	at com.agilejava.docbkx.maven.AbstractTransformerMojo.execute(AbstractTransformerMojo.java:185)
	at com.agilejava.docbkx.maven.AbstractHtmlMojo.execute(AbstractHtmlMojo.java:58)
	at org.apache.maven.plugin.DefaultBuildPluginManager.executeMojo(DefaultBuildPluginManager.java:101)
	at org.apache.maven.lifecycle.internal.MojoExecutor.execute(MojoExecutor.java:209)
	... 19 more
Caused by: /x1/jenkins/jenkins-slave/workspace/Cayenne-31/cayenneTestConnection/derby/jdk/JDK
1.5 (latest)/label/Ubuntu/stable/docs/docbook/upgrade-guide/src/images not found.
	at org.apache.tools.ant.types.AbstractFileSet.getDirectoryScanner(AbstractFileSet.java:349)
	at org.apache.tools.ant.taskdefs.Copy.execute(Copy.java:404)
	at org.apache.tools.ant.UnknownElement.execute(UnknownElement.java:275)
	at org.apache.tools.ant.Task.perform(Task.java:364)
	at org.apache.tools.ant.Target.execute(Target.java:341)
	at com.agilejava.docbkx.maven.AbstractTransformerMojo.executeTasks(AbstractTransformerMojo.java:601)
	... 24 more
[ERROR] 
[ERROR] Re-run Maven using the -X switch to enable full debug logging.
[ERROR] 
[ERROR] For more information about the errors and possible solutions, please read the following
articles:
[ERROR] [Help 1] http://cwiki.apache.org/confluence/display/MAVEN/MojoExecutionException
[ERROR] 
[ERROR] After correcting the problems, you can resume the build with the command
[ERROR]   mvn <goals> -rf :upgrade-guide
Build step 'Invoke top-level Maven targets' marked build as failure

Mime
View raw message