cayenne-commits mailing list archives

Site index · List index
Message view « Date » · « Thread »
Top « Date » · « Thread »
From Apache Jenkins Server <jenk...@builds.apache.org>
Subject Build failed in Jenkins: Cayenne-doc #491
Date Sun, 05 Jan 2014 22:33:05 GMT
See <https://builds.apache.org/job/Cayenne-doc/491/changes>

Changes:

[aadamchik] transferring old ROP docs

[aadamchik] renaming rop chapters to start with rop-

[aadamchik] renaming

[aadamchik] replacing confluence-style waring blocks with 'note' docbook sections

[aadamchik] updating copyright year

[aadamchik] Using only major version in docs metadata

otherwise Google is confused how to find docs for a given v. of Cayenne

[aadamchik] fixing table layout

(cherry picked from commit 782bc872e3d571c455fa16a74b30e8e0197b5abf)

[aadamchik] fixing table layout

[aadamchik] fixing table layout

[aadamchik] decreasing the size of 'code' tags and increasing that of 'programlisting'

[aadamchik] fixing chapter IDs that result in incorrect generated HTML file names

------------------------------------------
[...truncated 117980 lines...]
WARNING: Line 1 of a paragraph overflows the available area by 17371 millipoints. (See position
344:661)
Jan 5, 2014 10:32:41 PM org.apache.fop.events.LoggingEventListener processEvent
WARNING: Line 1 of a paragraph overflows the available area by 9171 millipoints. (See position
549:685)
Jan 5, 2014 10:32:41 PM org.apache.fop.events.LoggingEventListener processEvent
WARNING: Line 1 of a paragraph overflows the available area by 37971 millipoints. (See position
549:685)
Jan 5, 2014 10:32:41 PM org.apache.fop.events.LoggingEventListener processEvent
WARNING: Line 1 of a paragraph overflows the available area by 4371 millipoints. (See position
549:685)
[INFO] /x1/jenkins/jenkins-slave/workspace/Cayenne-doc/trunk/docs/docbook/getting-started/target/site/index.pdf
has been generated.
[INFO] /x1/jenkins/jenkins-slave/workspace/Cayenne-doc/trunk/docs/docbook/getting-started/target/site/index.fo
has been generated.
[INFO] Executing tasks
   [delete] Deleting 1 files from /x1/jenkins/jenkins-slave/workspace/Cayenne-doc/trunk/docs/docbook/getting-started/target/site
     [move] Moving 1 file to /x1/jenkins/jenkins-slave/workspace/Cayenne-doc/trunk/docs/docbook/getting-started/target/site
[INFO] Executed tasks
[INFO] 
[INFO] --- docbkx-maven-plugin:2.0.14:generate-html (build-html) @ getting-started ---
[INFO] Processing input file: index.xml
[INFO] Applying customization parameters
[INFO] Chunking output.
[INFO] See /x1/jenkins/jenkins-slave/workspace/Cayenne-doc/trunk/docs/docbook/getting-started/target/site/index
for generated file(s)
[INFO] Executing tasks
     [copy] Copying 2 files to /x1/jenkins/jenkins-slave/workspace/Cayenne-doc/trunk/docs/docbook/getting-started/target/site/index/css
     [copy] Copying 13 files to /x1/jenkins/jenkins-slave/workspace/Cayenne-doc/trunk/docs/docbook/getting-started/target/site/index/images
[INFO] Executed tasks
[INFO] 
[INFO] --- maven-resources-plugin:2.4.3:resources (default-resources) @ getting-started ---
[INFO] Using 'UTF-8' encoding to copy filtered resources.
[INFO] Copying 30 resources
[INFO] 
[INFO] --- maven-compiler-plugin:2.3.2:compile (default-compile) @ getting-started ---
[INFO] No sources to compile
[INFO] 
[INFO] --- maven-resources-plugin:2.4.3:testResources (default-testResources) @ getting-started
---
[INFO] Using 'UTF-8' encoding to copy filtered resources.
[INFO] skip non existing resourceDirectory /x1/jenkins/jenkins-slave/workspace/Cayenne-doc/trunk/docs/docbook/getting-started/src/test/resources
[INFO] 
[INFO] --- maven-compiler-plugin:2.3.2:testCompile (default-testCompile) @ getting-started
---
[INFO] No sources to compile
[INFO] 
[INFO] --- maven-surefire-plugin:2.5:test (default-test) @ getting-started ---
[INFO] No tests to run.
[INFO] 
[INFO] --- maven-jar-plugin:2.3.2:jar (default-jar) @ getting-started ---
[INFO] Building jar: /x1/jenkins/jenkins-slave/workspace/Cayenne-doc/trunk/docs/docbook/getting-started/target/getting-started-3.2.M2-SNAPSHOT.jar
[INFO] 
[INFO] >>> maven-source-plugin:2.1.2:jar (bundle-source-jar) @ getting-started >>>
[INFO] 
[INFO] <<< maven-source-plugin:2.1.2:jar (bundle-source-jar) @ getting-started <<<
[INFO] 
[INFO] --- maven-source-plugin:2.1.2:jar (bundle-source-jar) @ getting-started ---
[INFO] Building jar: /x1/jenkins/jenkins-slave/workspace/Cayenne-doc/trunk/docs/docbook/getting-started/target/getting-started-3.2.M2-SNAPSHOT-sources.jar
[INFO] 
[INFO] --- maven-install-plugin:2.3.1:install (default-install) @ getting-started ---
[INFO] Installing /x1/jenkins/jenkins-slave/workspace/Cayenne-doc/trunk/docs/docbook/getting-started/target/getting-started-3.2.M2-SNAPSHOT.jar
to /home/jenkins/.m2/repository/org/apache/cayenne/docs/getting-started/3.2.M2-SNAPSHOT/getting-started-3.2.M2-SNAPSHOT.jar
[INFO] Installing /x1/jenkins/jenkins-slave/workspace/Cayenne-doc/trunk/docs/docbook/getting-started/pom.xml
to /home/jenkins/.m2/repository/org/apache/cayenne/docs/getting-started/3.2.M2-SNAPSHOT/getting-started-3.2.M2-SNAPSHOT.pom
[INFO] Installing /x1/jenkins/jenkins-slave/workspace/Cayenne-doc/trunk/docs/docbook/getting-started/target/getting-started-3.2.M2-SNAPSHOT-sources.jar
to /home/jenkins/.m2/repository/org/apache/cayenne/docs/getting-started/3.2.M2-SNAPSHOT/getting-started-3.2.M2-SNAPSHOT-sources.jar
[INFO] 
[INFO] >>> maven-javadoc-plugin:2.9.1:javadoc (default-cli) @ getting-started >>>
[INFO] 
[INFO] <<< maven-javadoc-plugin:2.9.1:javadoc (default-cli) @ getting-started <<<
[INFO] 
[INFO] --- maven-javadoc-plugin:2.9.1:javadoc (default-cli) @ getting-started ---
[INFO]                                                                         
[INFO] ------------------------------------------------------------------------
[INFO] Building Docbook: Getting Started with Cayenne ROP 3.2.M2-SNAPSHOT
[INFO] ------------------------------------------------------------------------
[WARNING] The POM for org.eclipse.m2e:lifecycle-mapping:jar:1.0.0 is missing, no dependency
information available
[WARNING] Failed to retrieve plugin descriptor for org.eclipse.m2e:lifecycle-mapping:1.0.0:
Plugin org.eclipse.m2e:lifecycle-mapping:1.0.0 or one of its dependencies could not be resolved:
Failed to read artifact descriptor for org.eclipse.m2e:lifecycle-mapping:jar:1.0.0
[INFO] 
[INFO] --- maven-clean-plugin:2.4.1:clean (default-clean) @ getting-started-rop ---
[INFO] 
[INFO] --- docbkx-maven-plugin:2.0.14:generate-pdf (build-pdf) @ getting-started-rop ---
[INFO] Processing input file: index.xml
[INFO] Applying customization parameters
[INFO] targetFileExtension pdf
[INFO] type fo
Jan 5, 2014 10:32:52 PM org.apache.fop.events.LoggingEventListener processEvent
WARNING: Font "Symbol,normal,700" not found. Substituting with "Symbol,normal,400".
Jan 5, 2014 10:32:52 PM org.apache.fop.events.LoggingEventListener processEvent
WARNING: Font "ZapfDingbats,normal,700" not found. Substituting with "ZapfDingbats,normal,400".
Jan 5, 2014 10:32:52 PM org.apache.fop.events.LoggingEventListener processEvent
WARNING: Line 1 of a paragraph overflows the available area by 22171 millipoints. (See position
39:661)
Jan 5, 2014 10:32:52 PM org.apache.fop.events.LoggingEventListener processEvent
WARNING: Line 1 of a paragraph overflows the available area by 26971 millipoints. (See position
39:661)
Jan 5, 2014 10:32:58 PM org.apache.fop.events.LoggingEventListener processEvent
WARNING: Line 1 of a paragraph overflows the available area by 22171 millipoints. (See position
81:702)
Jan 5, 2014 10:32:58 PM org.apache.fop.events.LoggingEventListener processEvent
WARNING: Line 1 of a paragraph overflows the available area by 2971 millipoints. (See position
81:702)
Jan 5, 2014 10:32:58 PM org.apache.fop.events.LoggingEventListener processEvent
WARNING: Line 1 of a paragraph overflows the available area by 2971 millipoints. (See position
120:708)
Jan 5, 2014 10:32:58 PM org.apache.fop.events.LoggingEventListener processEvent
WARNING: Line 1 of a paragraph overflows the available area by 12571 millipoints. (See position
174:668)
Jan 5, 2014 10:32:58 PM org.apache.fop.events.LoggingEventListener processEvent
WARNING: Line 1 of a paragraph overflows the available area by more than 50 points. (See position
223:632)
Jan 5, 2014 10:32:58 PM org.apache.fop.events.LoggingEventListener processEvent
WARNING: Line 1 of a paragraph overflows the available area by 7771 millipoints. (See position
246:655)
Jan 5, 2014 10:32:58 PM org.apache.fop.events.LoggingEventListener processEvent
WARNING: Line 1 of a paragraph overflows the available area by more than 50 points. (See position
246:655)
Jan 5, 2014 10:32:58 PM org.apache.fop.events.LoggingEventListener processEvent
WARNING: Content overflows the viewport of the fo:region-before on page 11 in block-progression
direction by 4904 millipoints. (See position 161:1510)
Jan 5, 2014 10:32:58 PM org.apache.fop.events.LoggingEventListener processEvent
WARNING: Content overflows the viewport of the fo:region-before on page 12 in block-progression
direction by 4904 millipoints. (See position 161:1510)
Jan 5, 2014 10:32:58 PM org.apache.fop.events.LoggingEventListener processEvent
WARNING: Content overflows the viewport of the fo:region-before on page 13 in block-progression
direction by 4904 millipoints. (See position 161:1510)
Jan 5, 2014 10:32:58 PM org.apache.fop.events.LoggingEventListener processEvent
WARNING: Line 1 of a paragraph overflows the available area by 36571 millipoints. (See position
330:1747)
Jan 5, 2014 10:32:58 PM org.apache.fop.events.LoggingEventListener processEvent
WARNING: Line 1 of a paragraph overflows the available area by 12571 millipoints. (See position
330:1747)
Jan 5, 2014 10:32:58 PM org.apache.fop.events.LoggingEventListener processEvent
WARNING: Line 1 of a paragraph overflows the available area by 36571 millipoints. (See position
330:1747)
Jan 5, 2014 10:32:58 PM org.apache.fop.events.LoggingEventListener processEvent
WARNING: Line 1 of a paragraph overflows the available area by 2971 millipoints. (See position
330:1747)
[INFO] /x1/jenkins/jenkins-slave/workspace/Cayenne-doc/trunk/docs/docbook/getting-started-rop/target/site/index.pdf
has been generated.
[INFO] /x1/jenkins/jenkins-slave/workspace/Cayenne-doc/trunk/docs/docbook/getting-started-rop/target/site/index.fo
has been generated.
[INFO] Executing tasks
   [delete] Deleting 1 files from /x1/jenkins/jenkins-slave/workspace/Cayenne-doc/trunk/docs/docbook/getting-started-rop/target/site
     [move] Moving 1 file to /x1/jenkins/jenkins-slave/workspace/Cayenne-doc/trunk/docs/docbook/getting-started-rop/target/site
[INFO] Executed tasks
[INFO] 
[INFO] --- docbkx-maven-plugin:2.0.14:generate-html (build-html) @ getting-started-rop ---
[INFO] Processing input file: index.xml
[INFO] Applying customization parameters
[INFO] Chunking output.
[INFO] See /x1/jenkins/jenkins-slave/workspace/Cayenne-doc/trunk/docs/docbook/getting-started-rop/target/site/index
for generated file(s)
[INFO] Executing tasks
     [copy] Copying 2 files to /x1/jenkins/jenkins-slave/workspace/Cayenne-doc/trunk/docs/docbook/getting-started-rop/target/site/index/css
     [copy] Copying 1 file to /x1/jenkins/jenkins-slave/workspace/Cayenne-doc/trunk/docs/docbook/getting-started-rop/target/site/index/images
[INFO] Executed tasks
[INFO] 
[INFO] --- maven-resources-plugin:2.4.3:resources (default-resources) @ getting-started-rop
---
[INFO] Using 'UTF-8' encoding to copy filtered resources.
[INFO] Copying 12 resources
[INFO] 
[INFO] --- maven-compiler-plugin:2.3.2:compile (default-compile) @ getting-started-rop ---
[INFO] No sources to compile
[INFO] 
[INFO] --- maven-resources-plugin:2.4.3:testResources (default-testResources) @ getting-started-rop
---
[INFO] Using 'UTF-8' encoding to copy filtered resources.
[INFO] skip non existing resourceDirectory /x1/jenkins/jenkins-slave/workspace/Cayenne-doc/trunk/docs/docbook/getting-started-rop/src/test/resources
[INFO] 
[INFO] --- maven-compiler-plugin:2.3.2:testCompile (default-testCompile) @ getting-started-rop
---
[INFO] No sources to compile
[INFO] 
[INFO] --- maven-surefire-plugin:2.5:test (default-test) @ getting-started-rop ---
[INFO] No tests to run.
[INFO] 
[INFO] --- maven-jar-plugin:2.3.2:jar (default-jar) @ getting-started-rop ---
[INFO] Building jar: /x1/jenkins/jenkins-slave/workspace/Cayenne-doc/trunk/docs/docbook/getting-started-rop/target/getting-started-rop-3.2.M2-SNAPSHOT.jar
[INFO] 
[INFO] >>> maven-source-plugin:2.1.2:jar (bundle-source-jar) @ getting-started-rop
>>>
[INFO] 
[INFO] <<< maven-source-plugin:2.1.2:jar (bundle-source-jar) @ getting-started-rop
<<<
[INFO] 
[INFO] --- maven-source-plugin:2.1.2:jar (bundle-source-jar) @ getting-started-rop ---
[INFO] Building jar: /x1/jenkins/jenkins-slave/workspace/Cayenne-doc/trunk/docs/docbook/getting-started-rop/target/getting-started-rop-3.2.M2-SNAPSHOT-sources.jar
[INFO] 
[INFO] --- maven-install-plugin:2.3.1:install (default-install) @ getting-started-rop ---
[INFO] Installing /x1/jenkins/jenkins-slave/workspace/Cayenne-doc/trunk/docs/docbook/getting-started-rop/target/getting-started-rop-3.2.M2-SNAPSHOT.jar
to /home/jenkins/.m2/repository/org/apache/cayenne/docs/getting-started-rop/3.2.M2-SNAPSHOT/getting-started-rop-3.2.M2-SNAPSHOT.jar
[INFO] Installing /x1/jenkins/jenkins-slave/workspace/Cayenne-doc/trunk/docs/docbook/getting-started-rop/pom.xml
to /home/jenkins/.m2/repository/org/apache/cayenne/docs/getting-started-rop/3.2.M2-SNAPSHOT/getting-started-rop-3.2.M2-SNAPSHOT.pom
[INFO] Installing /x1/jenkins/jenkins-slave/workspace/Cayenne-doc/trunk/docs/docbook/getting-started-rop/target/getting-started-rop-3.2.M2-SNAPSHOT-sources.jar
to /home/jenkins/.m2/repository/org/apache/cayenne/docs/getting-started-rop/3.2.M2-SNAPSHOT/getting-started-rop-3.2.M2-SNAPSHOT-sources.jar
[INFO] 
[INFO] >>> maven-javadoc-plugin:2.9.1:javadoc (default-cli) @ getting-started-rop
>>>
[INFO] 
[INFO] <<< maven-javadoc-plugin:2.9.1:javadoc (default-cli) @ getting-started-rop
<<<
[INFO] 
[INFO] --- maven-javadoc-plugin:2.9.1:javadoc (default-cli) @ getting-started-rop ---
[INFO]                                                                         
[INFO] ------------------------------------------------------------------------
[INFO] Building Docbook: Cayenne New Features and Upgrade Guide 3.2.M2-SNAPSHOT
[INFO] ------------------------------------------------------------------------
[WARNING] The POM for org.eclipse.m2e:lifecycle-mapping:jar:1.0.0 is missing, no dependency
information available
[WARNING] Failed to retrieve plugin descriptor for org.eclipse.m2e:lifecycle-mapping:1.0.0:
Plugin org.eclipse.m2e:lifecycle-mapping:1.0.0 or one of its dependencies could not be resolved:
Failed to read artifact descriptor for org.eclipse.m2e:lifecycle-mapping:jar:1.0.0
[INFO] 
[INFO] --- maven-clean-plugin:2.4.1:clean (default-clean) @ upgrade-guide ---
[INFO] 
[INFO] --- docbkx-maven-plugin:2.0.14:generate-pdf (build-pdf) @ upgrade-guide ---
[INFO] Processing input file: index.xml
[INFO] Applying customization parameters
[INFO] targetFileExtension pdf
[INFO] type fo
Jan 5, 2014 10:33:00 PM org.apache.fop.events.LoggingEventListener processEvent
WARNING: Font "Symbol,normal,700" not found. Substituting with "Symbol,normal,400".
Jan 5, 2014 10:33:00 PM org.apache.fop.events.LoggingEventListener processEvent
WARNING: Font "ZapfDingbats,normal,700" not found. Substituting with "ZapfDingbats,normal,400".
[INFO] /x1/jenkins/jenkins-slave/workspace/Cayenne-doc/trunk/docs/docbook/upgrade-guide/target/site/index.pdf
has been generated.
[INFO] /x1/jenkins/jenkins-slave/workspace/Cayenne-doc/trunk/docs/docbook/upgrade-guide/target/site/index.fo
has been generated.
[INFO] Executing tasks
   [delete] Deleting 1 files from /x1/jenkins/jenkins-slave/workspace/Cayenne-doc/trunk/docs/docbook/upgrade-guide/target/site
     [move] Moving 1 file to /x1/jenkins/jenkins-slave/workspace/Cayenne-doc/trunk/docs/docbook/upgrade-guide/target/site
[INFO] Executed tasks
[INFO] 
[INFO] --- docbkx-maven-plugin:2.0.14:generate-html (build-html) @ upgrade-guide ---
[INFO] Processing input file: index.xml
[INFO] Applying customization parameters
[INFO] Chunking output.
[INFO] See /x1/jenkins/jenkins-slave/workspace/Cayenne-doc/trunk/docs/docbook/upgrade-guide/target/site/index
for generated file(s)
[INFO] Executing tasks
     [copy] Copying 2 files to /x1/jenkins/jenkins-slave/workspace/Cayenne-doc/trunk/docs/docbook/upgrade-guide/target/site/index/css
[INFO] ------------------------------------------------------------------------
[INFO] Reactor Summary:
[INFO] 
[INFO] Cayenne ........................................... SUCCESS [1.601s]
[INFO] Cayenne Build Tools Parent ........................ SUCCESS [0.036s]
[INFO] Cayenne License and Notice Bundle ................. SUCCESS [1.440s]
[INFO] Common Unit Test Utilities ........................ SUCCESS [2.149s]
[INFO] Cayenne Dependency Injection Container ............ SUCCESS [4.202s]
[INFO] Cayenne Server .................................... SUCCESS [1:28.689s]
[INFO] Cayenne ROP Client ................................ SUCCESS [14.313s]
[INFO] Cayenne Project ................................... SUCCESS [4.112s]
[INFO] Cayenne Tools ..................................... SUCCESS [6.705s]
[INFO] Cayenne Lifecycle Utilities ....................... SUCCESS [5.296s]
[INFO] Cayenne Integration Tests Parent .................. SUCCESS [0.046s]
[INFO] Cayenne Maven Plugins ............................. SUCCESS [0.040s]
[INFO] Cayenne Maven Plugin .............................. SUCCESS [6.033s]
[INFO] Integration Tests - Cayenne Tools ................. SUCCESS [2.147s]
[INFO] Cayenne Modeler Parent ............................ SUCCESS [0.480s]
[INFO] Cayenne WebObjects Compatibility Library .......... SUCCESS [3.812s]
[INFO] Cayenne Modeler ................................... SUCCESS [59.246s]
[INFO] Cayenne Modeler Maven Plugin ...................... SUCCESS [3.044s]
[INFO] Cayenne Tutorial .................................. SUCCESS [3.033s]
[INFO] Cayenne ROP Server Tutorial ....................... SUCCESS [3.182s]
[INFO] Cayenne ROP Client Tutorial ....................... SUCCESS [1.642s]
[INFO] Cayenne Tutorials ................................. SUCCESS [0.042s]
[INFO] Cayenne Documenation Parent ....................... SUCCESS [0.020s]
[INFO] Cayenne Documentation ............................. SUCCESS [1:31.348s]
[INFO] Cayenne Docbook Documentation ..................... SUCCESS [0.862s]
[INFO] Docbook: Cayenne Stylesheets ...................... SUCCESS [0.221s]
[INFO] Docbook: Cayenne Guide ............................ SUCCESS [10.639s]
[INFO] Docbook: Getting Started with Cayenne ............. SUCCESS [52.439s]
[INFO] Docbook: Getting Started with Cayenne ROP ......... SUCCESS [8.671s]
[INFO] Docbook: Cayenne New Features and Upgrade Guide ... FAILURE [2.008s]
[INFO] ------------------------------------------------------------------------
[INFO] BUILD FAILURE
[INFO] ------------------------------------------------------------------------
[INFO] Total time: 6:24.213s
[INFO] Finished at: Sun Jan 05 22:33:01 UTC 2014
[INFO] Final Memory: 52M/372M
[INFO] ------------------------------------------------------------------------
[ERROR] Failed to execute goal com.agilejava.docbkx:docbkx-maven-plugin:2.0.14:generate-html
(build-html) on project upgrade-guide: Error executing ant tasks: /x1/jenkins/jenkins-slave/workspace/Cayenne-doc/trunk/docs/docbook/upgrade-guide/src/images
not found. -> [Help 1]
[ERROR] 
[ERROR] To see the full stack trace of the errors, re-run Maven with the -e switch.
[ERROR] Re-run Maven using the -X switch to enable full debug logging.
[ERROR] 
[ERROR] For more information about the errors and possible solutions, please read the following
articles:
[ERROR] [Help 1] http://cwiki.apache.org/confluence/display/MAVEN/MojoExecutionException
[ERROR] 
[ERROR] After correcting the problems, you can resume the build with the command
[ERROR]   mvn <goals> -rf :upgrade-guide
Build step 'Invoke top-level Maven targets' marked build as failure
Publishing Javadoc

Mime
View raw message