cayenne-commits mailing list archives

Site index · List index
Message view « Date » · « Thread »
Top « Date » · « Thread »
From Apache Jenkins Server <jenk...@builds.apache.org>
Subject Build failed in Jenkins: Cayenne-trunk » derby,JDK 1.7 (latest),Ubuntu #1012
Date Wed, 12 Mar 2014 08:50:36 GMT
See <https://builds.apache.org/job/Cayenne-trunk/cayenneTestConnection=derby,jdk=JDK%201.7%20(latest),label=Ubuntu/1012/changes>

Changes:

[aadamchik] java 6 annotations

------------------------------------------
Started by upstream project "Cayenne-trunk" build number 1012
originally caused by:
 Started by an SCM change
Building remotely on ubuntu2 in workspace <https://builds.apache.org/job/Cayenne-trunk/cayenneTestConnection=derby,jdk=JDK%201.7%20(latest),label=Ubuntu/ws/>
Cleaning up <https://builds.apache.org/job/Cayenne-trunk/cayenneTestConnection=derby,jdk=JDK%201.7%20(latest),label=Ubuntu/ws/trunk>
Deleting <https://builds.apache.org/job/Cayenne-trunk/cayenneTestConnection=derby,jdk=JDK%201.7%20(latest),label=Ubuntu/ws/trunk/plugins/target>
Deleting <https://builds.apache.org/job/Cayenne-trunk/cayenneTestConnection=derby,jdk=JDK%201.7%20(latest),label=Ubuntu/ws/trunk/plugins/maven-cayenne-plugin/target>
Deleting <https://builds.apache.org/job/Cayenne-trunk/cayenneTestConnection=derby,jdk=JDK%201.7%20(latest),label=Ubuntu/ws/trunk/plugins/maven-cayenne-modeler-plugin/target>
Deleting <https://builds.apache.org/job/Cayenne-trunk/cayenneTestConnection=derby,jdk=JDK%201.7%20(latest),label=Ubuntu/ws/trunk/cayenne-project/target>
Deleting <https://builds.apache.org/job/Cayenne-trunk/cayenneTestConnection=derby,jdk=JDK%201.7%20(latest),label=Ubuntu/ws/trunk/cayenne-tools/target>
Deleting <https://builds.apache.org/job/Cayenne-trunk/cayenneTestConnection=derby,jdk=JDK%201.7%20(latest),label=Ubuntu/ws/trunk/cayenne-server/derby.log>
Deleting <https://builds.apache.org/job/Cayenne-trunk/cayenneTestConnection=derby,jdk=JDK%201.7%20(latest),label=Ubuntu/ws/trunk/cayenne-server/target>
Deleting <https://builds.apache.org/job/Cayenne-trunk/cayenneTestConnection=derby,jdk=JDK%201.7%20(latest),label=Ubuntu/ws/trunk/tutorials/tutorial-rop-client/target>
Deleting <https://builds.apache.org/job/Cayenne-trunk/cayenneTestConnection=derby,jdk=JDK%201.7%20(latest),label=Ubuntu/ws/trunk/tutorials/tutorial-rop-server/target>
Deleting <https://builds.apache.org/job/Cayenne-trunk/cayenneTestConnection=derby,jdk=JDK%201.7%20(latest),label=Ubuntu/ws/trunk/tutorials/tutorial/target>
Deleting <https://builds.apache.org/job/Cayenne-trunk/cayenneTestConnection=derby,jdk=JDK%201.7%20(latest),label=Ubuntu/ws/trunk/modeler/target>
Deleting <https://builds.apache.org/job/Cayenne-trunk/cayenneTestConnection=derby,jdk=JDK%201.7%20(latest),label=Ubuntu/ws/trunk/modeler/cayenne-modeler/target>
Deleting <https://builds.apache.org/job/Cayenne-trunk/cayenneTestConnection=derby,jdk=JDK%201.7%20(latest),label=Ubuntu/ws/trunk/modeler/cayenne-wocompat/target>
Deleting <https://builds.apache.org/job/Cayenne-trunk/cayenneTestConnection=derby,jdk=JDK%201.7%20(latest),label=Ubuntu/ws/trunk/cayenne-di/target>
Deleting <https://builds.apache.org/job/Cayenne-trunk/cayenneTestConnection=derby,jdk=JDK%201.7%20(latest),label=Ubuntu/ws/trunk/cayenne-lifecycle/target>
Deleting <https://builds.apache.org/job/Cayenne-trunk/cayenneTestConnection=derby,jdk=JDK%201.7%20(latest),label=Ubuntu/ws/trunk/itests/cayenne-tools-itest/target>
Deleting <https://builds.apache.org/job/Cayenne-trunk/cayenneTestConnection=derby,jdk=JDK%201.7%20(latest),label=Ubuntu/ws/trunk/docs/docbook/getting-started/target>
Deleting <https://builds.apache.org/job/Cayenne-trunk/cayenneTestConnection=derby,jdk=JDK%201.7%20(latest),label=Ubuntu/ws/trunk/docs/docbook/docbook-stylesheets/target>
Deleting <https://builds.apache.org/job/Cayenne-trunk/cayenneTestConnection=derby,jdk=JDK%201.7%20(latest),label=Ubuntu/ws/trunk/docs/docbook/cayenne-guide/target>
Deleting <https://builds.apache.org/job/Cayenne-trunk/cayenneTestConnection=derby,jdk=JDK%201.7%20(latest),label=Ubuntu/ws/trunk/docs/docbook/upgrade-guide/target>
Deleting <https://builds.apache.org/job/Cayenne-trunk/cayenneTestConnection=derby,jdk=JDK%201.7%20(latest),label=Ubuntu/ws/trunk/docs/docbook/getting-started-rop/target>
Deleting <https://builds.apache.org/job/Cayenne-trunk/cayenneTestConnection=derby,jdk=JDK%201.7%20(latest),label=Ubuntu/ws/trunk/docs/doc/target>
Deleting <https://builds.apache.org/job/Cayenne-trunk/cayenneTestConnection=derby,jdk=JDK%201.7%20(latest),label=Ubuntu/ws/trunk/build-tools/cayenne-test-utilities/target>
Deleting <https://builds.apache.org/job/Cayenne-trunk/cayenneTestConnection=derby,jdk=JDK%201.7%20(latest),label=Ubuntu/ws/trunk/build-tools/cayenne-legal/target>
Deleting <https://builds.apache.org/job/Cayenne-trunk/cayenneTestConnection=derby,jdk=JDK%201.7%20(latest),label=Ubuntu/ws/trunk/cayenne-client/derby.log>
Deleting <https://builds.apache.org/job/Cayenne-trunk/cayenneTestConnection=derby,jdk=JDK%201.7%20(latest),label=Ubuntu/ws/trunk/cayenne-client/target>
Updating http://svn.apache.org/repos/asf/cayenne/main/trunk at revision '2014-03-12T08:47:41.550
+0000'
U         cayenne-server/src/main/java/org/apache/cayenne/CollectionResultIterator.java
U         cayenne-server/src/main/java/org/apache/cayenne/access/TransactionResultIteratorDecorator.java
U         cayenne-server/src/main/java/org/apache/cayenne/access/jdbc/SelectAction.java
U         cayenne-server/src/main/java/org/apache/cayenne/access/jdbc/ScalarRowReader.java
U         cayenne-server/src/main/java/org/apache/cayenne/access/jdbc/EntityRowReader.java
U         cayenne-server/src/main/java/org/apache/cayenne/access/jdbc/LimitResultIterator.java
U         cayenne-server/src/main/java/org/apache/cayenne/access/jdbc/DistinctResultIterator.java
U         cayenne-server/src/main/java/org/apache/cayenne/access/jdbc/ColumnDescriptor.java
U         cayenne-server/src/main/java/org/apache/cayenne/access/jdbc/CompoundRowReader.java
U         cayenne-server/src/main/java/org/apache/cayenne/access/types/ExtendedTypeDecorator.java
U         cayenne-server/src/main/java/org/apache/cayenne/access/DataContext.java
At revision 1576639
[trunk] $ /home/hudson/tools/maven/apache-maven-3.0.4/bin/mvn -Dlabel=Ubuntu "-Djdk=JDK 1.7
(latest)" -DcayenneTestConnection=derby "-Dmaven.repo.local=<https://builds.apache.org/job/Cayenne-trunk/cayenneTestConnection=derby,jdk=JDK%201.7%20(latest),label=Ubuntu/ws/.repository">
-e clean install
[INFO] Error stacktraces are turned on.
[INFO] Scanning for projects...
[WARNING] 
[WARNING] Some problems were encountered while building the effective model for org.apache.cayenne:cayenne-di:jar:3.2.M2-SNAPSHOT
[WARNING] 'build.plugins.plugin.version' for org.apache.maven.plugins:maven-jar-plugin is
missing. @ line 43, column 12
[WARNING] 
[WARNING] Some problems were encountered while building the effective model for org.apache.cayenne:cayenne-server:jar:3.2.M2-SNAPSHOT
[WARNING] 'build.plugins.plugin.version' for org.apache.maven.plugins:maven-jar-plugin is
missing. @ line 209, column 12
[WARNING] 
[WARNING] It is highly recommended to fix these problems because they threaten the stability
of your build.
[WARNING] 
[WARNING] For this reason, future Maven versions might no longer support building such malformed
projects.
[WARNING] 
[INFO] ------------------------------------------------------------------------
[INFO] Reactor Build Order:
[INFO] 
[INFO] Cayenne
[INFO] Cayenne Build Tools Parent
[INFO] Cayenne License and Notice Bundle
[INFO] Common Unit Test Utilities
[INFO] Cayenne Dependency Injection Container
[INFO] Cayenne Server
[INFO] Cayenne ROP Client
[INFO] Cayenne Project
[INFO] Cayenne Tools
[INFO] Cayenne Lifecycle Utilities
[INFO] Cayenne Integration Tests Parent
[INFO] Cayenne Maven Plugins
[INFO] Cayenne Maven Plugin
[INFO] Integration Tests - Cayenne Tools
[INFO] Cayenne Modeler Parent
[INFO] Cayenne WebObjects Compatibility Library
[INFO] Cayenne Modeler
[INFO] Cayenne Modeler Maven Plugin
[INFO] Cayenne Tutorial
[INFO] Cayenne ROP Server Tutorial
[INFO] Cayenne ROP Client Tutorial
[INFO] Cayenne Tutorials
[INFO] Cayenne Documenation Parent
[INFO] Cayenne Documentation
[INFO] Cayenne Docbook Documentation
[INFO] Docbook: Cayenne Stylesheets
[INFO] Docbook: Cayenne Guide
[INFO] Docbook: Getting Started with Cayenne
[INFO] Docbook: Getting Started with Cayenne ROP
[INFO] Docbook: Cayenne New Features and Upgrade Guide
[INFO]                                                                         
[INFO] ------------------------------------------------------------------------
[INFO] Building Cayenne 3.2.M2-SNAPSHOT
[INFO] ------------------------------------------------------------------------
[INFO] 
[INFO] --- maven-clean-plugin:2.4.1:clean (default-clean) @ cayenne-parent ---
[INFO] 
[INFO] >>> maven-source-plugin:2.1.2:jar (bundle-source-jar) @ cayenne-parent >>>
[INFO] 
[INFO] <<< maven-source-plugin:2.1.2:jar (bundle-source-jar) @ cayenne-parent <<<
[INFO] 
[INFO] --- maven-source-plugin:2.1.2:jar (bundle-source-jar) @ cayenne-parent ---
[INFO] 
[INFO] --- maven-install-plugin:2.3.1:install (default-install) @ cayenne-parent ---
[INFO] Installing /home/hudson/jenkins-slave/workspace/Cayenne-trunk/cayenneTestConnection/derby/jdk/JDK
1.7 (latest)/label/Ubuntu/trunk/pom.xml to <https://builds.apache.org/job/Cayenne-trunk/cayenneTestConnection=derby,jdk=JDK%201.7%20(latest),label=Ubuntu/ws/.repository/org/apache/cayenne/cayenne-parent/3.2.M2-SNAPSHOT/cayenne-parent-3.2.M2-SNAPSHOT.pom>
[INFO]                                                                         
[INFO] ------------------------------------------------------------------------
[INFO] Building Cayenne Build Tools Parent 3.2.M2-SNAPSHOT
[INFO] ------------------------------------------------------------------------
[INFO] 
[INFO] --- maven-clean-plugin:2.4.1:clean (default-clean) @ build-tools-parent ---
[INFO] 
[INFO] >>> maven-source-plugin:2.1.2:jar (bundle-source-jar) @ build-tools-parent
>>>
[INFO] 
[INFO] <<< maven-source-plugin:2.1.2:jar (bundle-source-jar) @ build-tools-parent
<<<
[INFO] 
[INFO] --- maven-source-plugin:2.1.2:jar (bundle-source-jar) @ build-tools-parent ---
[INFO] 
[INFO] --- maven-install-plugin:2.3.1:install (default-install) @ build-tools-parent ---
[INFO] Installing /home/hudson/jenkins-slave/workspace/Cayenne-trunk/cayenneTestConnection/derby/jdk/JDK
1.7 (latest)/label/Ubuntu/trunk/build-tools/pom.xml to <https://builds.apache.org/job/Cayenne-trunk/cayenneTestConnection=derby,jdk=JDK%201.7%20(latest),label=Ubuntu/ws/.repository/org/apache/cayenne/build-tools/build-tools-parent/3.2.M2-SNAPSHOT/build-tools-parent-3.2.M2-SNAPSHOT.pom>
[INFO]                                                                         
[INFO] ------------------------------------------------------------------------
[INFO] Building Cayenne License and Notice Bundle 3.2.M2-SNAPSHOT
[INFO] ------------------------------------------------------------------------
[INFO] 
[INFO] --- maven-clean-plugin:2.4.1:clean (default-clean) @ cayenne-legal ---
[INFO] 
[INFO] --- maven-remote-resources-plugin:1.5:bundle (default) @ cayenne-legal ---
[INFO] ------------------------------------------------------------------------
[INFO] Reactor Summary:
[INFO] 
[INFO] Cayenne ........................................... SUCCESS [1.842s]
[INFO] Cayenne Build Tools Parent ........................ SUCCESS [0.023s]
[INFO] Cayenne License and Notice Bundle ................. FAILURE [5.101s]
[INFO] Common Unit Test Utilities ........................ SKIPPED
[INFO] Cayenne Dependency Injection Container ............ SKIPPED
[INFO] Cayenne Server .................................... SKIPPED
[INFO] Cayenne ROP Client ................................ SKIPPED
[INFO] Cayenne Project ................................... SKIPPED
[INFO] Cayenne Tools ..................................... SKIPPED
[INFO] Cayenne Lifecycle Utilities ....................... SKIPPED
[INFO] Cayenne Integration Tests Parent .................. SKIPPED
[INFO] Cayenne Maven Plugins ............................. SKIPPED
[INFO] Cayenne Maven Plugin .............................. SKIPPED
[INFO] Integration Tests - Cayenne Tools ................. SKIPPED
[INFO] Cayenne Modeler Parent ............................ SKIPPED
[INFO] Cayenne WebObjects Compatibility Library .......... SKIPPED
[INFO] Cayenne Modeler ................................... SKIPPED
[INFO] Cayenne Modeler Maven Plugin ...................... SKIPPED
[INFO] Cayenne Tutorial .................................. SKIPPED
[INFO] Cayenne ROP Server Tutorial ....................... SKIPPED
[INFO] Cayenne ROP Client Tutorial ....................... SKIPPED
[INFO] Cayenne Tutorials ................................. SKIPPED
[INFO] Cayenne Documenation Parent ....................... SKIPPED
[INFO] Cayenne Documentation ............................. SKIPPED
[INFO] Cayenne Docbook Documentation ..................... SKIPPED
[INFO] Docbook: Cayenne Stylesheets ...................... SKIPPED
[INFO] Docbook: Cayenne Guide ............................ SKIPPED
[INFO] Docbook: Getting Started with Cayenne ............. SKIPPED
[INFO] Docbook: Getting Started with Cayenne ROP ......... SKIPPED
[INFO] Docbook: Cayenne New Features and Upgrade Guide ... SKIPPED
[INFO] ------------------------------------------------------------------------
[INFO] BUILD FAILURE
[INFO] ------------------------------------------------------------------------
[INFO] Total time: 9.042s
[INFO] Finished at: Wed Mar 12 08:50:35 UTC 2014
[INFO] Final Memory: 10M/99M
[INFO] ------------------------------------------------------------------------
[ERROR] Failed to execute goal org.apache.maven.plugins:maven-remote-resources-plugin:1.5:bundle
(default) on project cayenne-legal: Error creating remote resources manifest. /home/hudson/jenkins-slave/workspace/Cayenne-trunk/cayenneTestConnection/derby/jdk/JDK
1.7 (latest)/label/Ubuntu/trunk/build-tools/cayenne-legal/target/classes/META-INF/maven/remote-resources.xml
(No such file or directory) -> [Help 1]
org.apache.maven.lifecycle.LifecycleExecutionException: Failed to execute goal org.apache.maven.plugins:maven-remote-resources-plugin:1.5:bundle
(default) on project cayenne-legal: Error creating remote resources manifest.
	at org.apache.maven.lifecycle.internal.MojoExecutor.execute(MojoExecutor.java:217)
	at org.apache.maven.lifecycle.internal.MojoExecutor.execute(MojoExecutor.java:153)
	at org.apache.maven.lifecycle.internal.MojoExecutor.execute(MojoExecutor.java:145)
	at org.apache.maven.lifecycle.internal.LifecycleModuleBuilder.buildProject(LifecycleModuleBuilder.java:84)
	at org.apache.maven.lifecycle.internal.LifecycleModuleBuilder.buildProject(LifecycleModuleBuilder.java:59)
	at org.apache.maven.lifecycle.internal.LifecycleStarter.singleThreadedBuild(LifecycleStarter.java:183)
	at org.apache.maven.lifecycle.internal.LifecycleStarter.execute(LifecycleStarter.java:161)
	at org.apache.maven.DefaultMaven.doExecute(DefaultMaven.java:320)
	at org.apache.maven.DefaultMaven.execute(DefaultMaven.java:156)
	at org.apache.maven.cli.MavenCli.execute(MavenCli.java:537)
	at org.apache.maven.cli.MavenCli.doMain(MavenCli.java:196)
	at org.apache.maven.cli.MavenCli.main(MavenCli.java:141)
	at sun.reflect.NativeMethodAccessorImpl.invoke0(Native Method)
	at sun.reflect.NativeMethodAccessorImpl.invoke(NativeMethodAccessorImpl.java:57)
	at sun.reflect.DelegatingMethodAccessorImpl.invoke(DelegatingMethodAccessorImpl.java:43)
	at java.lang.reflect.Method.invoke(Method.java:606)
	at org.codehaus.plexus.classworlds.launcher.Launcher.launchEnhanced(Launcher.java:290)
	at org.codehaus.plexus.classworlds.launcher.Launcher.launch(Launcher.java:230)
	at org.codehaus.plexus.classworlds.launcher.Launcher.mainWithExitCode(Launcher.java:409)
	at org.codehaus.plexus.classworlds.launcher.Launcher.main(Launcher.java:352)
Caused by: org.apache.maven.plugin.MojoExecutionException: Error creating remote resources
manifest.
	at org.apache.maven.plugin.resources.remote.BundleRemoteResourcesMojo.execute(BundleRemoteResourcesMojo.java:144)
	at org.apache.maven.plugin.DefaultBuildPluginManager.executeMojo(DefaultBuildPluginManager.java:101)
	at org.apache.maven.lifecycle.internal.MojoExecutor.execute(MojoExecutor.java:209)
	... 19 more
Caused by: java.io.FileNotFoundException: /home/hudson/jenkins-slave/workspace/Cayenne-trunk/cayenneTestConnection/derby/jdk/JDK
1.7 (latest)/label/Ubuntu/trunk/build-tools/cayenne-legal/target/classes/META-INF/maven/remote-resources.xml
(No such file or directory)
	at java.io.FileOutputStream.open(Native Method)
	at java.io.FileOutputStream.<init>(FileOutputStream.java:212)
	at java.io.FileOutputStream.<init>(FileOutputStream.java:165)
	at java.io.FileWriter.<init>(FileWriter.java:90)
	at org.apache.maven.plugin.resources.remote.BundleRemoteResourcesMojo.execute(BundleRemoteResourcesMojo.java:138)
	... 21 more
[ERROR] 
[ERROR] Re-run Maven using the -X switch to enable full debug logging.
[ERROR] 
[ERROR] For more information about the errors and possible solutions, please read the following
articles:
[ERROR] [Help 1] http://cwiki.apache.org/confluence/display/MAVEN/MojoExecutionException
[ERROR] 
[ERROR] After correcting the problems, you can resume the build with the command
[ERROR]   mvn <goals> -rf :cayenne-legal
Build step 'Invoke top-level Maven targets' marked build as failure

Mime
View raw message