cayenne-commits mailing list archives

Site index · List index
Message view « Date » · « Thread »
Top « Date » · « Thread »
From Apache Jenkins Server <jenk...@builds.apache.org>
Subject Build failed in Jenkins: cayenne-master » hsql,jdk-1.8.0,Ubuntu #8
Date Mon, 26 May 2014 02:29:34 GMT
See <https://builds.apache.org/job/cayenne-master/cayenneTestConnection=hsql,jdk=jdk-1.8.0,label=Ubuntu/8/>

------------------------------------------
[...truncated 94405 lines...]
    protected void init(
                   ^
/x1/jenkins/jenkins-slave/workspace/cayenne-master/cayenneTestConnection/hsql/jdk/jdk-1.8.0/label/Ubuntu/docs/doc/target/sources/org/apache/cayenne/conn/PoolManager.java:156:
warning: no @param for minCons
    protected void init(
                   ^
/x1/jenkins/jenkins-slave/workspace/cayenne-master/cayenneTestConnection/hsql/jdk/jdk-1.8.0/label/Ubuntu/docs/doc/target/sources/org/apache/cayenne/conn/PoolManager.java:156:
warning: no @param for maxCons
    protected void init(
                   ^
/x1/jenkins/jenkins-slave/workspace/cayenne-master/cayenneTestConnection/hsql/jdk/jdk-1.8.0/label/Ubuntu/docs/doc/target/sources/org/apache/cayenne/conn/PoolManager.java:156:
warning: no @param for userName
    protected void init(
                   ^
/x1/jenkins/jenkins-slave/workspace/cayenne-master/cayenneTestConnection/hsql/jdk/jdk-1.8.0/label/Ubuntu/docs/doc/target/sources/org/apache/cayenne/conn/PoolManager.java:156:
warning: no @param for password
    protected void init(
                   ^
/x1/jenkins/jenkins-slave/workspace/cayenne-master/cayenneTestConnection/hsql/jdk/jdk-1.8.0/label/Ubuntu/docs/doc/target/sources/org/apache/cayenne/conn/PoolManager.java:156:
warning: no @param for maxQueueWaitTime
    protected void init(
                   ^
/x1/jenkins/jenkins-slave/workspace/cayenne-master/cayenneTestConnection/hsql/jdk/jdk-1.8.0/label/Ubuntu/docs/doc/target/sources/org/apache/cayenne/conn/PoolManager.java:156:
warning: no @throws for java.sql.SQLException
    protected void init(
                   ^
/x1/jenkins/jenkins-slave/workspace/cayenne-master/cayenneTestConnection/hsql/jdk/jdk-1.8.0/label/Ubuntu/docs/doc/target/sources/org/apache/cayenne/conn/PoolManager.java:208:
warning: no @param for userName
    protected PooledConnection newPooledConnection(String userName, String password)
                               ^
/x1/jenkins/jenkins-slave/workspace/cayenne-master/cayenneTestConnection/hsql/jdk/jdk-1.8.0/label/Ubuntu/docs/doc/target/sources/org/apache/cayenne/conn/PoolManager.java:208:
warning: no @param for password
    protected PooledConnection newPooledConnection(String userName, String password)
                               ^
/x1/jenkins/jenkins-slave/workspace/cayenne-master/cayenneTestConnection/hsql/jdk/jdk-1.8.0/label/Ubuntu/docs/doc/target/sources/org/apache/cayenne/conn/PoolManager.java:208:
warning: no @return
    protected PooledConnection newPooledConnection(String userName, String password)
                               ^
/x1/jenkins/jenkins-slave/workspace/cayenne-master/cayenneTestConnection/hsql/jdk/jdk-1.8.0/label/Ubuntu/docs/doc/target/sources/org/apache/cayenne/conn/PoolManager.java:208:
warning: no @throws for java.sql.SQLException
    protected PooledConnection newPooledConnection(String userName, String password)
                               ^
/x1/jenkins/jenkins-slave/workspace/cayenne-master/cayenneTestConnection/hsql/jdk/jdk-1.8.0/label/Ubuntu/docs/doc/target/sources/org/apache/cayenne/conn/PoolManager.java:222:
warning: no @throws for java.sql.SQLException
    public synchronized void shutdown() throws SQLException {
                             ^
/x1/jenkins/jenkins-slave/workspace/cayenne-master/cayenneTestConnection/hsql/jdk/jdk-1.8.0/label/Ubuntu/docs/doc/target/sources/org/apache/cayenne/conn/PoolManager.java:290:
warning: no @param for addConnections
    protected synchronized int growPool(
                               ^
/x1/jenkins/jenkins-slave/workspace/cayenne-master/cayenneTestConnection/hsql/jdk/jdk-1.8.0/label/Ubuntu/docs/doc/target/sources/org/apache/cayenne/conn/PoolManager.java:290:
warning: no @param for userName
    protected synchronized int growPool(
                               ^
/x1/jenkins/jenkins-slave/workspace/cayenne-master/cayenneTestConnection/hsql/jdk/jdk-1.8.0/label/Ubuntu/docs/doc/target/sources/org/apache/cayenne/conn/PoolManager.java:290:
warning: no @param for password
    protected synchronized int growPool(
                               ^
/x1/jenkins/jenkins-slave/workspace/cayenne-master/cayenneTestConnection/hsql/jdk/jdk-1.8.0/label/Ubuntu/docs/doc/target/sources/org/apache/cayenne/conn/PoolManager.java:323:
warning: no @return
    public int getMaxConnections() {
               ^
/x1/jenkins/jenkins-slave/workspace/cayenne-master/cayenneTestConnection/hsql/jdk/jdk-1.8.0/label/Ubuntu/docs/doc/target/sources/org/apache/cayenne/conn/PoolManager.java:335:
warning: no @return
    public int getMinConnections() {
               ^
/x1/jenkins/jenkins-slave/workspace/cayenne-master/cayenneTestConnection/hsql/jdk/jdk-1.8.0/label/Ubuntu/docs/doc/target/sources/org/apache/cayenne/conn/PoolManager.java:347:
warning: no @return
    public String getDataSourceUrl() {
                  ^
/x1/jenkins/jenkins-slave/workspace/cayenne-master/cayenneTestConnection/hsql/jdk/jdk-1.8.0/label/Ubuntu/docs/doc/target/sources/org/apache/cayenne/conn/PoolManager.java:355:
warning: no @return
    public String getJdbcDriver() {
                  ^
/x1/jenkins/jenkins-slave/workspace/cayenne-master/cayenneTestConnection/hsql/jdk/jdk-1.8.0/label/Ubuntu/docs/doc/target/sources/org/apache/cayenne/conn/PoolManager.java:360:
warning: no @return
    public String getPassword() {
                  ^
/x1/jenkins/jenkins-slave/workspace/cayenne-master/cayenneTestConnection/hsql/jdk/jdk-1.8.0/label/Ubuntu/docs/doc/target/sources/org/apache/cayenne/conn/PoolManager.java:365:
warning: no @return
    public String getUserName() {
                  ^
/x1/jenkins/jenkins-slave/workspace/cayenne-master/cayenneTestConnection/hsql/jdk/jdk-1.8.0/label/Ubuntu/docs/doc/target/sources/org/apache/cayenne/conn/PoolManager.java:372:
warning: no @return
    public synchronized int getPoolSize() {
                            ^
/x1/jenkins/jenkins-slave/workspace/cayenne-master/cayenneTestConnection/hsql/jdk/jdk-1.8.0/label/Ubuntu/docs/doc/target/sources/org/apache/cayenne/conn/PoolManager.java:380:
warning: no @return
    public synchronized int getCurrentlyInUse() {
                            ^
/x1/jenkins/jenkins-slave/workspace/cayenne-master/cayenneTestConnection/hsql/jdk/jdk-1.8.0/label/Ubuntu/docs/doc/target/sources/org/apache/cayenne/conn/PoolManager.java:389:
warning: no @return
    public synchronized int getCurrentlyUnused() {
                            ^
/x1/jenkins/jenkins-slave/workspace/cayenne-master/cayenneTestConnection/hsql/jdk/jdk-1.8.0/label/Ubuntu/docs/doc/target/sources/org/apache/cayenne/conn/PoolManager.java:133:
warning: no @param for userName
    public PoolManager(ConnectionPoolDataSource poolDataSource, int minCons, int maxCons,
           ^
/x1/jenkins/jenkins-slave/workspace/cayenne-master/cayenneTestConnection/hsql/jdk/jdk-1.8.0/label/Ubuntu/docs/doc/target/sources/org/apache/cayenne/conn/PoolManager.java:133:
warning: no @param for password
    public PoolManager(ConnectionPoolDataSource poolDataSource, int minCons, int maxCons,
           ^
/x1/jenkins/jenkins-slave/workspace/cayenne-master/cayenneTestConnection/hsql/jdk/jdk-1.8.0/label/Ubuntu/docs/doc/target/sources/org/apache/cayenne/conn/PoolManager.java:150:
warning: no @param for userName
    public PoolManager(ConnectionPoolDataSource poolDataSource, int minCons, int maxCons,
           ^
/x1/jenkins/jenkins-slave/workspace/cayenne-master/cayenneTestConnection/hsql/jdk/jdk-1.8.0/label/Ubuntu/docs/doc/target/sources/org/apache/cayenne/conn/PoolManager.java:150:
warning: no @param for password
    public PoolManager(ConnectionPoolDataSource poolDataSource, int minCons, int maxCons,
           ^
/x1/jenkins/jenkins-slave/workspace/cayenne-master/cayenneTestConnection/hsql/jdk/jdk-1.8.0/label/Ubuntu/docs/doc/target/sources/org/apache/cayenne/conn/PoolManager.java:150:
warning: no @param for maxQueueWaitTime
    public PoolManager(ConnectionPoolDataSource poolDataSource, int minCons, int maxCons,
           ^
/x1/jenkins/jenkins-slave/workspace/cayenne-master/cayenneTestConnection/hsql/jdk/jdk-1.8.0/label/Ubuntu/docs/doc/target/sources/org/apache/cayenne/conn/PoolManager.java:89:
warning: no @param for jdbcDriver
    public PoolManager(String jdbcDriver, String dataSourceUrl, int minCons, int maxCons,
           ^
/x1/jenkins/jenkins-slave/workspace/cayenne-master/cayenneTestConnection/hsql/jdk/jdk-1.8.0/label/Ubuntu/docs/doc/target/sources/org/apache/cayenne/conn/PoolManager.java:89:
warning: no @param for dataSourceUrl
    public PoolManager(String jdbcDriver, String dataSourceUrl, int minCons, int maxCons,
           ^
/x1/jenkins/jenkins-slave/workspace/cayenne-master/cayenneTestConnection/hsql/jdk/jdk-1.8.0/label/Ubuntu/docs/doc/target/sources/org/apache/cayenne/conn/PoolManager.java:89:
warning: no @param for minCons
    public PoolManager(String jdbcDriver, String dataSourceUrl, int minCons, int maxCons,
           ^
/x1/jenkins/jenkins-slave/workspace/cayenne-master/cayenneTestConnection/hsql/jdk/jdk-1.8.0/label/Ubuntu/docs/doc/target/sources/org/apache/cayenne/conn/PoolManager.java:89:
warning: no @param for maxCons
    public PoolManager(String jdbcDriver, String dataSourceUrl, int minCons, int maxCons,
           ^
/x1/jenkins/jenkins-slave/workspace/cayenne-master/cayenneTestConnection/hsql/jdk/jdk-1.8.0/label/Ubuntu/docs/doc/target/sources/org/apache/cayenne/conn/PoolManager.java:89:
warning: no @param for userName
    public PoolManager(String jdbcDriver, String dataSourceUrl, int minCons, int maxCons,
           ^
/x1/jenkins/jenkins-slave/workspace/cayenne-master/cayenneTestConnection/hsql/jdk/jdk-1.8.0/label/Ubuntu/docs/doc/target/sources/org/apache/cayenne/conn/PoolManager.java:89:
warning: no @param for password
    public PoolManager(String jdbcDriver, String dataSourceUrl, int minCons, int maxCons,
           ^
/x1/jenkins/jenkins-slave/workspace/cayenne-master/cayenneTestConnection/hsql/jdk/jdk-1.8.0/label/Ubuntu/docs/doc/target/sources/org/apache/cayenne/conn/PoolManager.java:89:
warning: no @throws for java.sql.SQLException
    public PoolManager(String jdbcDriver, String dataSourceUrl, int minCons, int maxCons,
           ^
/x1/jenkins/jenkins-slave/workspace/cayenne-master/cayenneTestConnection/hsql/jdk/jdk-1.8.0/label/Ubuntu/docs/doc/target/sources/org/apache/cayenne/conn/PoolManager.java:99:
warning: no @param for jdbcDriver
    public PoolManager(String jdbcDriver, String dataSourceUrl, int minCons, int maxCons,
           ^
/x1/jenkins/jenkins-slave/workspace/cayenne-master/cayenneTestConnection/hsql/jdk/jdk-1.8.0/label/Ubuntu/docs/doc/target/sources/org/apache/cayenne/conn/PoolManager.java:99:
warning: no @param for dataSourceUrl
    public PoolManager(String jdbcDriver, String dataSourceUrl, int minCons, int maxCons,
           ^
/x1/jenkins/jenkins-slave/workspace/cayenne-master/cayenneTestConnection/hsql/jdk/jdk-1.8.0/label/Ubuntu/docs/doc/target/sources/org/apache/cayenne/conn/PoolManager.java:99:
warning: no @param for minCons
    public PoolManager(String jdbcDriver, String dataSourceUrl, int minCons, int maxCons,
           ^
/x1/jenkins/jenkins-slave/workspace/cayenne-master/cayenneTestConnection/hsql/jdk/jdk-1.8.0/label/Ubuntu/docs/doc/target/sources/org/apache/cayenne/conn/PoolManager.java:99:
warning: no @param for maxCons
    public PoolManager(String jdbcDriver, String dataSourceUrl, int minCons, int maxCons,
           ^
/x1/jenkins/jenkins-slave/workspace/cayenne-master/cayenneTestConnection/hsql/jdk/jdk-1.8.0/label/Ubuntu/docs/doc/target/sources/org/apache/cayenne/conn/PoolManager.java:99:
warning: no @param for userName
    public PoolManager(String jdbcDriver, String dataSourceUrl, int minCons, int maxCons,
           ^
/x1/jenkins/jenkins-slave/workspace/cayenne-master/cayenneTestConnection/hsql/jdk/jdk-1.8.0/label/Ubuntu/docs/doc/target/sources/org/apache/cayenne/conn/PoolManager.java:99:
warning: no @param for password
    public PoolManager(String jdbcDriver, String dataSourceUrl, int minCons, int maxCons,
           ^
/x1/jenkins/jenkins-slave/workspace/cayenne-master/cayenneTestConnection/hsql/jdk/jdk-1.8.0/label/Ubuntu/docs/doc/target/sources/org/apache/cayenne/conn/PoolManager.java:99:
warning: no @param for logger
    public PoolManager(String jdbcDriver, String dataSourceUrl, int minCons, int maxCons,
           ^
/x1/jenkins/jenkins-slave/workspace/cayenne-master/cayenneTestConnection/hsql/jdk/jdk-1.8.0/label/Ubuntu/docs/doc/target/sources/org/apache/cayenne/conn/PoolManager.java:99:
warning: no @param for maxQueueWaitTime
    public PoolManager(String jdbcDriver, String dataSourceUrl, int minCons, int maxCons,
           ^
/x1/jenkins/jenkins-slave/workspace/cayenne-master/cayenneTestConnection/hsql/jdk/jdk-1.8.0/label/Ubuntu/docs/doc/target/sources/org/apache/cayenne/conn/PoolManager.java:99:
warning: no @throws for java.sql.SQLException
    public PoolManager(String jdbcDriver, String dataSourceUrl, int minCons, int maxCons,
           ^
/x1/jenkins/jenkins-slave/workspace/cayenne-master/cayenneTestConnection/hsql/jdk/jdk-1.8.0/label/Ubuntu/docs/doc/target/sources/org/apache/cayenne/access/translator/select/DataObjectMatchTranslator.java:68:
warning: no @param for rel
    public void setRelationship(DbRelationship rel, String joinSplitAlias) {
                ^
/x1/jenkins/jenkins-slave/workspace/cayenne-master/cayenneTestConnection/hsql/jdk/jdk-1.8.0/label/Ubuntu/docs/doc/target/sources/org/apache/cayenne/access/translator/select/DataObjectMatchTranslator.java:68:
warning: no @param for joinSplitAlias
    public void setRelationship(DbRelationship rel, String joinSplitAlias) {
                ^
/x1/jenkins/jenkins-slave/workspace/cayenne-master/cayenneTestConnection/hsql/jdk/jdk-1.8.0/label/Ubuntu/docs/doc/target/sources/org/apache/cayenne/access/translator/select/DataObjectMatchTranslator.java:105:
warning: no @param for id
    public void setObjectId(ObjectId id) {
                ^
/x1/jenkins/jenkins-slave/workspace/cayenne-master/cayenneTestConnection/hsql/jdk/jdk-1.8.0/label/Ubuntu/docs/doc/target/sources/org/apache/cayenne/access/translator/select/DataObjectMatchTranslator.java:134:
warning: no @return
    public String getJoinSplitAlias() {
                  ^
/x1/jenkins/jenkins-slave/workspace/cayenne-master/cayenneTestConnection/hsql/jdk/jdk-1.8.0/label/Ubuntu/docs/doc/target/sources/org/apache/cayenne/access/translator/select/JoinStack.java:76:
warning: no @return
    protected int size() {
                  ^
/x1/jenkins/jenkins-slave/workspace/cayenne-master/cayenneTestConnection/hsql/jdk/jdk-1.8.0/label/Ubuntu/docs/doc/target/sources/org/apache/cayenne/access/translator/select/JoinStack.java:91:
warning: no @param for out
    protected void appendJoins(Appendable out) throws IOException {
                   ^
/x1/jenkins/jenkins-slave/workspace/cayenne-master/cayenneTestConnection/hsql/jdk/jdk-1.8.0/label/Ubuntu/docs/doc/target/sources/org/apache/cayenne/access/translator/select/JoinStack.java:91:
warning: no @throws for java.io.IOException
    protected void appendJoins(Appendable out) throws IOException {
                   ^
/x1/jenkins/jenkins-slave/workspace/cayenne-master/cayenneTestConnection/hsql/jdk/jdk-1.8.0/label/Ubuntu/docs/doc/target/sources/org/apache/cayenne/access/translator/select/JoinStack.java:162:
warning: no @param for out
    protected void appendQualifier(Appendable out, boolean firstQualifierElement) throws IOException
{
                   ^
/x1/jenkins/jenkins-slave/workspace/cayenne-master/cayenneTestConnection/hsql/jdk/jdk-1.8.0/label/Ubuntu/docs/doc/target/sources/org/apache/cayenne/access/translator/select/JoinStack.java:162:
warning: no @param for firstQualifierElement
    protected void appendQualifier(Appendable out, boolean firstQualifierElement) throws IOException
{
                   ^
/x1/jenkins/jenkins-slave/workspace/cayenne-master/cayenneTestConnection/hsql/jdk/jdk-1.8.0/label/Ubuntu/docs/doc/target/sources/org/apache/cayenne/access/translator/select/JoinStack.java:162:
warning: no @throws for java.io.IOException
    protected void appendQualifier(Appendable out, boolean firstQualifierElement) throws IOException
{
                   ^
/x1/jenkins/jenkins-slave/workspace/cayenne-master/cayenneTestConnection/hsql/jdk/jdk-1.8.0/label/Ubuntu/docs/doc/target/sources/org/apache/cayenne/access/translator/select/OrderingTranslator.java:119:
warning: no @return
    public List<String> getOrderByColumnList() {
                        ^
/x1/jenkins/jenkins-slave/workspace/cayenne-master/cayenneTestConnection/hsql/jdk/jdk-1.8.0/label/Ubuntu/docs/doc/target/sources/org/apache/cayenne/access/translator/select/QueryAssemblerHelper.java:76:
warning: no @param for <T>
    public <T extends Appendable> T appendPart(T out) throws IOException {
                                    ^
/x1/jenkins/jenkins-slave/workspace/cayenne-master/cayenneTestConnection/hsql/jdk/jdk-1.8.0/label/Ubuntu/docs/doc/target/sources/org/apache/cayenne/access/translator/select/QueryAssemblerHelper.java:76:
warning: no @param for out
    public <T extends Appendable> T appendPart(T out) throws IOException {
                                    ^
/x1/jenkins/jenkins-slave/workspace/cayenne-master/cayenneTestConnection/hsql/jdk/jdk-1.8.0/label/Ubuntu/docs/doc/target/sources/org/apache/cayenne/access/translator/select/QueryAssemblerHelper.java:76:
warning: no @return
    public <T extends Appendable> T appendPart(T out) throws IOException {
                                    ^
/x1/jenkins/jenkins-slave/workspace/cayenne-master/cayenneTestConnection/hsql/jdk/jdk-1.8.0/label/Ubuntu/docs/doc/target/sources/org/apache/cayenne/access/translator/select/QueryAssemblerHelper.java:76:
warning: no @throws for java.io.IOException
    public <T extends Appendable> T appendPart(T out) throws IOException {
                                    ^
/x1/jenkins/jenkins-slave/workspace/cayenne-master/cayenneTestConnection/hsql/jdk/jdk-1.8.0/label/Ubuntu/docs/doc/target/sources/org/apache/cayenne/access/translator/select/QueryAssemblerHelper.java:99:
warning: no @throws for java.io.IOException
    protected abstract void doAppendPart() throws IOException;
                            ^
/x1/jenkins/jenkins-slave/workspace/cayenne-master/cayenneTestConnection/hsql/jdk/jdk-1.8.0/label/Ubuntu/docs/doc/target/sources/org/apache/cayenne/access/translator/select/QueryAssemblerHelper.java:113:
warning: no @param for patternMatchNode
    protected void appendLikeEscapeCharacter(PatternMatchNode patternMatchNode) throws IOException
{
                   ^
/x1/jenkins/jenkins-slave/workspace/cayenne-master/cayenneTestConnection/hsql/jdk/jdk-1.8.0/label/Ubuntu/docs/doc/target/sources/org/apache/cayenne/access/translator/select/QueryAssemblerHelper.java:113:
warning: no @throws for java.io.IOException
    protected void appendLikeEscapeCharacter(PatternMatchNode patternMatchNode) throws IOException
{
                   ^
/x1/jenkins/jenkins-slave/workspace/cayenne-master/cayenneTestConnection/hsql/jdk/jdk-1.8.0/label/Ubuntu/docs/doc/target/sources/org/apache/cayenne/access/translator/select/QueryAssemblerHelper.java:130:
warning: no @param for pathExp
    protected void appendObjPath(Expression pathExp) throws IOException {
                   ^
/x1/jenkins/jenkins-slave/workspace/cayenne-master/cayenneTestConnection/hsql/jdk/jdk-1.8.0/label/Ubuntu/docs/doc/target/sources/org/apache/cayenne/access/translator/select/QueryAssemblerHelper.java:130:
warning: no @throws for java.io.IOException
    protected void appendObjPath(Expression pathExp) throws IOException {
                   ^
/x1/jenkins/jenkins-slave/workspace/cayenne-master/cayenneTestConnection/hsql/jdk/jdk-1.8.0/label/Ubuntu/docs/doc/target/sources/org/apache/cayenne/access/translator/select/QueryAssemblerHelper.java:269:
warning: no @param for parentExpression
    protected void appendLiteral(Object val, DbAttribute attr, Expression parentExpression)
throws IOException {
                   ^
/x1/jenkins/jenkins-slave/workspace/cayenne-master/cayenneTestConnection/hsql/jdk/jdk-1.8.0/label/Ubuntu/docs/doc/target/sources/org/apache/cayenne/access/translator/select/QueryAssemblerHelper.java:269:
warning: no @throws for java.io.IOException
    protected void appendLiteral(Object val, DbAttribute attr, Expression parentExpression)
throws IOException {
                   ^
/x1/jenkins/jenkins-slave/workspace/cayenne-master/cayenneTestConnection/hsql/jdk/jdk-1.8.0/label/Ubuntu/docs/doc/target/sources/org/apache/cayenne/access/translator/select/QueryAssemblerHelper.java:329:
warning: no @param for val
    protected void appendLiteralDirect(Object val, DbAttribute attr, Expression parentExpression)
throws IOException {
                   ^
/x1/jenkins/jenkins-slave/workspace/cayenne-master/cayenneTestConnection/hsql/jdk/jdk-1.8.0/label/Ubuntu/docs/doc/target/sources/org/apache/cayenne/access/translator/select/QueryAssemblerHelper.java:329:
warning: no @param for attr
    protected void appendLiteralDirect(Object val, DbAttribute attr, Expression parentExpression)
throws IOException {
                   ^
/x1/jenkins/jenkins-slave/workspace/cayenne-master/cayenneTestConnection/hsql/jdk/jdk-1.8.0/label/Ubuntu/docs/doc/target/sources/org/apache/cayenne/access/translator/select/QueryAssemblerHelper.java:329:
warning: no @param for parentExpression
    protected void appendLiteralDirect(Object val, DbAttribute attr, Expression parentExpression)
throws IOException {
                   ^
/x1/jenkins/jenkins-slave/workspace/cayenne-master/cayenneTestConnection/hsql/jdk/jdk-1.8.0/label/Ubuntu/docs/doc/target/sources/org/apache/cayenne/access/translator/select/QueryAssemblerHelper.java:329:
warning: no @throws for java.io.IOException
    protected void appendLiteralDirect(Object val, DbAttribute attr, Expression parentExpression)
throws IOException {
                   ^
/x1/jenkins/jenkins-slave/workspace/cayenne-master/cayenneTestConnection/hsql/jdk/jdk-1.8.0/label/Ubuntu/docs/doc/target/sources/org/apache/cayenne/access/translator/select/QueryAssemblerHelper.java:342:
warning: no @param for e
    protected DbAttribute paramsDbType(Expression e) {
                          ^
/x1/jenkins/jenkins-slave/workspace/cayenne-master/cayenneTestConnection/hsql/jdk/jdk-1.8.0/label/Ubuntu/docs/doc/target/sources/org/apache/cayenne/access/translator/select/QueryAssemblerHelper.java:342:
warning: no @return
    protected DbAttribute paramsDbType(Expression e) {
                          ^
/x1/jenkins/jenkins-slave/workspace/cayenne-master/cayenneTestConnection/hsql/jdk/jdk-1.8.0/label/Ubuntu/docs/doc/target/sources/org/apache/cayenne/access/translator/select/QueryAssemblerHelper.java:429:
warning: no @param for rel
    protected void processRelTermination(ObjRelationship rel, JoinType joinType, String joinSplitAlias)
                   ^
/x1/jenkins/jenkins-slave/workspace/cayenne-master/cayenneTestConnection/hsql/jdk/jdk-1.8.0/label/Ubuntu/docs/doc/target/sources/org/apache/cayenne/access/translator/select/QueryAssemblerHelper.java:429:
warning: no @param for joinType
    protected void processRelTermination(ObjRelationship rel, JoinType joinType, String joinSplitAlias)
                   ^
/x1/jenkins/jenkins-slave/workspace/cayenne-master/cayenneTestConnection/hsql/jdk/jdk-1.8.0/label/Ubuntu/docs/doc/target/sources/org/apache/cayenne/log/JdbcEventLogger.java:68:
error: reference not found
     *             {@link #logQueryParameters(String, List)}
                          ^
/x1/jenkins/jenkins-slave/workspace/cayenne-master/cayenneTestConnection/hsql/jdk/jdk-1.8.0/label/Ubuntu/docs/doc/target/sources/org/apache/cayenne/exp/parser/PatternMatchNode.java:58:
error: self-closing element not allowed
     * <p/>
       ^

Command line was: /x1/jenkins/jenkins-slave/tools/hudson.model.JDK/jdk-1.8.0/jre/../bin/javadoc
@options @argfile

Refer to the generated Javadoc files in '/x1/jenkins/jenkins-slave/workspace/cayenne-master/cayenneTestConnection/hsql/jdk/jdk-1.8.0/label/Ubuntu/docs/doc/target/site/apidocs/doc/api'
dir.

	at org.apache.maven.plugin.javadoc.AbstractJavadocMojo.executeJavadocCommandLine(AbstractJavadocMojo.java:5074)
	at org.apache.maven.plugin.javadoc.AbstractJavadocMojo.executeReport(AbstractJavadocMojo.java:1999)
	at org.apache.maven.plugin.javadoc.JavadocReport.generate(JavadocReport.java:130)
	at org.apache.maven.plugin.javadoc.JavadocReport.execute(JavadocReport.java:315)
	... 21 more
[ERROR] 
[ERROR] Re-run Maven using the -X switch to enable full debug logging.
[ERROR] 
[ERROR] For more information about the errors and possible solutions, please read the following
articles:
[ERROR] [Help 1] http://cwiki.apache.org/confluence/display/MAVEN/MojoExecutionException
[ERROR] 
[ERROR] After correcting the problems, you can resume the build with the command
[ERROR]   mvn <goals> -rf :cayenne-doc
Build step 'Invoke top-level Maven targets' marked build as failure

Mime
View raw message