cayenne-commits mailing list archives

Site index · List index
Message view « Date » · « Thread »
Top « Date » · « Thread »
From Apache Jenkins Server <jenk...@builds.apache.org>
Subject Build failed in Jenkins: Cayenne-31 » HSQLDB,JDK 1.7 (latest),Ubuntu #105
Date Wed, 21 May 2014 08:22:24 GMT
See <https://builds.apache.org/job/Cayenne-31/cayenneTestConnection=HSQLDB,jdk=JDK%201.7%20(latest),label=Ubuntu/105/>

------------------------------------------
[...truncated 8769 lines...]
855/1292 KB   
859/1292 KB   
863/1292 KB   
865/1292 KB   
868/1292 KB   
872/1292 KB   
876/1292 KB   
880/1292 KB   
881/1292 KB   
884/1292 KB   
888/1292 KB   
892/1292 KB   
896/1292 KB   
900/1292 KB   
904/1292 KB   
908/1292 KB   
912/1292 KB   
916/1292 KB   
920/1292 KB   
924/1292 KB   
928/1292 KB   
929/1292 KB   
933/1292 KB   
937/1292 KB   
941/1292 KB   
943/1292 KB   
946/1292 KB   
950/1292 KB   
954/1292 KB   
958/1292 KB   
962/1292 KB   
966/1292 KB   
970/1292 KB   
974/1292 KB   
978/1292 KB   
982/1292 KB   
986/1292 KB   
990/1292 KB   
993/1292 KB   
997/1292 KB   
1001/1292 KB   
1004/1292 KB   
1007/1292 KB   
1011/1292 KB   
1015/1292 KB   
1019/1292 KB   
1023/1292 KB   
1027/1292 KB   
1031/1292 KB   
1035/1292 KB   
1039/1292 KB   
1043/1292 KB   
1047/1292 KB   
1051/1292 KB   
1055/1292 KB   
1056/1292 KB   
1060/1292 KB   
1064/1292 KB   
1068/1292 KB   
1072/1292 KB   
1076/1292 KB   
1080/1292 KB   
1084/1292 KB   
1088/1292 KB   
1092/1292 KB   
1096/1292 KB   
1100/1292 KB   
1104/1292 KB   
1108/1292 KB   
1112/1292 KB   
1116/1292 KB   
1120/1292 KB   
1120/1292 KB   
1121/1292 KB   
1125/1292 KB   
1129/1292 KB   
1133/1292 KB   
1136/1292 KB   
1138/1292 KB   
1142/1292 KB   
1146/1292 KB   
1150/1292 KB   
1154/1292 KB   
1158/1292 KB   
1162/1292 KB   
1166/1292 KB   
1170/1292 KB   
1174/1292 KB   
1178/1292 KB   
1182/1292 KB   
1184/1292 KB   
1186/1292 KB   
1190/1292 KB   
1194/1292 KB   
1196/1292 KB   
1198/1292 KB   
1202/1292 KB   
1206/1292 KB   
1210/1292 KB   
1214/1292 KB   
1218/1292 KB   
1222/1292 KB   
1226/1292 KB   
1230/1292 KB   
1234/1292 KB   
1238/1292 KB   
1242/1292 KB   
1246/1292 KB   
1250/1292 KB   
1254/1292 KB   
1258/1292 KB   
1260/1292 KB   
1263/1292 KB   
1267/1292 KB   
1271/1292 KB   
1273/1292 KB   
1277/1292 KB   
1281/1292 KB   
1285/1292 KB   
1289/1292 KB   
1292/1292 KB   
               
Downloaded: http://maven.objectstyle.org/nexus/content/groups/cayenne-deps/org/apache/ant/ant/1.7.1/ant-1.7.1.jar
(1292 KB at 759.1 KB/sec)
[INFO] Executing tasks
[INFO] Executed tasks
[INFO] 
[INFO] --- maven-resources-plugin:2.4.3:resources (default-resources) @ cayenne-jdk1.5-unpublished
---
[INFO] Using 'UTF-8' encoding to copy filtered resources.
[INFO] Copying 16 resources
[INFO] 
[INFO] --- maven-compiler-plugin:2.3.2:compile (default-compile) @ cayenne-jdk1.5-unpublished
---
[WARNING] File encoding has not been set, using platform encoding ANSI_X3.4-1968, i.e. build
is platform dependent!
[INFO] Compiling 942 source files to <https://builds.apache.org/job/Cayenne-31/cayenneTestConnection=HSQLDB,jdk=JDK%201.7%20(latest),label=Ubuntu/ws/framework/cayenne-jdk1.5-unpublished/target/classes>
[INFO] 
[INFO] --- maven-resources-plugin:2.4.3:testResources (default-testResources) @ cayenne-jdk1.5-unpublished
---
[INFO] Using 'UTF-8' encoding to copy filtered resources.
[INFO] Copying 96 resources
[INFO] 
[INFO] --- maven-compiler-plugin:2.3.2:testCompile (default-testCompile) @ cayenne-jdk1.5-unpublished
---
[WARNING] File encoding has not been set, using platform encoding ANSI_X3.4-1968, i.e. build
is platform dependent!
[INFO] Compiling 958 source files to <https://builds.apache.org/job/Cayenne-31/cayenneTestConnection=HSQLDB,jdk=JDK%201.7%20(latest),label=Ubuntu/ws/framework/cayenne-jdk1.5-unpublished/target/test-classes>
[INFO] -------------------------------------------------------------
[ERROR] COMPILATION ERROR : 
[INFO] -------------------------------------------------------------
[ERROR] <https://builds.apache.org/job/Cayenne-31/cayenneTestConnection=HSQLDB,jdk=JDK%201.7%20(latest),label=Ubuntu/ws/framework/cayenne-jdk1.5-unpublished/src/test/java/org/apache/cayenne/access/DataContextPrefetchTest.java>:[35,29]
error: cannot find symbol
[ERROR]  package org.apache.cayenne.exp
<https://builds.apache.org/job/Cayenne-31/cayenneTestConnection=HSQLDB,jdk=JDK%201.7%20(latest),label=Ubuntu/ws/framework/cayenne-jdk1.5-unpublished/src/test/java/org/apache/cayenne/map/ObjEntityTest.java>:[411,71]
error: method getObjEntity in class EntityResolver cannot be applied to given types;
[ERROR]  actual argument Class<Artist> cannot be converted to String by method invocation
conversion
<https://builds.apache.org/job/Cayenne-31/cayenneTestConnection=HSQLDB,jdk=JDK%201.7%20(latest),label=Ubuntu/ws/framework/cayenne-jdk1.5-unpublished/src/test/java/org/apache/cayenne/access/DataContextPrefetchTest.java>:[511,87]
error: cannot find symbol
[ERROR]  class Artist
<https://builds.apache.org/job/Cayenne-31/cayenneTestConnection=HSQLDB,jdk=JDK%201.7%20(latest),label=Ubuntu/ws/framework/cayenne-jdk1.5-unpublished/src/test/java/org/apache/cayenne/access/DataContextPrefetchTest.java>:[511,29]
error: cannot find symbol
[ERROR]  class DataContextPrefetchTest
<https://builds.apache.org/job/Cayenne-31/cayenneTestConnection=HSQLDB,jdk=JDK%201.7%20(latest),label=Ubuntu/ws/framework/cayenne-jdk1.5-unpublished/src/test/java/org/apache/cayenne/access/DataContextPrefetchTest.java>:[513,19]
error: type SelectQuery does not take parameters
[ERROR] <https://builds.apache.org/job/Cayenne-31/cayenneTestConnection=HSQLDB,jdk=JDK%201.7%20(latest),label=Ubuntu/ws/framework/cayenne-jdk1.5-unpublished/src/test/java/org/apache/cayenne/access/DataContextPrefetchTest.java>:[513,47]
error: type SelectQuery does not take parameters
[ERROR] <https://builds.apache.org/job/Cayenne-31/cayenneTestConnection=HSQLDB,jdk=JDK%201.7%20(latest),label=Ubuntu/ws/framework/cayenne-jdk1.5-unpublished/src/test/java/org/apache/cayenne/access/DataContextPrefetchTest.java>:[514,28]
error: cannot find symbol
[INFO] 7 errors 
[INFO] -------------------------------------------------------------
[INFO] ------------------------------------------------------------------------
[INFO] Reactor Summary:
[INFO] 
[INFO] Cayenne ........................................... SUCCESS [10.305s]
[INFO] Common Unit Test Utilities ........................ SUCCESS [34.630s]
[INFO] Cayenne Internal Build Plugin ..................... SUCCESS [43.029s]
[INFO] Cayenne Build Tools Parent ........................ SUCCESS [0.004s]
[INFO] Cayenne License and Notice Bundle ................. SUCCESS [8.046s]
[INFO] Cayenne Dependency Injection Container ............ SUCCESS [2.888s]
[INFO] Cayenne Java 1.5 Unpublished ...................... FAILURE [39.874s]
[INFO] Cayenne WebObjects Compatibility Library .......... SKIPPED
[INFO] Cayenne Aggregated Server Jar ..................... SKIPPED
[INFO] Cayenne Aggregated Client Jar ..................... SKIPPED
[INFO] Cayenne Project ................................... SKIPPED
[INFO] Cayenne Tools ..................................... SKIPPED
[INFO] Library: cayenne-lifecycle ........................ SKIPPED
[INFO] Cayenne Maven Plugin .............................. SKIPPED
[INFO] Cayenne Framework Aggregator Project .............. SKIPPED
[INFO] Cayenne Integration Tests Parent .................. SKIPPED
[INFO] Integration Tests - Cayenne Runtime ............... SKIPPED
[INFO] Integration Tests - Cayenne Tools ................. SKIPPED
[INFO] Cayenne Modeler ................................... SKIPPED
[INFO] Cayenne Modeler Maven Plugin ...................... SKIPPED
[INFO] Cayenne Modeler Parent ............................ SKIPPED
[INFO] Cayenne Tutorial .................................. SKIPPED
[INFO] Cayenne ROP Server Tutorial ....................... SKIPPED
[INFO] Cayenne ROP Client Tutorial ....................... SKIPPED
[INFO] Cayenne Tutorials ................................. SKIPPED
[INFO] Cayenne Documentation ............................. SKIPPED
[INFO] Cayenne Documenation Parent ....................... SKIPPED
[INFO] Cayenne Docbook Documentation ..................... SKIPPED
[INFO] Docbook: Cayenne Stylesheets ...................... SKIPPED
[INFO] Docbook: Cayenne Guide ............................ SKIPPED
[INFO] Docbook: Getting Started with Cayenne ............. SKIPPED
[INFO] Docbook: Getting Started with Cayenne ROP ......... SKIPPED
[INFO] Docbook: Cayenne New Features and Upgrade Guide ... SKIPPED
[INFO] ------------------------------------------------------------------------
[INFO] BUILD FAILURE
[INFO] ------------------------------------------------------------------------
[INFO] Total time: 2:25.466s
[INFO] Finished at: Wed May 21 08:22:24 UTC 2014
[INFO] Final Memory: 42M/272M
[INFO] ------------------------------------------------------------------------
[ERROR] Failed to execute goal org.apache.maven.plugins:maven-compiler-plugin:2.3.2:testCompile
(default-testCompile) on project cayenne-jdk1.5-unpublished: Compilation failure: Compilation
failure:
[ERROR] <https://builds.apache.org/job/Cayenne-31/cayenneTestConnection=HSQLDB,jdk=JDK%201.7%20(latest),label=Ubuntu/ws/framework/cayenne-jdk1.5-unpublished/src/test/java/org/apache/cayenne/access/DataContextPrefetchTest.java>:[35,29]
error: cannot find symbol
[ERROR] package org.apache.cayenne.exp
[ERROR] <https://builds.apache.org/job/Cayenne-31/cayenneTestConnection=HSQLDB,jdk=JDK%201.7%20(latest),label=Ubuntu/ws/framework/cayenne-jdk1.5-unpublished/src/test/java/org/apache/cayenne/map/ObjEntityTest.java>:[411,71]
error: method getObjEntity in class EntityResolver cannot be applied to given types;
[ERROR] actual argument Class<Artist> cannot be converted to String by method invocation
conversion
[ERROR] <https://builds.apache.org/job/Cayenne-31/cayenneTestConnection=HSQLDB,jdk=JDK%201.7%20(latest),label=Ubuntu/ws/framework/cayenne-jdk1.5-unpublished/src/test/java/org/apache/cayenne/access/DataContextPrefetchTest.java>:[511,87]
error: cannot find symbol
[ERROR] class Artist
[ERROR] <https://builds.apache.org/job/Cayenne-31/cayenneTestConnection=HSQLDB,jdk=JDK%201.7%20(latest),label=Ubuntu/ws/framework/cayenne-jdk1.5-unpublished/src/test/java/org/apache/cayenne/access/DataContextPrefetchTest.java>:[511,29]
error: cannot find symbol
[ERROR] class DataContextPrefetchTest
[ERROR] <https://builds.apache.org/job/Cayenne-31/cayenneTestConnection=HSQLDB,jdk=JDK%201.7%20(latest),label=Ubuntu/ws/framework/cayenne-jdk1.5-unpublished/src/test/java/org/apache/cayenne/access/DataContextPrefetchTest.java>:[513,19]
error: type SelectQuery does not take parameters
[ERROR] <https://builds.apache.org/job/Cayenne-31/cayenneTestConnection=HSQLDB,jdk=JDK%201.7%20(latest),label=Ubuntu/ws/framework/cayenne-jdk1.5-unpublished/src/test/java/org/apache/cayenne/access/DataContextPrefetchTest.java>:[513,47]
error: type SelectQuery does not take parameters
[ERROR] <https://builds.apache.org/job/Cayenne-31/cayenneTestConnection=HSQLDB,jdk=JDK%201.7%20(latest),label=Ubuntu/ws/framework/cayenne-jdk1.5-unpublished/src/test/java/org/apache/cayenne/access/DataContextPrefetchTest.java>:[514,28]
error: cannot find symbol
[ERROR] -> [Help 1]
org.apache.maven.lifecycle.LifecycleExecutionException: Failed to execute goal org.apache.maven.plugins:maven-compiler-plugin:2.3.2:testCompile
(default-testCompile) on project cayenne-jdk1.5-unpublished: Compilation failure
	at org.apache.maven.lifecycle.internal.MojoExecutor.execute(MojoExecutor.java:213)
	at org.apache.maven.lifecycle.internal.MojoExecutor.execute(MojoExecutor.java:153)
	at org.apache.maven.lifecycle.internal.MojoExecutor.execute(MojoExecutor.java:145)
	at org.apache.maven.lifecycle.internal.LifecycleModuleBuilder.buildProject(LifecycleModuleBuilder.java:84)
	at org.apache.maven.lifecycle.internal.LifecycleModuleBuilder.buildProject(LifecycleModuleBuilder.java:59)
	at org.apache.maven.lifecycle.internal.LifecycleStarter.singleThreadedBuild(LifecycleStarter.java:183)
	at org.apache.maven.lifecycle.internal.LifecycleStarter.execute(LifecycleStarter.java:161)
	at org.apache.maven.DefaultMaven.doExecute(DefaultMaven.java:320)
	at org.apache.maven.DefaultMaven.execute(DefaultMaven.java:156)
	at org.apache.maven.cli.MavenCli.execute(MavenCli.java:537)
	at org.apache.maven.cli.MavenCli.doMain(MavenCli.java:196)
	at org.apache.maven.cli.MavenCli.main(MavenCli.java:141)
	at sun.reflect.NativeMethodAccessorImpl.invoke0(Native Method)
	at sun.reflect.NativeMethodAccessorImpl.invoke(NativeMethodAccessorImpl.java:57)
	at sun.reflect.DelegatingMethodAccessorImpl.invoke(DelegatingMethodAccessorImpl.java:43)
	at java.lang.reflect.Method.invoke(Method.java:606)
	at org.codehaus.plexus.classworlds.launcher.Launcher.launchEnhanced(Launcher.java:290)
	at org.codehaus.plexus.classworlds.launcher.Launcher.launch(Launcher.java:230)
	at org.codehaus.plexus.classworlds.launcher.Launcher.mainWithExitCode(Launcher.java:409)
	at org.codehaus.plexus.classworlds.launcher.Launcher.main(Launcher.java:352)
Caused by: org.apache.maven.plugin.CompilationFailureException: Compilation failure
	at org.apache.maven.plugin.AbstractCompilerMojo.execute(AbstractCompilerMojo.java:656)
	at org.apache.maven.plugin.TestCompilerMojo.execute(TestCompilerMojo.java:161)
	at org.apache.maven.plugin.DefaultBuildPluginManager.executeMojo(DefaultBuildPluginManager.java:101)
	at org.apache.maven.lifecycle.internal.MojoExecutor.execute(MojoExecutor.java:209)
	... 19 more
[ERROR] 
[ERROR] Re-run Maven using the -X switch to enable full debug logging.
[ERROR] 
[ERROR] For more information about the errors and possible solutions, please read the following
articles:
[ERROR] [Help 1] http://cwiki.apache.org/confluence/display/MAVEN/MojoFailureException
[ERROR] 
[ERROR] After correcting the problems, you can resume the build with the command
[ERROR]   mvn <goals> -rf :cayenne-jdk1.5-unpublished
Build step 'Invoke top-level Maven targets' marked build as failure

Mime
View raw message