cayenne-commits mailing list archives

Site index · List index
Message view « Date » · « Thread »
Top « Date » · « Thread »
From Apache Jenkins Server <jenk...@builds.apache.org>
Subject Build failed in Jenkins: Cayenne-31 » HSQLDB,JDK 1.6 (latest),Ubuntu #105
Date Wed, 21 May 2014 08:22:12 GMT
See <https://builds.apache.org/job/Cayenne-31/cayenneTestConnection=HSQLDB,jdk=JDK%201.6%20(latest),label=Ubuntu/105/>

------------------------------------------
[...truncated 8853 lines...]
891/1292 KB   
895/1292 KB   
899/1292 KB   
903/1292 KB   
907/1292 KB   
911/1292 KB   
915/1292 KB   
919/1292 KB   
923/1292 KB   
927/1292 KB   
931/1292 KB   
931/1292 KB   
935/1292 KB   
939/1292 KB   
943/1292 KB   
947/1292 KB   
950/1292 KB   
954/1292 KB   
958/1292 KB   
962/1292 KB   
966/1292 KB   
970/1292 KB   
974/1292 KB   
978/1292 KB   
978/1292 KB   
982/1292 KB   
986/1292 KB   
990/1292 KB   
994/1292 KB   
995/1292 KB   
998/1292 KB   
1002/1292 KB   
1006/1292 KB   
1010/1292 KB   
1014/1292 KB   
1018/1292 KB   
1022/1292 KB   
1025/1292 KB   
1029/1292 KB   
1029/1292 KB   
1033/1292 KB   
1037/1292 KB   
1041/1292 KB   
1045/1292 KB   
1049/1292 KB   
1053/1292 KB   
1057/1292 KB   
1061/1292 KB   
1065/1292 KB   
1069/1292 KB   
1070/1292 KB   
1074/1292 KB   
1078/1292 KB   
1082/1292 KB   
1086/1292 KB   
1090/1292 KB   
1094/1292 KB   
1098/1292 KB   
1102/1292 KB   
1106/1292 KB   
1110/1292 KB   
1114/1292 KB   
1116/1292 KB   
1118/1292 KB   
1121/1292 KB   
1122/1292 KB   
1124/1292 KB   
1128/1292 KB   
1132/1292 KB   
1136/1292 KB   
1140/1292 KB   
1144/1292 KB   
1148/1292 KB   
1152/1292 KB   
1156/1292 KB   
1160/1292 KB   
1164/1292 KB   
1165/1292 KB   
1166/1292 KB   
1170/1292 KB   
1174/1292 KB   
1178/1292 KB   
1182/1292 KB   
1186/1292 KB   
1190/1292 KB   
1194/1292 KB   
1198/1292 KB   
1202/1292 KB   
1206/1292 KB   
1210/1292 KB   
1213/1292 KB   
1217/1292 KB   
1221/1292 KB   
1221/1292 KB   
1225/1292 KB   
1229/1292 KB   
1233/1292 KB   
1237/1292 KB   
1241/1292 KB   
1245/1292 KB   
1249/1292 KB   
1253/1292 KB   
1257/1292 KB   
1258/1292 KB   
1262/1292 KB   
1266/1292 KB   
1270/1292 KB   
1274/1292 KB   
1278/1292 KB   
1282/1292 KB   
1286/1292 KB   
1290/1292 KB   
1292/1292 KB   
               
Downloaded: http://maven.objectstyle.org/nexus/content/groups/cayenne-deps/org/apache/ant/ant/1.7.1/ant-1.7.1.jar
(1292 KB at 400.7 KB/sec)
[INFO] Executing tasks
[INFO] Executed tasks
[INFO] 
[INFO] --- maven-resources-plugin:2.4.3:resources (default-resources) @ cayenne-jdk1.5-unpublished
---
[INFO] Using 'UTF-8' encoding to copy filtered resources.
[INFO] Copying 16 resources
[INFO] 
[INFO] --- maven-compiler-plugin:2.3.2:compile (default-compile) @ cayenne-jdk1.5-unpublished
---
[WARNING] File encoding has not been set, using platform encoding ANSI_X3.4-1968, i.e. build
is platform dependent!
[INFO] Compiling 942 source files to <https://builds.apache.org/job/Cayenne-31/cayenneTestConnection=HSQLDB,jdk=JDK%201.6%20(latest),label=Ubuntu/ws/framework/cayenne-jdk1.5-unpublished/target/classes>
[INFO] 
[INFO] --- maven-resources-plugin:2.4.3:testResources (default-testResources) @ cayenne-jdk1.5-unpublished
---
[INFO] Using 'UTF-8' encoding to copy filtered resources.
[INFO] Copying 96 resources
[INFO] 
[INFO] --- maven-compiler-plugin:2.3.2:testCompile (default-testCompile) @ cayenne-jdk1.5-unpublished
---
[WARNING] File encoding has not been set, using platform encoding ANSI_X3.4-1968, i.e. build
is platform dependent!
[INFO] Compiling 958 source files to <https://builds.apache.org/job/Cayenne-31/cayenneTestConnection=HSQLDB,jdk=JDK%201.6%20(latest),label=Ubuntu/ws/framework/cayenne-jdk1.5-unpublished/target/test-classes>
[INFO] -------------------------------------------------------------
[ERROR] COMPILATION ERROR : 
[INFO] -------------------------------------------------------------
[ERROR] <https://builds.apache.org/job/Cayenne-31/cayenneTestConnection=HSQLDB,jdk=JDK%201.6%20(latest),label=Ubuntu/ws/framework/cayenne-jdk1.5-unpublished/src/test/java/org/apache/cayenne/access/DataContextPrefetchTest.java>:[35,29]
cannot find symbol
symbol  : class Property
location: package org.apache.cayenne.exp
[ERROR] <https://builds.apache.org/job/Cayenne-31/cayenneTestConnection=HSQLDB,jdk=JDK%201.6%20(latest),label=Ubuntu/ws/framework/cayenne-jdk1.5-unpublished/src/test/java/org/apache/cayenne/access/DataContextPrefetchTest.java>:[511,87]
cannot find symbol
symbol  : variable ARTIST_NAME
location: class org.apache.cayenne.testdo.testmap.Artist
[ERROR] <https://builds.apache.org/job/Cayenne-31/cayenneTestConnection=HSQLDB,jdk=JDK%201.6%20(latest),label=Ubuntu/ws/framework/cayenne-jdk1.5-unpublished/src/test/java/org/apache/cayenne/access/DataContextPrefetchTest.java>:[511,29]
cannot find symbol
symbol  : class Property
location: class org.apache.cayenne.access.DataContextPrefetchTest
[ERROR] <https://builds.apache.org/job/Cayenne-31/cayenneTestConnection=HSQLDB,jdk=JDK%201.6%20(latest),label=Ubuntu/ws/framework/cayenne-jdk1.5-unpublished/src/test/java/org/apache/cayenne/access/DataContextPrefetchTest.java>:[513,19]
type org.apache.cayenne.query.SelectQuery does not take parameters
[ERROR] <https://builds.apache.org/job/Cayenne-31/cayenneTestConnection=HSQLDB,jdk=JDK%201.6%20(latest),label=Ubuntu/ws/framework/cayenne-jdk1.5-unpublished/src/test/java/org/apache/cayenne/access/DataContextPrefetchTest.java>:[513,47]
type org.apache.cayenne.query.SelectQuery does not take parameters
[ERROR] <https://builds.apache.org/job/Cayenne-31/cayenneTestConnection=HSQLDB,jdk=JDK%201.6%20(latest),label=Ubuntu/ws/framework/cayenne-jdk1.5-unpublished/src/test/java/org/apache/cayenne/access/DataContextPrefetchTest.java>:[514,28]
cannot find symbol
symbol  : variable PAINTING_ARRAY
location: class org.apache.cayenne.testdo.testmap.Artist
[ERROR] <https://builds.apache.org/job/Cayenne-31/cayenneTestConnection=HSQLDB,jdk=JDK%201.6%20(latest),label=Ubuntu/ws/framework/cayenne-jdk1.5-unpublished/src/test/java/org/apache/cayenne/map/ObjEntityTest.java>:[411,71]
getObjEntity(java.lang.String) in org.apache.cayenne.map.EntityResolver cannot be applied
to (java.lang.Class<org.apache.cayenne.testdo.testmap.Artist>)
[INFO] 7 errors 
[INFO] -------------------------------------------------------------
[INFO] ------------------------------------------------------------------------
[INFO] Reactor Summary:
[INFO] 
[INFO] Cayenne ........................................... SUCCESS [10.880s]
[INFO] Common Unit Test Utilities ........................ SUCCESS [32.006s]
[INFO] Cayenne Internal Build Plugin ..................... SUCCESS [42.994s]
[INFO] Cayenne Build Tools Parent ........................ SUCCESS [0.004s]
[INFO] Cayenne License and Notice Bundle ................. SUCCESS [7.419s]
[INFO] Cayenne Dependency Injection Container ............ SUCCESS [2.933s]
[INFO] Cayenne Java 1.5 Unpublished ...................... FAILURE [42.759s]
[INFO] Cayenne WebObjects Compatibility Library .......... SKIPPED
[INFO] Cayenne Aggregated Server Jar ..................... SKIPPED
[INFO] Cayenne Aggregated Client Jar ..................... SKIPPED
[INFO] Cayenne Project ................................... SKIPPED
[INFO] Cayenne Tools ..................................... SKIPPED
[INFO] Library: cayenne-lifecycle ........................ SKIPPED
[INFO] Cayenne Maven Plugin .............................. SKIPPED
[INFO] Cayenne Framework Aggregator Project .............. SKIPPED
[INFO] Cayenne Integration Tests Parent .................. SKIPPED
[INFO] Integration Tests - Cayenne Runtime ............... SKIPPED
[INFO] Integration Tests - Cayenne Tools ................. SKIPPED
[INFO] Cayenne Modeler ................................... SKIPPED
[INFO] Cayenne Modeler Maven Plugin ...................... SKIPPED
[INFO] Cayenne Modeler Parent ............................ SKIPPED
[INFO] Cayenne Tutorial .................................. SKIPPED
[INFO] Cayenne ROP Server Tutorial ....................... SKIPPED
[INFO] Cayenne ROP Client Tutorial ....................... SKIPPED
[INFO] Cayenne Tutorials ................................. SKIPPED
[INFO] Cayenne Documentation ............................. SKIPPED
[INFO] Cayenne Documenation Parent ....................... SKIPPED
[INFO] Cayenne Docbook Documentation ..................... SKIPPED
[INFO] Docbook: Cayenne Stylesheets ...................... SKIPPED
[INFO] Docbook: Cayenne Guide ............................ SKIPPED
[INFO] Docbook: Getting Started with Cayenne ............. SKIPPED
[INFO] Docbook: Getting Started with Cayenne ROP ......... SKIPPED
[INFO] Docbook: Cayenne New Features and Upgrade Guide ... SKIPPED
[INFO] ------------------------------------------------------------------------
[INFO] BUILD FAILURE
[INFO] ------------------------------------------------------------------------
[INFO] Total time: 2:25.250s
[INFO] Finished at: Wed May 21 08:22:12 UTC 2014
[INFO] Final Memory: 39M/167M
[INFO] ------------------------------------------------------------------------
[ERROR] Failed to execute goal org.apache.maven.plugins:maven-compiler-plugin:2.3.2:testCompile
(default-testCompile) on project cayenne-jdk1.5-unpublished: Compilation failure: Compilation
failure:
[ERROR] <https://builds.apache.org/job/Cayenne-31/cayenneTestConnection=HSQLDB,jdk=JDK%201.6%20(latest),label=Ubuntu/ws/framework/cayenne-jdk1.5-unpublished/src/test/java/org/apache/cayenne/access/DataContextPrefetchTest.java>:[35,29]
cannot find symbol
[ERROR] symbol  : class Property
[ERROR] location: package org.apache.cayenne.exp
[ERROR] <https://builds.apache.org/job/Cayenne-31/cayenneTestConnection=HSQLDB,jdk=JDK%201.6%20(latest),label=Ubuntu/ws/framework/cayenne-jdk1.5-unpublished/src/test/java/org/apache/cayenne/access/DataContextPrefetchTest.java>:[511,87]
cannot find symbol
[ERROR] symbol  : variable ARTIST_NAME
[ERROR] location: class org.apache.cayenne.testdo.testmap.Artist
[ERROR] <https://builds.apache.org/job/Cayenne-31/cayenneTestConnection=HSQLDB,jdk=JDK%201.6%20(latest),label=Ubuntu/ws/framework/cayenne-jdk1.5-unpublished/src/test/java/org/apache/cayenne/access/DataContextPrefetchTest.java>:[511,29]
cannot find symbol
[ERROR] symbol  : class Property
[ERROR] location: class org.apache.cayenne.access.DataContextPrefetchTest
[ERROR] <https://builds.apache.org/job/Cayenne-31/cayenneTestConnection=HSQLDB,jdk=JDK%201.6%20(latest),label=Ubuntu/ws/framework/cayenne-jdk1.5-unpublished/src/test/java/org/apache/cayenne/access/DataContextPrefetchTest.java>:[513,19]
type org.apache.cayenne.query.SelectQuery does not take parameters
[ERROR] <https://builds.apache.org/job/Cayenne-31/cayenneTestConnection=HSQLDB,jdk=JDK%201.6%20(latest),label=Ubuntu/ws/framework/cayenne-jdk1.5-unpublished/src/test/java/org/apache/cayenne/access/DataContextPrefetchTest.java>:[513,47]
type org.apache.cayenne.query.SelectQuery does not take parameters
[ERROR] <https://builds.apache.org/job/Cayenne-31/cayenneTestConnection=HSQLDB,jdk=JDK%201.6%20(latest),label=Ubuntu/ws/framework/cayenne-jdk1.5-unpublished/src/test/java/org/apache/cayenne/access/DataContextPrefetchTest.java>:[514,28]
cannot find symbol
[ERROR] symbol  : variable PAINTING_ARRAY
[ERROR] location: class org.apache.cayenne.testdo.testmap.Artist
[ERROR] <https://builds.apache.org/job/Cayenne-31/cayenneTestConnection=HSQLDB,jdk=JDK%201.6%20(latest),label=Ubuntu/ws/framework/cayenne-jdk1.5-unpublished/src/test/java/org/apache/cayenne/map/ObjEntityTest.java>:[411,71]
getObjEntity(java.lang.String) in org.apache.cayenne.map.EntityResolver cannot be applied
to (java.lang.Class<org.apache.cayenne.testdo.testmap.Artist>)
[ERROR] -> [Help 1]
org.apache.maven.lifecycle.LifecycleExecutionException: Failed to execute goal org.apache.maven.plugins:maven-compiler-plugin:2.3.2:testCompile
(default-testCompile) on project cayenne-jdk1.5-unpublished: Compilation failure
	at org.apache.maven.lifecycle.internal.MojoExecutor.execute(MojoExecutor.java:213)
	at org.apache.maven.lifecycle.internal.MojoExecutor.execute(MojoExecutor.java:153)
	at org.apache.maven.lifecycle.internal.MojoExecutor.execute(MojoExecutor.java:145)
	at org.apache.maven.lifecycle.internal.LifecycleModuleBuilder.buildProject(LifecycleModuleBuilder.java:84)
	at org.apache.maven.lifecycle.internal.LifecycleModuleBuilder.buildProject(LifecycleModuleBuilder.java:59)
	at org.apache.maven.lifecycle.internal.LifecycleStarter.singleThreadedBuild(LifecycleStarter.java:183)
	at org.apache.maven.lifecycle.internal.LifecycleStarter.execute(LifecycleStarter.java:161)
	at org.apache.maven.DefaultMaven.doExecute(DefaultMaven.java:320)
	at org.apache.maven.DefaultMaven.execute(DefaultMaven.java:156)
	at org.apache.maven.cli.MavenCli.execute(MavenCli.java:537)
	at org.apache.maven.cli.MavenCli.doMain(MavenCli.java:196)
	at org.apache.maven.cli.MavenCli.main(MavenCli.java:141)
	at sun.reflect.NativeMethodAccessorImpl.invoke0(Native Method)
	at sun.reflect.NativeMethodAccessorImpl.invoke(NativeMethodAccessorImpl.java:39)
	at sun.reflect.DelegatingMethodAccessorImpl.invoke(DelegatingMethodAccessorImpl.java:25)
	at java.lang.reflect.Method.invoke(Method.java:597)
	at org.codehaus.plexus.classworlds.launcher.Launcher.launchEnhanced(Launcher.java:290)
	at org.codehaus.plexus.classworlds.launcher.Launcher.launch(Launcher.java:230)
	at org.codehaus.plexus.classworlds.launcher.Launcher.mainWithExitCode(Launcher.java:409)
	at org.codehaus.plexus.classworlds.launcher.Launcher.main(Launcher.java:352)
Caused by: org.apache.maven.plugin.CompilationFailureException: Compilation failure
	at org.apache.maven.plugin.AbstractCompilerMojo.execute(AbstractCompilerMojo.java:656)
	at org.apache.maven.plugin.TestCompilerMojo.execute(TestCompilerMojo.java:161)
	at org.apache.maven.plugin.DefaultBuildPluginManager.executeMojo(DefaultBuildPluginManager.java:101)
	at org.apache.maven.lifecycle.internal.MojoExecutor.execute(MojoExecutor.java:209)
	... 19 more
[ERROR] 
[ERROR] Re-run Maven using the -X switch to enable full debug logging.
[ERROR] 
[ERROR] For more information about the errors and possible solutions, please read the following
articles:
[ERROR] [Help 1] http://cwiki.apache.org/confluence/display/MAVEN/MojoFailureException
[ERROR] 
[ERROR] After correcting the problems, you can resume the build with the command
[ERROR]   mvn <goals> -rf :cayenne-jdk1.5-unpublished
Build step 'Invoke top-level Maven targets' marked build as failure

Mime
View raw message