cayenne-commits mailing list archives

Site index · List index
Message view « Date » · « Thread »
Top « Date » · « Thread »
From Apache Jenkins Server <jenk...@builds.apache.org>
Subject Build failed in Jenkins: Cayenne-31 » derby,JDK 1.7 (latest),Ubuntu #105
Date Wed, 21 May 2014 08:24:02 GMT
See <https://builds.apache.org/job/Cayenne-31/cayenneTestConnection=derby,jdk=JDK%201.7%20(latest),label=Ubuntu/105/>

------------------------------------------
[...truncated 9503 lines...]
853/1292 KB   
857/1292 KB   
861/1292 KB   
863/1292 KB   
864/1292 KB   
867/1292 KB   
871/1292 KB   
875/1292 KB   
879/1292 KB   
883/1292 KB   
887/1292 KB   
888/1292 KB   
892/1292 KB   
896/1292 KB   
900/1292 KB   
904/1292 KB   
908/1292 KB   
912/1292 KB   
916/1292 KB   
920/1292 KB   
924/1292 KB   
926/1292 KB   
930/1292 KB   
934/1292 KB   
938/1292 KB   
942/1292 KB   
946/1292 KB   
950/1292 KB   
953/1292 KB   
955/1292 KB   
959/1292 KB   
963/1292 KB   
967/1292 KB   
971/1292 KB   
975/1292 KB   
979/1292 KB   
983/1292 KB   
987/1292 KB   
990/1292 KB   
994/1292 KB   
998/1292 KB   
1002/1292 KB   
1006/1292 KB   
1010/1292 KB   
1014/1292 KB   
1017/1292 KB   
1020/1292 KB   
1024/1292 KB   
1028/1292 KB   
1032/1292 KB   
1036/1292 KB   
1040/1292 KB   
1044/1292 KB   
1048/1292 KB   
1052/1292 KB   
1054/1292 KB   
1055/1292 KB   
1059/1292 KB   
1063/1292 KB   
1067/1292 KB   
1071/1292 KB   
1075/1292 KB   
1079/1292 KB   
1083/1292 KB   
1083/1292 KB   
1087/1292 KB   
1091/1292 KB   
1095/1292 KB   
1099/1292 KB   
1103/1292 KB   
1107/1292 KB   
1111/1292 KB   
1115/1292 KB   
1117/1292 KB   
1121/1292 KB   
1125/1292 KB   
1129/1292 KB   
1133/1292 KB   
1137/1292 KB   
1141/1292 KB   
1145/1292 KB   
1148/1292 KB   
1150/1292 KB   
1154/1292 KB   
1158/1292 KB   
1162/1292 KB   
1166/1292 KB   
1170/1292 KB   
1174/1292 KB   
1178/1292 KB   
1181/1292 KB   
1185/1292 KB   
1189/1292 KB   
1193/1292 KB   
1197/1292 KB   
1201/1292 KB   
1205/1292 KB   
1209/1292 KB   
1211/1292 KB   
1215/1292 KB   
1219/1292 KB   
1223/1292 KB   
1227/1292 KB   
1231/1292 KB   
1235/1292 KB   
1239/1292 KB   
1243/1292 KB   
1247/1292 KB   
1251/1292 KB   
1255/1292 KB   
1259/1292 KB   
1263/1292 KB   
1267/1292 KB   
1267/1292 KB   
1270/1292 KB   
1274/1292 KB   
1278/1292 KB   
1282/1292 KB   
1286/1292 KB   
1290/1292 KB   
1292/1292 KB   
               
Downloaded: http://maven.objectstyle.org/nexus/content/groups/cayenne-deps/org/apache/ant/ant/1.7.1/ant-1.7.1.jar
(1292 KB at 703.3 KB/sec)
[INFO] Executing tasks
[INFO] Executed tasks
[INFO] 
[INFO] --- maven-resources-plugin:2.4.3:resources (default-resources) @ cayenne-jdk1.5-unpublished
---
[INFO] Using 'UTF-8' encoding to copy filtered resources.
[INFO] Copying 16 resources
[INFO] 
[INFO] --- maven-compiler-plugin:2.3.2:compile (default-compile) @ cayenne-jdk1.5-unpublished
---
[WARNING] File encoding has not been set, using platform encoding ANSI_X3.4-1968, i.e. build
is platform dependent!
[INFO] Compiling 942 source files to /home/hudson/jenkins-slave/workspace/Cayenne-31/cayenneTestConnection/derby/jdk/JDK
1.7 (latest)/label/Ubuntu/framework/cayenne-jdk1.5-unpublished/target/classes
[INFO] 
[INFO] --- maven-resources-plugin:2.4.3:testResources (default-testResources) @ cayenne-jdk1.5-unpublished
---
[INFO] Using 'UTF-8' encoding to copy filtered resources.
[INFO] Copying 96 resources
[INFO] 
[INFO] --- maven-compiler-plugin:2.3.2:testCompile (default-testCompile) @ cayenne-jdk1.5-unpublished
---
[WARNING] File encoding has not been set, using platform encoding ANSI_X3.4-1968, i.e. build
is platform dependent!
[INFO] Compiling 958 source files to /home/hudson/jenkins-slave/workspace/Cayenne-31/cayenneTestConnection/derby/jdk/JDK
1.7 (latest)/label/Ubuntu/framework/cayenne-jdk1.5-unpublished/target/test-classes
[INFO] -------------------------------------------------------------
[ERROR] COMPILATION ERROR : 
[INFO] -------------------------------------------------------------
[ERROR] /home/hudson/jenkins-slave/workspace/Cayenne-31/cayenneTestConnection/derby/jdk/JDK
1.7 (latest)/label/Ubuntu/framework/cayenne-jdk1.5-unpublished/src/test/java/org/apache/cayenne/access/DataContextPrefetchTest.java:[35,29]
error: cannot find symbol
[ERROR]  package org.apache.cayenne.exp
/home/hudson/jenkins-slave/workspace/Cayenne-31/cayenneTestConnection/derby/jdk/JDK 1.7 (latest)/label/Ubuntu/framework/cayenne-jdk1.5-unpublished/src/test/java/org/apache/cayenne/map/ObjEntityTest.java:[411,71]
error: method getObjEntity in class EntityResolver cannot be applied to given types;
[ERROR]  actual argument Class<Artist> cannot be converted to String by method invocation
conversion
/home/hudson/jenkins-slave/workspace/Cayenne-31/cayenneTestConnection/derby/jdk/JDK 1.7 (latest)/label/Ubuntu/framework/cayenne-jdk1.5-unpublished/src/test/java/org/apache/cayenne/access/DataContextPrefetchTest.java:[511,87]
error: cannot find symbol
[ERROR]  class Artist
/home/hudson/jenkins-slave/workspace/Cayenne-31/cayenneTestConnection/derby/jdk/JDK 1.7 (latest)/label/Ubuntu/framework/cayenne-jdk1.5-unpublished/src/test/java/org/apache/cayenne/access/DataContextPrefetchTest.java:[511,29]
error: cannot find symbol
[ERROR]  class DataContextPrefetchTest
/home/hudson/jenkins-slave/workspace/Cayenne-31/cayenneTestConnection/derby/jdk/JDK 1.7 (latest)/label/Ubuntu/framework/cayenne-jdk1.5-unpublished/src/test/java/org/apache/cayenne/access/DataContextPrefetchTest.java:[513,19]
error: type SelectQuery does not take parameters
[ERROR] /home/hudson/jenkins-slave/workspace/Cayenne-31/cayenneTestConnection/derby/jdk/JDK
1.7 (latest)/label/Ubuntu/framework/cayenne-jdk1.5-unpublished/src/test/java/org/apache/cayenne/access/DataContextPrefetchTest.java:[513,47]
error: type SelectQuery does not take parameters
[ERROR] /home/hudson/jenkins-slave/workspace/Cayenne-31/cayenneTestConnection/derby/jdk/JDK
1.7 (latest)/label/Ubuntu/framework/cayenne-jdk1.5-unpublished/src/test/java/org/apache/cayenne/access/DataContextPrefetchTest.java:[514,28]
error: cannot find symbol
[INFO] 7 errors 
[INFO] -------------------------------------------------------------
[INFO] ------------------------------------------------------------------------
[INFO] Reactor Summary:
[INFO] 
[INFO] Cayenne ........................................... SUCCESS [11.424s]
[INFO] Common Unit Test Utilities ........................ SUCCESS [37.646s]
[INFO] Cayenne Internal Build Plugin ..................... SUCCESS [47.419s]
[INFO] Cayenne Build Tools Parent ........................ SUCCESS [0.012s]
[INFO] Cayenne License and Notice Bundle ................. SUCCESS [7.721s]
[INFO] Cayenne Dependency Injection Container ............ SUCCESS [3.078s]
[INFO] Cayenne Java 1.5 Unpublished ...................... FAILURE [40.903s]
[INFO] Cayenne WebObjects Compatibility Library .......... SKIPPED
[INFO] Cayenne Aggregated Server Jar ..................... SKIPPED
[INFO] Cayenne Aggregated Client Jar ..................... SKIPPED
[INFO] Cayenne Project ................................... SKIPPED
[INFO] Cayenne Tools ..................................... SKIPPED
[INFO] Library: cayenne-lifecycle ........................ SKIPPED
[INFO] Cayenne Maven Plugin .............................. SKIPPED
[INFO] Cayenne Framework Aggregator Project .............. SKIPPED
[INFO] Cayenne Integration Tests Parent .................. SKIPPED
[INFO] Integration Tests - Cayenne Runtime ............... SKIPPED
[INFO] Integration Tests - Cayenne Tools ................. SKIPPED
[INFO] Cayenne Modeler ................................... SKIPPED
[INFO] Cayenne Modeler Maven Plugin ...................... SKIPPED
[INFO] Cayenne Modeler Parent ............................ SKIPPED
[INFO] Cayenne Tutorial .................................. SKIPPED
[INFO] Cayenne ROP Server Tutorial ....................... SKIPPED
[INFO] Cayenne ROP Client Tutorial ....................... SKIPPED
[INFO] Cayenne Tutorials ................................. SKIPPED
[INFO] Cayenne Documentation ............................. SKIPPED
[INFO] Cayenne Documenation Parent ....................... SKIPPED
[INFO] Cayenne Docbook Documentation ..................... SKIPPED
[INFO] Docbook: Cayenne Stylesheets ...................... SKIPPED
[INFO] Docbook: Cayenne Guide ............................ SKIPPED
[INFO] Docbook: Getting Started with Cayenne ............. SKIPPED
[INFO] Docbook: Getting Started with Cayenne ROP ......... SKIPPED
[INFO] Docbook: Cayenne New Features and Upgrade Guide ... SKIPPED
[INFO] ------------------------------------------------------------------------
[INFO] BUILD FAILURE
[INFO] ------------------------------------------------------------------------
[INFO] Total time: 2:36.609s
[INFO] Finished at: Wed May 21 08:24:02 UTC 2014
[INFO] Final Memory: 42M/238M
[INFO] ------------------------------------------------------------------------
[ERROR] Failed to execute goal org.apache.maven.plugins:maven-compiler-plugin:2.3.2:testCompile
(default-testCompile) on project cayenne-jdk1.5-unpublished: Compilation failure: Compilation
failure:
[ERROR] /home/hudson/jenkins-slave/workspace/Cayenne-31/cayenneTestConnection/derby/jdk/JDK
1.7 (latest)/label/Ubuntu/framework/cayenne-jdk1.5-unpublished/src/test/java/org/apache/cayenne/access/DataContextPrefetchTest.java:[35,29]
error: cannot find symbol
[ERROR] package org.apache.cayenne.exp
[ERROR] /home/hudson/jenkins-slave/workspace/Cayenne-31/cayenneTestConnection/derby/jdk/JDK
1.7 (latest)/label/Ubuntu/framework/cayenne-jdk1.5-unpublished/src/test/java/org/apache/cayenne/map/ObjEntityTest.java:[411,71]
error: method getObjEntity in class EntityResolver cannot be applied to given types;
[ERROR] actual argument Class<Artist> cannot be converted to String by method invocation
conversion
[ERROR] /home/hudson/jenkins-slave/workspace/Cayenne-31/cayenneTestConnection/derby/jdk/JDK
1.7 (latest)/label/Ubuntu/framework/cayenne-jdk1.5-unpublished/src/test/java/org/apache/cayenne/access/DataContextPrefetchTest.java:[511,87]
error: cannot find symbol
[ERROR] class Artist
[ERROR] /home/hudson/jenkins-slave/workspace/Cayenne-31/cayenneTestConnection/derby/jdk/JDK
1.7 (latest)/label/Ubuntu/framework/cayenne-jdk1.5-unpublished/src/test/java/org/apache/cayenne/access/DataContextPrefetchTest.java:[511,29]
error: cannot find symbol
[ERROR] class DataContextPrefetchTest
[ERROR] /home/hudson/jenkins-slave/workspace/Cayenne-31/cayenneTestConnection/derby/jdk/JDK
1.7 (latest)/label/Ubuntu/framework/cayenne-jdk1.5-unpublished/src/test/java/org/apache/cayenne/access/DataContextPrefetchTest.java:[513,19]
error: type SelectQuery does not take parameters
[ERROR] /home/hudson/jenkins-slave/workspace/Cayenne-31/cayenneTestConnection/derby/jdk/JDK
1.7 (latest)/label/Ubuntu/framework/cayenne-jdk1.5-unpublished/src/test/java/org/apache/cayenne/access/DataContextPrefetchTest.java:[513,47]
error: type SelectQuery does not take parameters
[ERROR] /home/hudson/jenkins-slave/workspace/Cayenne-31/cayenneTestConnection/derby/jdk/JDK
1.7 (latest)/label/Ubuntu/framework/cayenne-jdk1.5-unpublished/src/test/java/org/apache/cayenne/access/DataContextPrefetchTest.java:[514,28]
error: cannot find symbol
[ERROR] -> [Help 1]
org.apache.maven.lifecycle.LifecycleExecutionException: Failed to execute goal org.apache.maven.plugins:maven-compiler-plugin:2.3.2:testCompile
(default-testCompile) on project cayenne-jdk1.5-unpublished: Compilation failure
	at org.apache.maven.lifecycle.internal.MojoExecutor.execute(MojoExecutor.java:213)
	at org.apache.maven.lifecycle.internal.MojoExecutor.execute(MojoExecutor.java:153)
	at org.apache.maven.lifecycle.internal.MojoExecutor.execute(MojoExecutor.java:145)
	at org.apache.maven.lifecycle.internal.LifecycleModuleBuilder.buildProject(LifecycleModuleBuilder.java:84)
	at org.apache.maven.lifecycle.internal.LifecycleModuleBuilder.buildProject(LifecycleModuleBuilder.java:59)
	at org.apache.maven.lifecycle.internal.LifecycleStarter.singleThreadedBuild(LifecycleStarter.java:183)
	at org.apache.maven.lifecycle.internal.LifecycleStarter.execute(LifecycleStarter.java:161)
	at org.apache.maven.DefaultMaven.doExecute(DefaultMaven.java:320)
	at org.apache.maven.DefaultMaven.execute(DefaultMaven.java:156)
	at org.apache.maven.cli.MavenCli.execute(MavenCli.java:537)
	at org.apache.maven.cli.MavenCli.doMain(MavenCli.java:196)
	at org.apache.maven.cli.MavenCli.main(MavenCli.java:141)
	at sun.reflect.NativeMethodAccessorImpl.invoke0(Native Method)
	at sun.reflect.NativeMethodAccessorImpl.invoke(NativeMethodAccessorImpl.java:57)
	at sun.reflect.DelegatingMethodAccessorImpl.invoke(DelegatingMethodAccessorImpl.java:43)
	at java.lang.reflect.Method.invoke(Method.java:606)
	at org.codehaus.plexus.classworlds.launcher.Launcher.launchEnhanced(Launcher.java:290)
	at org.codehaus.plexus.classworlds.launcher.Launcher.launch(Launcher.java:230)
	at org.codehaus.plexus.classworlds.launcher.Launcher.mainWithExitCode(Launcher.java:409)
	at org.codehaus.plexus.classworlds.launcher.Launcher.main(Launcher.java:352)
Caused by: org.apache.maven.plugin.CompilationFailureException: Compilation failure
	at org.apache.maven.plugin.AbstractCompilerMojo.execute(AbstractCompilerMojo.java:656)
	at org.apache.maven.plugin.TestCompilerMojo.execute(TestCompilerMojo.java:161)
	at org.apache.maven.plugin.DefaultBuildPluginManager.executeMojo(DefaultBuildPluginManager.java:101)
	at org.apache.maven.lifecycle.internal.MojoExecutor.execute(MojoExecutor.java:209)
	... 19 more
[ERROR] 
[ERROR] Re-run Maven using the -X switch to enable full debug logging.
[ERROR] 
[ERROR] For more information about the errors and possible solutions, please read the following
articles:
[ERROR] [Help 1] http://cwiki.apache.org/confluence/display/MAVEN/MojoFailureException
[ERROR] 
[ERROR] After correcting the problems, you can resume the build with the command
[ERROR]   mvn <goals> -rf :cayenne-jdk1.5-unpublished
Build step 'Invoke top-level Maven targets' marked build as failure

Mime
View raw message