cayenne-commits mailing list archives

Site index · List index
Message view « Date » · « Thread »
Top « Date » · « Thread »
From Apache Jenkins Server <jenk...@builds.apache.org>
Subject Build failed in Jenkins: cayenne-master » hsql,JDK 1.7 (latest),Ubuntu #12
Date Tue, 22 Jul 2014 22:32:43 GMT
See <https://builds.apache.org/job/cayenne-master/cayenneTestConnection=hsql,jdk=JDK%201.7%20(latest),label=Ubuntu/12/changes>

Changes:

[johnthuss] Add API to CayenneFilter for specifying additional modules for the CayenneRuntime

------------------------------------------
[...truncated 101112 lines...]
3008/3008 KB   2679/2885 KB   
3008/3008 KB   2681/2885 KB   
3008/3008 KB   2685/2885 KB   
3008/3008 KB   2689/2885 KB   
3008/3008 KB   2690/2885 KB   
3008/3008 KB   2694/2885 KB   
3008/3008 KB   2695/2885 KB   
3008/3008 KB   2699/2885 KB   
3008/3008 KB   2703/2885 KB   
3008/3008 KB   2707/2885 KB   
3008/3008 KB   2711/2885 KB   
3008/3008 KB   2715/2885 KB   
3008/3008 KB   2719/2885 KB   
3008/3008 KB   2723/2885 KB   
3008/3008 KB   2726/2885 KB   
3008/3008 KB   2730/2885 KB   
3008/3008 KB   2734/2885 KB   
3008/3008 KB   2736/2885 KB   
3008/3008 KB   2738/2885 KB   
3008/3008 KB   2742/2885 KB   
3008/3008 KB   2746/2885 KB   
3008/3008 KB   2746/2885 KB   
3008/3008 KB   2750/2885 KB   
3008/3008 KB   2754/2885 KB   
3008/3008 KB   2755/2885 KB   
3008/3008 KB   2757/2885 KB   
3008/3008 KB   2761/2885 KB   
3008/3008 KB   2763/2885 KB   
3008/3008 KB   2766/2885 KB   
3008/3008 KB   2770/2885 KB   
3008/3008 KB   2773/2885 KB   
3008/3008 KB   2774/2885 KB   
3008/3008 KB   2778/2885 KB   
3008/3008 KB   2780/2885 KB   
3008/3008 KB   2784/2885 KB   
3008/3008 KB   2788/2885 KB   
3008/3008 KB   2792/2885 KB   
3008/3008 KB   2794/2885 KB   
3008/3008 KB   2798/2885 KB   
3008/3008 KB   2802/2885 KB   
3008/3008 KB   2803/2885 KB   
3008/3008 KB   2804/2885 KB   
3008/3008 KB   2808/2885 KB   
3008/3008 KB   2811/2885 KB   
3008/3008 KB   2815/2885 KB   
3008/3008 KB   2819/2885 KB   
3008/3008 KB   2823/2885 KB   
3008/3008 KB   2827/2885 KB   
3008/3008 KB   2831/2885 KB   
3008/3008 KB   2835/2885 KB   
3008/3008 KB   2839/2885 KB   
3008/3008 KB   2843/2885 KB   
3008/3008 KB   2847/2885 KB   
3008/3008 KB   2851/2885 KB   
3008/3008 KB   2855/2885 KB   
3008/3008 KB   2859/2885 KB   
3008/3008 KB   2863/2885 KB   
3008/3008 KB   2867/2885 KB   
3008/3008 KB   2871/2885 KB   
3008/3008 KB   2873/2885 KB   
3008/3008 KB   2877/2885 KB   
3008/3008 KB   2879/2885 KB   
3008/3008 KB   2883/2885 KB   
3008/3008 KB   2885/2885 KB   
                              
Downloaded: http://maven.objectstyle.org/nexus/content/groups/cayenne-deps/org/apache/xmlgraphics/fop/1.0/fop-1.0.jar
(3008 KB at 1548.7 KB/sec)
                              
Downloaded: http://maven.objectstyle.org/nexus/content/groups/cayenne-deps/net/sf/docbook/docbook-xsl/1.76.1/docbook-xsl-1.76.1-ns-resources.zip
(2885 KB at 1403.5 KB/sec)
[INFO] 
[INFO] --- docbkx-maven-plugin:2.0.14:generate-html (build-html) @ cayenne-docbook ---
[INFO] 
[INFO] >>> maven-source-plugin:2.1.2:jar (bundle-source-jar) @ cayenne-docbook >>>
[INFO] 
[INFO] <<< maven-source-plugin:2.1.2:jar (bundle-source-jar) @ cayenne-docbook <<<
[INFO] 
[INFO] --- maven-source-plugin:2.1.2:jar (bundle-source-jar) @ cayenne-docbook ---
[INFO] 
[INFO] --- maven-install-plugin:2.3.1:install (default-install) @ cayenne-docbook ---
[INFO] Installing <https://builds.apache.org/job/cayenne-master/cayenneTestConnection=hsql,jdk=JDK%201.7%20(latest),label=Ubuntu/ws/docs/docbook/pom.xml>
to /home/jenkins/.m2/repository/org/apache/cayenne/docs/cayenne-docbook/3.2.M2-SNAPSHOT/cayenne-docbook-3.2.M2-SNAPSHOT.pom
[INFO]                                                                         
[INFO] ------------------------------------------------------------------------
[INFO] Building Docbook: Cayenne Stylesheets 3.2.M2-SNAPSHOT
[INFO] ------------------------------------------------------------------------
[INFO] 
[INFO] --- maven-clean-plugin:2.4.1:clean (default-clean) @ docbook-stylesheets ---
[INFO] 
[INFO] --- docbkx-maven-plugin:2.0.14:generate-pdf (build-pdf) @ docbook-stylesheets ---
[INFO] 
[INFO] --- docbkx-maven-plugin:2.0.14:generate-html (build-html) @ docbook-stylesheets ---
[INFO] 
[INFO] --- maven-resources-plugin:2.4.3:resources (default-resources) @ docbook-stylesheets
---
[INFO] Using 'UTF-8' encoding to copy filtered resources.
[INFO] Copying 6 resources
[INFO] 
[INFO] --- maven-compiler-plugin:2.3.2:compile (default-compile) @ docbook-stylesheets ---
[INFO] No sources to compile
[INFO] 
[INFO] --- maven-resources-plugin:2.4.3:testResources (default-testResources) @ docbook-stylesheets
---
[INFO] Using 'UTF-8' encoding to copy filtered resources.
[INFO] skip non existing resourceDirectory <https://builds.apache.org/job/cayenne-master/cayenneTestConnection=hsql,jdk=JDK%201.7%20(latest),label=Ubuntu/ws/docs/docbook/docbook-stylesheets/src/test/resources>
[INFO] 
[INFO] --- maven-compiler-plugin:2.3.2:testCompile (default-testCompile) @ docbook-stylesheets
---
[INFO] No sources to compile
[INFO] 
[INFO] --- maven-surefire-plugin:2.5:test (default-test) @ docbook-stylesheets ---
[INFO] No tests to run.
[INFO] 
[INFO] --- maven-jar-plugin:2.3.2:jar (default-jar) @ docbook-stylesheets ---
[INFO] Building jar: <https://builds.apache.org/job/cayenne-master/cayenneTestConnection=hsql,jdk=JDK%201.7%20(latest),label=Ubuntu/ws/docs/docbook/docbook-stylesheets/target/docbook-stylesheets-3.2.M2-SNAPSHOT.jar>
[INFO] 
[INFO] >>> maven-source-plugin:2.1.2:jar (bundle-source-jar) @ docbook-stylesheets
>>>
[INFO] 
[INFO] <<< maven-source-plugin:2.1.2:jar (bundle-source-jar) @ docbook-stylesheets
<<<
[INFO] 
[INFO] --- maven-source-plugin:2.1.2:jar (bundle-source-jar) @ docbook-stylesheets ---
[INFO] Building jar: <https://builds.apache.org/job/cayenne-master/cayenneTestConnection=hsql,jdk=JDK%201.7%20(latest),label=Ubuntu/ws/docs/docbook/docbook-stylesheets/target/docbook-stylesheets-3.2.M2-SNAPSHOT-sources.jar>
[INFO] 
[INFO] --- maven-install-plugin:2.3.1:install (default-install) @ docbook-stylesheets ---
[INFO] Installing <https://builds.apache.org/job/cayenne-master/cayenneTestConnection=hsql,jdk=JDK%201.7%20(latest),label=Ubuntu/ws/docs/docbook/docbook-stylesheets/target/docbook-stylesheets-3.2.M2-SNAPSHOT.jar>
to /home/jenkins/.m2/repository/org/apache/cayenne/docs/docbook-stylesheets/3.2.M2-SNAPSHOT/docbook-stylesheets-3.2.M2-SNAPSHOT.jar
[INFO] Installing <https://builds.apache.org/job/cayenne-master/cayenneTestConnection=hsql,jdk=JDK%201.7%20(latest),label=Ubuntu/ws/docs/docbook/docbook-stylesheets/pom.xml>
to /home/jenkins/.m2/repository/org/apache/cayenne/docs/docbook-stylesheets/3.2.M2-SNAPSHOT/docbook-stylesheets-3.2.M2-SNAPSHOT.pom
[INFO] Installing <https://builds.apache.org/job/cayenne-master/cayenneTestConnection=hsql,jdk=JDK%201.7%20(latest),label=Ubuntu/ws/docs/docbook/docbook-stylesheets/target/docbook-stylesheets-3.2.M2-SNAPSHOT-sources.jar>
to /home/jenkins/.m2/repository/org/apache/cayenne/docs/docbook-stylesheets/3.2.M2-SNAPSHOT/docbook-stylesheets-3.2.M2-SNAPSHOT-sources.jar
[INFO]                                                                         
[INFO] ------------------------------------------------------------------------
[INFO] Building Docbook: Cayenne Guide 3.2.M2-SNAPSHOT
[INFO] ------------------------------------------------------------------------
[INFO] 
[INFO] --- maven-clean-plugin:2.4.1:clean (default-clean) @ cayenne-guide ---
[INFO] 
[INFO] --- docbkx-maven-plugin:2.0.14:generate-pdf (build-pdf) @ cayenne-guide ---
[INFO] Processing input file: index.xml
[INFO] Applying customization parameters
[INFO] targetFileExtension pdf
[INFO] type fo
Jul 22, 2014 10:31:40 PM org.apache.fop.events.LoggingEventListener processEvent
WARNING: Font "Symbol,normal,700" not found. Substituting with "Symbol,normal,400".
Jul 22, 2014 10:31:40 PM org.apache.fop.events.LoggingEventListener processEvent
WARNING: Font "ZapfDingbats,normal,700" not found. Substituting with "ZapfDingbats,normal,400".
Jul 22, 2014 10:31:41 PM org.apache.fop.hyphenation.Hyphenator getHyphenationTree
SEVERE: Couldn't find hyphenation pattern en
Jul 22, 2014 10:31:41 PM org.apache.fop.events.LoggingEventListener processEvent
WARNING: The following feature isn't implemented by Apache FOP, yet: table-layout="auto" (on
fo:table) (See position 5:1089)
Jul 22, 2014 10:31:41 PM org.apache.fop.events.LoggingEventListener processEvent
INFO: An fo:table  (See position 5:1089) is wider than the available room in inline-progression-dimension.
Adjusting end-indent based on overconstrained geometry rules (XSL 1.1, ch. 5.3.4)
Jul 22, 2014 10:31:41 PM org.apache.fop.events.LoggingEventListener processEvent
WARNING: The following feature isn't implemented by Apache FOP, yet: table-layout="auto" (on
fo:table) (See position 137:1016)
Jul 22, 2014 10:31:41 PM org.apache.fop.events.LoggingEventListener processEvent
WARNING: The following feature isn't implemented by Apache FOP, yet: table-layout="auto" (on
fo:table) (See position 149:1016)
[INFO] ------------------------------------------------------------------------
[INFO] Reactor Summary:
[INFO] 
[INFO] Cayenne ........................................... SUCCESS [0.449s]
[INFO] Cayenne Build Tools Parent ........................ SUCCESS [0.012s]
[INFO] Cayenne License and Notice Bundle ................. SUCCESS [6.388s]
[INFO] Common Unit Test Utilities ........................ SUCCESS [0.888s]
[INFO] Cayenne Dependency Injection Container ............ SUCCESS [5.037s]
[INFO] Cayenne Server .................................... SUCCESS [5:26.851s]
[INFO] Cayenne ROP Client ................................ SUCCESS [1:12.087s]
[INFO] Cayenne Project ................................... SUCCESS [3.316s]
[INFO] Cayenne Tools ..................................... SUCCESS [6.778s]
[INFO] Cayenne Lifecycle Utilities ....................... SUCCESS [3.920s]
[INFO] Cayenne Maven Plugins ............................. SUCCESS [0.015s]
[INFO] Cayenne Maven Plugin .............................. SUCCESS [9.368s]
[INFO] Cayenne Cryptography Extensions ................... SUCCESS [4.512s]
[INFO] Cayenne Integration Tests Parent .................. SUCCESS [0.008s]
[INFO] Integration Tests - Cayenne Tools ................. SUCCESS [1.718s]
[INFO] Cayenne Modeler Parent ............................ SUCCESS [0.015s]
[INFO] Cayenne WebObjects Compatibility Library .......... SUCCESS [3.928s]
[INFO] Cayenne Modeler ................................... SUCCESS [12.155s]
[INFO] Cayenne Modeler Maven Plugin ...................... SUCCESS [0.910s]
[INFO] Cayenne Tutorial .................................. SUCCESS [2.685s]
[INFO] Cayenne ROP Server Tutorial ....................... SUCCESS [1.885s]
[INFO] Cayenne ROP Client Tutorial ....................... SUCCESS [0.708s]
[INFO] Cayenne Tutorials ................................. SUCCESS [0.008s]
[INFO] Cayenne Documenation Parent ....................... SUCCESS [0.006s]
[INFO] Cayenne Documentation ............................. SUCCESS [1:38.262s]
[INFO] Cayenne Docbook Documentation ..................... SUCCESS [6.069s]
[INFO] Docbook: Cayenne Stylesheets ...................... SUCCESS [0.076s]
[INFO] Docbook: Cayenne Guide ............................ FAILURE [6.038s]
[INFO] Docbook: Getting Started with Cayenne ............. SKIPPED
[INFO] Docbook: Getting Started with Cayenne ROP ......... SKIPPED
[INFO] Docbook: Cayenne New Features and Upgrade Guide ... SKIPPED
[INFO] ------------------------------------------------------------------------
[INFO] BUILD FAILURE
[INFO] ------------------------------------------------------------------------
[INFO] Total time: 9:37.642s
[INFO] Finished at: Tue Jul 22 22:31:41 UTC 2014
[INFO] Final Memory: 63M/450M
[INFO] ------------------------------------------------------------------------
[ERROR] Failed to execute goal com.agilejava.docbkx:docbkx-maven-plugin:2.0.14:generate-pdf
(build-pdf) on project cayenne-guide: Failed to transform to fo: org.apache.fop.fo.ValidationException:
The column-number or number of cells in the row overflows the number of fo:table-columns specified
for the table. (See position 165:54): null:165:54: The column-number or number of cells in
the row overflows the number of fo:table-columns specified for the table. (See position 165:54)
-> [Help 1]
org.apache.maven.lifecycle.LifecycleExecutionException: Failed to execute goal com.agilejava.docbkx:docbkx-maven-plugin:2.0.14:generate-pdf
(build-pdf) on project cayenne-guide: Failed to transform to fo
	at org.apache.maven.lifecycle.internal.MojoExecutor.execute(MojoExecutor.java:217)
	at org.apache.maven.lifecycle.internal.MojoExecutor.execute(MojoExecutor.java:153)
	at org.apache.maven.lifecycle.internal.MojoExecutor.execute(MojoExecutor.java:145)
	at org.apache.maven.lifecycle.internal.LifecycleModuleBuilder.buildProject(LifecycleModuleBuilder.java:84)
	at org.apache.maven.lifecycle.internal.LifecycleModuleBuilder.buildProject(LifecycleModuleBuilder.java:59)
	at org.apache.maven.lifecycle.internal.LifecycleStarter.singleThreadedBuild(LifecycleStarter.java:183)
	at org.apache.maven.lifecycle.internal.LifecycleStarter.execute(LifecycleStarter.java:161)
	at org.apache.maven.DefaultMaven.doExecute(DefaultMaven.java:320)
	at org.apache.maven.DefaultMaven.execute(DefaultMaven.java:156)
	at org.apache.maven.cli.MavenCli.execute(MavenCli.java:537)
	at org.apache.maven.cli.MavenCli.doMain(MavenCli.java:196)
	at org.apache.maven.cli.MavenCli.main(MavenCli.java:141)
	at sun.reflect.NativeMethodAccessorImpl.invoke0(Native Method)
	at sun.reflect.NativeMethodAccessorImpl.invoke(NativeMethodAccessorImpl.java:57)
	at sun.reflect.DelegatingMethodAccessorImpl.invoke(DelegatingMethodAccessorImpl.java:43)
	at java.lang.reflect.Method.invoke(Method.java:606)
	at org.codehaus.plexus.classworlds.launcher.Launcher.launchEnhanced(Launcher.java:290)
	at org.codehaus.plexus.classworlds.launcher.Launcher.launch(Launcher.java:230)
	at org.codehaus.plexus.classworlds.launcher.Launcher.mainWithExitCode(Launcher.java:409)
	at org.codehaus.plexus.classworlds.launcher.Launcher.main(Launcher.java:352)
Caused by: org.apache.maven.plugin.MojoExecutionException: Failed to transform to fo
	at com.agilejava.docbkx.maven.AbstractFoMojo.postProcessResult(AbstractFoMojo.java:161)
	at com.agilejava.docbkx.maven.AbstractTransformerMojo.execute(AbstractTransformerMojo.java:166)
	at org.apache.maven.plugin.DefaultBuildPluginManager.executeMojo(DefaultBuildPluginManager.java:101)
	at org.apache.maven.lifecycle.internal.MojoExecutor.execute(MojoExecutor.java:209)
	... 19 more
Caused by: javax.xml.transform.TransformerException: org.apache.fop.fo.ValidationException:
The column-number or number of cells in the row overflows the number of fo:table-columns specified
for the table. (See position 165:54)
	at org.apache.xalan.transformer.TransformerIdentityImpl.transform(TransformerIdentityImpl.java:501)
	at com.agilejava.docbkx.maven.AbstractFoMojo.postProcessResult(AbstractFoMojo.java:154)
	... 22 more
Caused by: org.apache.fop.fo.ValidationException: The column-number or number of cells in
the row overflows the number of fo:table-columns specified for the table. (See position 165:54)
	at org.apache.fop.events.ValidationExceptionFactory.createException(ValidationExceptionFactory.java:38)
	at org.apache.fop.events.EventExceptionManager.throwException(EventExceptionManager.java:54)
	at org.apache.fop.events.DefaultEventBroadcaster$1.invoke(DefaultEventBroadcaster.java:175)
	at com.sun.proxy.$Proxy19.tooManyCells(Unknown Source)
	at org.apache.fop.fo.flow.table.TableCellContainer.addTableCellChild(TableCellContainer.java:51)
	at org.apache.fop.fo.flow.table.TableRow.addChildNode(TableRow.java:95)
	at org.apache.fop.fo.FOTreeBuilder$MainFOHandler.startElement(FOTreeBuilder.java:315)
	at org.apache.fop.fo.FOTreeBuilder.startElement(FOTreeBuilder.java:171)
	at org.apache.xalan.transformer.TransformerIdentityImpl.startElement(TransformerIdentityImpl.java:1072)
	at org.apache.xerces.parsers.AbstractSAXParser.startElement(Unknown Source)
	at org.apache.xerces.impl.XMLNSDocumentScannerImpl.scanStartElement(Unknown Source)
	at org.apache.xerces.impl.XMLDocumentFragmentScannerImpl$FragmentContentDispatcher.dispatch(Unknown
Source)
	at org.apache.xerces.impl.XMLDocumentFragmentScannerImpl.scanDocument(Unknown Source)
	at org.apache.xerces.parsers.XML11Configuration.parse(Unknown Source)
	at org.apache.xerces.parsers.XML11Configuration.parse(Unknown Source)
	at org.apache.xerces.parsers.XMLParser.parse(Unknown Source)
	at org.apache.xerces.parsers.AbstractSAXParser.parse(Unknown Source)
	at org.apache.xalan.transformer.TransformerIdentityImpl.transform(TransformerIdentityImpl.java:484)
	... 23 more
[ERROR] 
[ERROR] Re-run Maven using the -X switch to enable full debug logging.
[ERROR] 
[ERROR] For more information about the errors and possible solutions, please read the following
articles:
[ERROR] [Help 1] http://cwiki.apache.org/confluence/display/MAVEN/MojoExecutionException
[ERROR] 
[ERROR] After correcting the problems, you can resume the build with the command
[ERROR]   mvn <goals> -rf :cayenne-guide
Build step 'Invoke top-level Maven targets' marked build as failure

Mime
View raw message