cayenne-commits mailing list archives

Site index · List index
Message view « Date » · « Thread »
Top « Date » · « Thread »
From Apache Jenkins Server <jenk...@builds.apache.org>
Subject Build failed in Jenkins: cayenne-master » h2,JDK 1.7 (latest),Ubuntu #20
Date Tue, 26 Aug 2014 06:23:01 GMT
See <https://builds.apache.org/job/cayenne-master/cayenneTestConnection=h2,jdk=JDK%201.7%20(latest),label=Ubuntu/20/changes>

Changes:

[aadamchik] dummy change, testing commit notifications

------------------------------------------
[...truncated 106 lines...]
[INFO] --- maven-compiler-plugin:2.3.2:compile (default-compile) @ cayenne-legal ---
[INFO] No sources to compile
[INFO] 
[INFO] --- maven-resources-plugin:2.4.3:testResources (default-testResources) @ cayenne-legal
---
[INFO] Using 'UTF-8' encoding to copy filtered resources.
[INFO] skip non existing resourceDirectory <https://builds.apache.org/job/cayenne-master/cayenneTestConnection=h2,jdk=JDK%201.7%20(latest),label=Ubuntu/ws/build-tools/cayenne-legal/src/test/resources>
[INFO] 
[INFO] --- maven-compiler-plugin:2.3.2:testCompile (default-testCompile) @ cayenne-legal ---
[INFO] No sources to compile
[INFO] 
[INFO] --- maven-surefire-plugin:2.5:test (default-test) @ cayenne-legal ---
[INFO] No tests to run.
[INFO] 
[INFO] --- maven-jar-plugin:2.3.2:jar (default-jar) @ cayenne-legal ---
[INFO] Building jar: <https://builds.apache.org/job/cayenne-master/cayenneTestConnection=h2,jdk=JDK%201.7%20(latest),label=Ubuntu/ws/build-tools/cayenne-legal/target/cayenne-legal-3.2.M2-SNAPSHOT.jar>
[INFO] 
[INFO] >>> maven-source-plugin:2.1.2:jar (bundle-source-jar) @ cayenne-legal >>>
[INFO] 
[INFO] <<< maven-source-plugin:2.1.2:jar (bundle-source-jar) @ cayenne-legal <<<
[INFO] 
[INFO] --- maven-source-plugin:2.1.2:jar (bundle-source-jar) @ cayenne-legal ---
[INFO] Building jar: <https://builds.apache.org/job/cayenne-master/cayenneTestConnection=h2,jdk=JDK%201.7%20(latest),label=Ubuntu/ws/build-tools/cayenne-legal/target/cayenne-legal-3.2.M2-SNAPSHOT-sources.jar>
[INFO] 
[INFO] --- maven-install-plugin:2.3.1:install (default-install) @ cayenne-legal ---
[INFO] Installing <https://builds.apache.org/job/cayenne-master/cayenneTestConnection=h2,jdk=JDK%201.7%20(latest),label=Ubuntu/ws/build-tools/cayenne-legal/target/cayenne-legal-3.2.M2-SNAPSHOT.jar>
to /home/jenkins/.m2/repository/org/apache/cayenne/build-tools/cayenne-legal/3.2.M2-SNAPSHOT/cayenne-legal-3.2.M2-SNAPSHOT.jar
[INFO] Installing <https://builds.apache.org/job/cayenne-master/cayenneTestConnection=h2,jdk=JDK%201.7%20(latest),label=Ubuntu/ws/build-tools/cayenne-legal/pom.xml>
to /home/jenkins/.m2/repository/org/apache/cayenne/build-tools/cayenne-legal/3.2.M2-SNAPSHOT/cayenne-legal-3.2.M2-SNAPSHOT.pom
[INFO] Installing <https://builds.apache.org/job/cayenne-master/cayenneTestConnection=h2,jdk=JDK%201.7%20(latest),label=Ubuntu/ws/build-tools/cayenne-legal/target/cayenne-legal-3.2.M2-SNAPSHOT-sources.jar>
to /home/jenkins/.m2/repository/org/apache/cayenne/build-tools/cayenne-legal/3.2.M2-SNAPSHOT/cayenne-legal-3.2.M2-SNAPSHOT-sources.jar
[INFO]                                                                         
[INFO] ------------------------------------------------------------------------
[INFO] Building Common Unit Test Utilities 3.2.M2-SNAPSHOT
[INFO] ------------------------------------------------------------------------
[INFO] 
[INFO] --- maven-clean-plugin:2.4.1:clean (default-clean) @ cayenne-test-utilities ---
[INFO] Deleting <https://builds.apache.org/job/cayenne-master/cayenneTestConnection=h2,jdk=JDK%201.7%20(latest),label=Ubuntu/ws/build-tools/cayenne-test-utilities/target>
[INFO] 
[INFO] --- maven-resources-plugin:2.4.3:resources (default-resources) @ cayenne-test-utilities
---
[INFO] Using 'UTF-8' encoding to copy filtered resources.
[INFO] skip non existing resourceDirectory <https://builds.apache.org/job/cayenne-master/cayenneTestConnection=h2,jdk=JDK%201.7%20(latest),label=Ubuntu/ws/build-tools/cayenne-test-utilities/src/main/resources>
[INFO] 
[INFO] --- maven-compiler-plugin:2.3.2:compile (default-compile) @ cayenne-test-utilities
---
[INFO] Compiling 14 source files to <https://builds.apache.org/job/cayenne-master/cayenneTestConnection=h2,jdk=JDK%201.7%20(latest),label=Ubuntu/ws/build-tools/cayenne-test-utilities/target/classes>
[INFO] 
[INFO] --- maven-resources-plugin:2.4.3:testResources (default-testResources) @ cayenne-test-utilities
---
[INFO] Using 'UTF-8' encoding to copy filtered resources.
[INFO] skip non existing resourceDirectory <https://builds.apache.org/job/cayenne-master/cayenneTestConnection=h2,jdk=JDK%201.7%20(latest),label=Ubuntu/ws/build-tools/cayenne-test-utilities/src/test/resources>
[INFO] 
[INFO] --- maven-compiler-plugin:2.3.2:testCompile (default-testCompile) @ cayenne-test-utilities
---
[INFO] No sources to compile
[INFO] 
[INFO] --- maven-surefire-plugin:2.5:test (default-test) @ cayenne-test-utilities ---
[INFO] No tests to run.
[INFO] 
[INFO] --- maven-jar-plugin:2.3.2:jar (default-jar) @ cayenne-test-utilities ---
[INFO] Building jar: <https://builds.apache.org/job/cayenne-master/cayenneTestConnection=h2,jdk=JDK%201.7%20(latest),label=Ubuntu/ws/build-tools/cayenne-test-utilities/target/cayenne-test-utilities-3.2.M2-SNAPSHOT.jar>
[INFO] 
[INFO] >>> maven-source-plugin:2.1.2:jar (bundle-source-jar) @ cayenne-test-utilities
>>>
[INFO] 
[INFO] <<< maven-source-plugin:2.1.2:jar (bundle-source-jar) @ cayenne-test-utilities
<<<
[INFO] 
[INFO] --- maven-source-plugin:2.1.2:jar (bundle-source-jar) @ cayenne-test-utilities ---
[INFO] Building jar: <https://builds.apache.org/job/cayenne-master/cayenneTestConnection=h2,jdk=JDK%201.7%20(latest),label=Ubuntu/ws/build-tools/cayenne-test-utilities/target/cayenne-test-utilities-3.2.M2-SNAPSHOT-sources.jar>
[INFO] 
[INFO] --- maven-install-plugin:2.3.1:install (default-install) @ cayenne-test-utilities ---
[INFO] Installing <https://builds.apache.org/job/cayenne-master/cayenneTestConnection=h2,jdk=JDK%201.7%20(latest),label=Ubuntu/ws/build-tools/cayenne-test-utilities/target/cayenne-test-utilities-3.2.M2-SNAPSHOT.jar>
to /home/jenkins/.m2/repository/org/apache/cayenne/build-tools/cayenne-test-utilities/3.2.M2-SNAPSHOT/cayenne-test-utilities-3.2.M2-SNAPSHOT.jar
[INFO] Installing <https://builds.apache.org/job/cayenne-master/cayenneTestConnection=h2,jdk=JDK%201.7%20(latest),label=Ubuntu/ws/build-tools/cayenne-test-utilities/pom.xml>
to /home/jenkins/.m2/repository/org/apache/cayenne/build-tools/cayenne-test-utilities/3.2.M2-SNAPSHOT/cayenne-test-utilities-3.2.M2-SNAPSHOT.pom
[INFO] Installing <https://builds.apache.org/job/cayenne-master/cayenneTestConnection=h2,jdk=JDK%201.7%20(latest),label=Ubuntu/ws/build-tools/cayenne-test-utilities/target/cayenne-test-utilities-3.2.M2-SNAPSHOT-sources.jar>
to /home/jenkins/.m2/repository/org/apache/cayenne/build-tools/cayenne-test-utilities/3.2.M2-SNAPSHOT/cayenne-test-utilities-3.2.M2-SNAPSHOT-sources.jar
[INFO]                                                                         
[INFO] ------------------------------------------------------------------------
[INFO] Building Cayenne Dependency Injection Container 3.2.M2-SNAPSHOT
[INFO] ------------------------------------------------------------------------
[INFO] 
[INFO] --- maven-clean-plugin:2.4.1:clean (default-clean) @ cayenne-di ---
[INFO] Deleting <https://builds.apache.org/job/cayenne-master/cayenneTestConnection=h2,jdk=JDK%201.7%20(latest),label=Ubuntu/ws/cayenne-di/target>
[INFO] 
[INFO] --- maven-remote-resources-plugin:1.5:process (default) @ cayenne-di ---
[INFO] 
[INFO] --- maven-resources-plugin:2.4.3:resources (default-resources) @ cayenne-di ---
[INFO] Using 'UTF-8' encoding to copy filtered resources.
[INFO] skip non existing resourceDirectory <https://builds.apache.org/job/cayenne-master/cayenneTestConnection=h2,jdk=JDK%201.7%20(latest),label=Ubuntu/ws/cayenne-di/src/main/resources>
[INFO] Copying 2 resources
[INFO] 
[INFO] --- maven-compiler-plugin:2.3.2:compile (default-compile) @ cayenne-di ---
[INFO] Compiling 43 source files to <https://builds.apache.org/job/cayenne-master/cayenneTestConnection=h2,jdk=JDK%201.7%20(latest),label=Ubuntu/ws/cayenne-di/target/classes>
[INFO] 
[INFO] --- maven-bundle-plugin:2.3.7:manifest (bundle-manifest) @ cayenne-di ---
[INFO] 
[INFO] --- maven-resources-plugin:2.4.3:testResources (default-testResources) @ cayenne-di
---
[INFO] Using 'UTF-8' encoding to copy filtered resources.
[INFO] skip non existing resourceDirectory <https://builds.apache.org/job/cayenne-master/cayenneTestConnection=h2,jdk=JDK%201.7%20(latest),label=Ubuntu/ws/cayenne-di/src/test/resources>
[INFO] Copying 48 resources
[INFO] 
[INFO] --- maven-compiler-plugin:2.3.2:testCompile (default-testCompile) @ cayenne-di ---
[INFO] Compiling 40 source files to <https://builds.apache.org/job/cayenne-master/cayenneTestConnection=h2,jdk=JDK%201.7%20(latest),label=Ubuntu/ws/cayenne-di/target/test-classes>
[INFO] 
[INFO] --- maven-surefire-plugin:2.5:test (default-test) @ cayenne-di ---
[INFO] Surefire report directory: <https://builds.apache.org/job/cayenne-master/cayenneTestConnection=h2,jdk=JDK%201.7%20(latest),label=Ubuntu/ws/cayenne-di/target/surefire-reports>

-------------------------------------------------------
 T E S T S
-------------------------------------------------------
Running org.apache.cayenne.di.DIBootstrapTest
Tests run: 3, Failures: 0, Errors: 0, Skipped: 0, Time elapsed: 0.153 sec
Running org.apache.cayenne.di.spi.DefaultInjectorBindingTest
Tests run: 5, Failures: 0, Errors: 0, Skipped: 0, Time elapsed: 0.024 sec
Running org.apache.cayenne.di.KeyTest
Tests run: 3, Failures: 0, Errors: 0, Skipped: 0, Time elapsed: 0.012 sec
Running org.apache.cayenne.di.spi.DefaultInjectorInjectionTest
Tests run: 15, Failures: 0, Errors: 0, Skipped: 0, Time elapsed: 0.062 sec
Running org.apache.cayenne.di.spi.DefaultInjectorScopeTest
Tests run: 6, Failures: 0, Errors: 0, Skipped: 0, Time elapsed: 0.021 sec
Running org.apache.cayenne.di.spi.DefaultInjectorDecorationTest
Tests run: 3, Failures: 0, Errors: 0, Skipped: 0, Time elapsed: 0.015 sec
Running org.apache.cayenne.di.spi.DefaultInjectorCircularInjectionTest
Tests run: 4, Failures: 0, Errors: 0, Skipped: 0, Time elapsed: 0.014 sec
Running org.apache.cayenne.di.spi.DefaultInjectorTest
Tests run: 4, Failures: 0, Errors: 0, Skipped: 0, Time elapsed: 0.009 sec

Results :

Tests run: 43, Failures: 0, Errors: 0, Skipped: 0

[INFO] 
[INFO] --- maven-jar-plugin:2.3.2:jar (default-jar) @ cayenne-di ---
[INFO] Building jar: <https://builds.apache.org/job/cayenne-master/cayenneTestConnection=h2,jdk=JDK%201.7%20(latest),label=Ubuntu/ws/cayenne-di/target/cayenne-di-3.2.M2-SNAPSHOT.jar>
[INFO] 
[INFO] >>> maven-source-plugin:2.1.2:jar (bundle-source-jar) @ cayenne-di >>>
[INFO] 
[INFO] <<< maven-source-plugin:2.1.2:jar (bundle-source-jar) @ cayenne-di <<<
[INFO] 
[INFO] --- maven-source-plugin:2.1.2:jar (bundle-source-jar) @ cayenne-di ---
[INFO] org already added, skipping
[INFO] org/apache already added, skipping
[INFO] org/apache/cayenne already added, skipping
[INFO] org/apache/cayenne/di already added, skipping
[INFO] org/apache/cayenne/di/spi already added, skipping
[INFO] Building jar: <https://builds.apache.org/job/cayenne-master/cayenneTestConnection=h2,jdk=JDK%201.7%20(latest),label=Ubuntu/ws/cayenne-di/target/cayenne-di-3.2.M2-SNAPSHOT-sources.jar>
[INFO] org already added, skipping
[INFO] org/apache already added, skipping
[INFO] org/apache/cayenne already added, skipping
[INFO] org/apache/cayenne/di already added, skipping
[INFO] org/apache/cayenne/di/spi already added, skipping
[INFO] 
[INFO] --- maven-install-plugin:2.3.1:install (default-install) @ cayenne-di ---
[INFO] Installing <https://builds.apache.org/job/cayenne-master/cayenneTestConnection=h2,jdk=JDK%201.7%20(latest),label=Ubuntu/ws/cayenne-di/target/cayenne-di-3.2.M2-SNAPSHOT.jar>
to /home/jenkins/.m2/repository/org/apache/cayenne/cayenne-di/3.2.M2-SNAPSHOT/cayenne-di-3.2.M2-SNAPSHOT.jar
[INFO] Installing <https://builds.apache.org/job/cayenne-master/cayenneTestConnection=h2,jdk=JDK%201.7%20(latest),label=Ubuntu/ws/cayenne-di/pom.xml>
to /home/jenkins/.m2/repository/org/apache/cayenne/cayenne-di/3.2.M2-SNAPSHOT/cayenne-di-3.2.M2-SNAPSHOT.pom
[INFO] Installing <https://builds.apache.org/job/cayenne-master/cayenneTestConnection=h2,jdk=JDK%201.7%20(latest),label=Ubuntu/ws/cayenne-di/target/cayenne-di-3.2.M2-SNAPSHOT-sources.jar>
to /home/jenkins/.m2/repository/org/apache/cayenne/cayenne-di/3.2.M2-SNAPSHOT/cayenne-di-3.2.M2-SNAPSHOT-sources.jar
[INFO] ------------------------------------------------------------------------
[INFO] Reactor Summary:
[INFO] 
[INFO] Cayenne ........................................... SUCCESS [0.618s]
[INFO] Cayenne Build Tools Parent ........................ SUCCESS [0.035s]
[INFO] Cayenne License and Notice Bundle ................. SUCCESS [1.905s]
[INFO] Common Unit Test Utilities ........................ SUCCESS [1.536s]
[INFO] Cayenne Dependency Injection Container ............ FAILURE [4.444s]
[INFO] Cayenne Server .................................... SKIPPED
[INFO] Cayenne ROP Client ................................ SKIPPED
[INFO] Cayenne Project ................................... SKIPPED
[INFO] Cayenne Tools ..................................... SKIPPED
[INFO] Cayenne Lifecycle Utilities ....................... SKIPPED
[INFO] Cayenne Maven Plugins ............................. SKIPPED
[INFO] Cayenne Maven Plugin .............................. SKIPPED
[INFO] Cayenne Cryptography Extensions ................... SKIPPED
[INFO] Cayenne Integration Tests Parent .................. SKIPPED
[INFO] Integration Tests - Cayenne Tools ................. SKIPPED
[INFO] Cayenne Modeler Parent ............................ SKIPPED
[INFO] Cayenne WebObjects Compatibility Library .......... SKIPPED
[INFO] Cayenne Modeler ................................... SKIPPED
[INFO] Cayenne Modeler Maven Plugin ...................... SKIPPED
[INFO] Cayenne Tutorial .................................. SKIPPED
[INFO] Cayenne ROP Server Tutorial ....................... SKIPPED
[INFO] Cayenne ROP Client Tutorial ....................... SKIPPED
[INFO] Cayenne Tutorials ................................. SKIPPED
[INFO] Cayenne Documenation Parent ....................... SKIPPED
[INFO] Cayenne Documentation ............................. SKIPPED
[INFO] Cayenne Docbook Documentation ..................... SKIPPED
[INFO] Docbook: Cayenne Stylesheets ...................... SKIPPED
[INFO] Docbook: Cayenne Guide ............................ SKIPPED
[INFO] Docbook: Getting Started with Cayenne ............. SKIPPED
[INFO] Docbook: Getting Started with Cayenne ROP ......... SKIPPED
[INFO] Docbook: Cayenne New Features and Upgrade Guide ... SKIPPED
[INFO] ------------------------------------------------------------------------
[INFO] BUILD FAILURE
[INFO] ------------------------------------------------------------------------
[INFO] Total time: 10.081s
[INFO] Finished at: Tue Aug 26 06:22:31 UTC 2014
[INFO] Final Memory: 27M/307M
[INFO] ------------------------------------------------------------------------
[ERROR] Failed to execute goal org.apache.maven.plugins:maven-install-plugin:2.3.1:install
(default-install) on project cayenne-di: Failed to install metadata org.apache.cayenne:cayenne-di/maven-metadata.xml:
Could not read metadata /home/jenkins/.m2/repository/org/apache/cayenne/cayenne-di/maven-metadata-local.xml:
input contained no data -> [Help 1]
org.apache.maven.lifecycle.LifecycleExecutionException: Failed to execute goal org.apache.maven.plugins:maven-install-plugin:2.3.1:install
(default-install) on project cayenne-di: Failed to install metadata org.apache.cayenne:cayenne-di/maven-metadata.xml:
Could not read metadata /home/jenkins/.m2/repository/org/apache/cayenne/cayenne-di/maven-metadata-local.xml:
input contained no data
	at org.apache.maven.lifecycle.internal.MojoExecutor.execute(MojoExecutor.java:217)
	at org.apache.maven.lifecycle.internal.MojoExecutor.execute(MojoExecutor.java:153)
	at org.apache.maven.lifecycle.internal.MojoExecutor.execute(MojoExecutor.java:145)
	at org.apache.maven.lifecycle.internal.LifecycleModuleBuilder.buildProject(LifecycleModuleBuilder.java:84)
	at org.apache.maven.lifecycle.internal.LifecycleModuleBuilder.buildProject(LifecycleModuleBuilder.java:59)
	at org.apache.maven.lifecycle.internal.LifecycleStarter.singleThreadedBuild(LifecycleStarter.java:183)
	at org.apache.maven.lifecycle.internal.LifecycleStarter.execute(LifecycleStarter.java:161)
	at org.apache.maven.DefaultMaven.doExecute(DefaultMaven.java:320)
	at org.apache.maven.DefaultMaven.execute(DefaultMaven.java:156)
	at org.apache.maven.cli.MavenCli.execute(MavenCli.java:537)
	at org.apache.maven.cli.MavenCli.doMain(MavenCli.java:196)
	at org.apache.maven.cli.MavenCli.main(MavenCli.java:141)
	at sun.reflect.NativeMethodAccessorImpl.invoke0(Native Method)
	at sun.reflect.NativeMethodAccessorImpl.invoke(NativeMethodAccessorImpl.java:57)
	at sun.reflect.DelegatingMethodAccessorImpl.invoke(DelegatingMethodAccessorImpl.java:43)
	at java.lang.reflect.Method.invoke(Method.java:606)
	at org.codehaus.plexus.classworlds.launcher.Launcher.launchEnhanced(Launcher.java:290)
	at org.codehaus.plexus.classworlds.launcher.Launcher.launch(Launcher.java:230)
	at org.codehaus.plexus.classworlds.launcher.Launcher.mainWithExitCode(Launcher.java:409)
	at org.codehaus.plexus.classworlds.launcher.Launcher.main(Launcher.java:352)
Caused by: org.apache.maven.plugin.MojoExecutionException: Failed to install metadata org.apache.cayenne:cayenne-di/maven-metadata.xml:
Could not read metadata /home/jenkins/.m2/repository/org/apache/cayenne/cayenne-di/maven-metadata-local.xml:
input contained no data
	at org.apache.maven.plugin.install.InstallMojo.execute(InstallMojo.java:139)
	at org.apache.maven.plugin.DefaultBuildPluginManager.executeMojo(DefaultBuildPluginManager.java:101)
	at org.apache.maven.lifecycle.internal.MojoExecutor.execute(MojoExecutor.java:209)
	... 19 more
Caused by: org.apache.maven.artifact.installer.ArtifactInstallationException: Failed to install
metadata org.apache.cayenne:cayenne-di/maven-metadata.xml: Could not read metadata /home/jenkins/.m2/repository/org/apache/cayenne/cayenne-di/maven-metadata-local.xml:
input contained no data
	at org.apache.maven.artifact.installer.DefaultArtifactInstaller.install(DefaultArtifactInstaller.java:111)
	at org.apache.maven.plugin.install.InstallMojo.execute(InstallMojo.java:133)
	... 21 more
Caused by: org.sonatype.aether.installation.InstallationException: Failed to install metadata
org.apache.cayenne:cayenne-di/maven-metadata.xml: Could not read metadata /home/jenkins/.m2/repository/org/apache/cayenne/cayenne-di/maven-metadata-local.xml:
input contained no data
	at org.sonatype.aether.impl.internal.DefaultInstaller.install(DefaultInstaller.java:313)
	at org.sonatype.aether.impl.internal.DefaultInstaller.install(DefaultInstaller.java:211)
	at org.sonatype.aether.impl.internal.DefaultInstaller.install(DefaultInstaller.java:158)
	at org.sonatype.aether.impl.internal.DefaultRepositorySystem.install(DefaultRepositorySystem.java:436)
	at org.apache.maven.artifact.installer.DefaultArtifactInstaller.install(DefaultArtifactInstaller.java:107)
	... 22 more
Caused by: org.sonatype.aether.RepositoryException: Could not read metadata /home/jenkins/.m2/repository/org/apache/cayenne/cayenne-di/maven-metadata-local.xml:
input contained no data
	at org.apache.maven.repository.internal.MavenMetadata.read(MavenMetadata.java:101)
	at org.apache.maven.repository.internal.MavenMetadata.merge(MavenMetadata.java:69)
	at org.sonatype.aether.impl.internal.DefaultInstaller.install(DefaultInstaller.java:301)
	... 26 more
Caused by: java.io.EOFException: input contained no data
	at org.codehaus.plexus.util.xml.pull.MXParser.fillBuf(MXParser.java:3005)
	at org.codehaus.plexus.util.xml.pull.MXParser.more(MXParser.java:3048)
	at org.codehaus.plexus.util.xml.pull.MXParser.parseProlog(MXParser.java:1422)
	at org.codehaus.plexus.util.xml.pull.MXParser.nextImpl(MXParser.java:1407)
	at org.codehaus.plexus.util.xml.pull.MXParser.next(MXParser.java:1105)
	at org.apache.maven.artifact.repository.metadata.io.xpp3.MetadataXpp3Reader.read(MetadataXpp3Reader.java:1193)
	at org.apache.maven.artifact.repository.metadata.io.xpp3.MetadataXpp3Reader.read(MetadataXpp3Reader.java:1122)
	at org.apache.maven.repository.internal.MavenMetadata.read(MavenMetadata.java:97)
	... 28 more
[ERROR] 
[ERROR] Re-run Maven using the -X switch to enable full debug logging.
[ERROR] 
[ERROR] For more information about the errors and possible solutions, please read the following
articles:
[ERROR] [Help 1] http://cwiki.apache.org/confluence/display/MAVEN/MojoExecutionException
[ERROR] 
[ERROR] After correcting the problems, you can resume the build with the command
[ERROR]   mvn <goals> -rf :cayenne-di
Build step 'Invoke top-level Maven targets' marked build as failure

Mime
View raw message