cayenne-commits mailing list archives

Site index · List index
Message view « Date » · « Thread »
Top « Date » · « Thread »
From Apache Jenkins Server <jenk...@builds.apache.org>
Subject Build failed in Jenkins: cayenne-master » derby,JDK 1.7 (latest),Ubuntu #52
Date Sat, 18 Oct 2014 09:22:19 GMT
See <https://builds.apache.org/job/cayenne-master/cayenneTestConnection=derby,jdk=JDK%201.7%20(latest),label=Ubuntu/52/changes>

Changes:

[aadamchik] Pull request #18 by Alex Kolonitsky

[aadamchik] CAY-1826 | Merge Entity Attributes and Relationships tabs together with one toolbar.

[aadamchik] missing license headers

[aadamchik] CAY-1961 | Fix RemoveAction for DataMaps in ProjectTree

[aadamchik] CAY-1960 ExpressionFactory.exp(..) , and(..), or(..)

[aadamchik] CAY-1960 ExpressionFactory.exp(..) , and(..), or(..)

[aadamchik] CAY-1960 ExpressionFactory.exp(..) , and(..), or(..)

[aadamchik] CAY-1960 ExpressionFactory.exp(..) , and(..), or(..)

[aadamchik] CAY-1961 Fix RemoveAction for DataMaps in ProjectTree

[aadamchik] CAY-1826 Merge Entity Attributes and Relationships tabs together with one toolbar.

------------------------------------------
[...truncated 367 lines...]
[INFO] --- maven-source-plugin:2.1.2:jar (bundle-source-jar) @ cayenne-parent ---
[INFO] 
[INFO] --- maven-install-plugin:2.3.1:install (default-install) @ cayenne-parent ---
[INFO] Installing <https://builds.apache.org/job/cayenne-master/cayenneTestConnection=derby,jdk=JDK%201.7%20(latest),label=Ubuntu/ws/pom.xml>
to /home/jenkins/.m2/repository/org/apache/cayenne/cayenne-parent/3.2.M2-SNAPSHOT/cayenne-parent-3.2.M2-SNAPSHOT.pom
[INFO]                                                                         
[INFO] ------------------------------------------------------------------------
[INFO] Building Cayenne Build Tools Parent 3.2.M2-SNAPSHOT
[INFO] ------------------------------------------------------------------------
[INFO] 
[INFO] --- maven-clean-plugin:2.4.1:clean (default-clean) @ build-tools-parent ---
[INFO] 
[INFO] >>> maven-source-plugin:2.1.2:jar (bundle-source-jar) @ build-tools-parent
>>>
[INFO] 
[INFO] <<< maven-source-plugin:2.1.2:jar (bundle-source-jar) @ build-tools-parent
<<<
[INFO] 
[INFO] --- maven-source-plugin:2.1.2:jar (bundle-source-jar) @ build-tools-parent ---
[INFO] 
[INFO] --- maven-install-plugin:2.3.1:install (default-install) @ build-tools-parent ---
[INFO] Installing <https://builds.apache.org/job/cayenne-master/cayenneTestConnection=derby,jdk=JDK%201.7%20(latest),label=Ubuntu/ws/build-tools/pom.xml>
to /home/jenkins/.m2/repository/org/apache/cayenne/build-tools/build-tools-parent/3.2.M2-SNAPSHOT/build-tools-parent-3.2.M2-SNAPSHOT.pom
[INFO]                                                                         
[INFO] ------------------------------------------------------------------------
[INFO] Building Cayenne License and Notice Bundle 3.2.M2-SNAPSHOT
[INFO] ------------------------------------------------------------------------
[INFO] 
[INFO] --- maven-clean-plugin:2.4.1:clean (default-clean) @ cayenne-legal ---
[INFO] Deleting <https://builds.apache.org/job/cayenne-master/cayenneTestConnection=derby,jdk=JDK%201.7%20(latest),label=Ubuntu/ws/build-tools/cayenne-legal/target>
[INFO] 
[INFO] --- maven-remote-resources-plugin:1.5:bundle (default) @ cayenne-legal ---
[INFO] 
[INFO] --- maven-resources-plugin:2.4.3:resources (default-resources) @ cayenne-legal ---
[INFO] Using 'UTF-8' encoding to copy filtered resources.
[INFO] Copying 2 resources
[INFO] 
[INFO] --- maven-compiler-plugin:2.3.2:compile (default-compile) @ cayenne-legal ---
[INFO] No sources to compile
[INFO] 
[INFO] --- maven-resources-plugin:2.4.3:testResources (default-testResources) @ cayenne-legal
---
[INFO] Using 'UTF-8' encoding to copy filtered resources.
[INFO] skip non existing resourceDirectory <https://builds.apache.org/job/cayenne-master/cayenneTestConnection=derby,jdk=JDK%201.7%20(latest),label=Ubuntu/ws/build-tools/cayenne-legal/src/test/resources>
[INFO] 
[INFO] --- maven-compiler-plugin:2.3.2:testCompile (default-testCompile) @ cayenne-legal ---
[INFO] No sources to compile
[INFO] 
[INFO] --- maven-surefire-plugin:2.5:test (default-test) @ cayenne-legal ---
[INFO] No tests to run.
[INFO] 
[INFO] --- maven-jar-plugin:2.3.2:jar (default-jar) @ cayenne-legal ---
[INFO] Building jar: <https://builds.apache.org/job/cayenne-master/cayenneTestConnection=derby,jdk=JDK%201.7%20(latest),label=Ubuntu/ws/build-tools/cayenne-legal/target/cayenne-legal-3.2.M2-SNAPSHOT.jar>
[INFO] 
[INFO] >>> maven-source-plugin:2.1.2:jar (bundle-source-jar) @ cayenne-legal >>>
[INFO] 
[INFO] <<< maven-source-plugin:2.1.2:jar (bundle-source-jar) @ cayenne-legal <<<
[INFO] 
[INFO] --- maven-source-plugin:2.1.2:jar (bundle-source-jar) @ cayenne-legal ---
[INFO] Building jar: <https://builds.apache.org/job/cayenne-master/cayenneTestConnection=derby,jdk=JDK%201.7%20(latest),label=Ubuntu/ws/build-tools/cayenne-legal/target/cayenne-legal-3.2.M2-SNAPSHOT-sources.jar>
[INFO] 
[INFO] --- maven-install-plugin:2.3.1:install (default-install) @ cayenne-legal ---
[INFO] Installing <https://builds.apache.org/job/cayenne-master/cayenneTestConnection=derby,jdk=JDK%201.7%20(latest),label=Ubuntu/ws/build-tools/cayenne-legal/target/cayenne-legal-3.2.M2-SNAPSHOT.jar>
to /home/jenkins/.m2/repository/org/apache/cayenne/build-tools/cayenne-legal/3.2.M2-SNAPSHOT/cayenne-legal-3.2.M2-SNAPSHOT.jar
[INFO] Installing <https://builds.apache.org/job/cayenne-master/cayenneTestConnection=derby,jdk=JDK%201.7%20(latest),label=Ubuntu/ws/build-tools/cayenne-legal/pom.xml>
to /home/jenkins/.m2/repository/org/apache/cayenne/build-tools/cayenne-legal/3.2.M2-SNAPSHOT/cayenne-legal-3.2.M2-SNAPSHOT.pom
[INFO] Installing <https://builds.apache.org/job/cayenne-master/cayenneTestConnection=derby,jdk=JDK%201.7%20(latest),label=Ubuntu/ws/build-tools/cayenne-legal/target/cayenne-legal-3.2.M2-SNAPSHOT-sources.jar>
to /home/jenkins/.m2/repository/org/apache/cayenne/build-tools/cayenne-legal/3.2.M2-SNAPSHOT/cayenne-legal-3.2.M2-SNAPSHOT-sources.jar
[INFO]                                                                         
[INFO] ------------------------------------------------------------------------
[INFO] Building Common Unit Test Utilities 3.2.M2-SNAPSHOT
[INFO] ------------------------------------------------------------------------
[INFO] 
[INFO] --- maven-clean-plugin:2.4.1:clean (default-clean) @ cayenne-test-utilities ---
[INFO] Deleting <https://builds.apache.org/job/cayenne-master/cayenneTestConnection=derby,jdk=JDK%201.7%20(latest),label=Ubuntu/ws/build-tools/cayenne-test-utilities/target>
[INFO] 
[INFO] --- maven-resources-plugin:2.4.3:resources (default-resources) @ cayenne-test-utilities
---
[INFO] Using 'UTF-8' encoding to copy filtered resources.
[INFO] skip non existing resourceDirectory <https://builds.apache.org/job/cayenne-master/cayenneTestConnection=derby,jdk=JDK%201.7%20(latest),label=Ubuntu/ws/build-tools/cayenne-test-utilities/src/main/resources>
[INFO] 
[INFO] --- maven-compiler-plugin:2.3.2:compile (default-compile) @ cayenne-test-utilities
---
[INFO] Compiling 14 source files to <https://builds.apache.org/job/cayenne-master/cayenneTestConnection=derby,jdk=JDK%201.7%20(latest),label=Ubuntu/ws/build-tools/cayenne-test-utilities/target/classes>
[INFO] 
[INFO] --- maven-resources-plugin:2.4.3:testResources (default-testResources) @ cayenne-test-utilities
---
[INFO] Using 'UTF-8' encoding to copy filtered resources.
[INFO] skip non existing resourceDirectory <https://builds.apache.org/job/cayenne-master/cayenneTestConnection=derby,jdk=JDK%201.7%20(latest),label=Ubuntu/ws/build-tools/cayenne-test-utilities/src/test/resources>
[INFO] 
[INFO] --- maven-compiler-plugin:2.3.2:testCompile (default-testCompile) @ cayenne-test-utilities
---
[INFO] No sources to compile
[INFO] 
[INFO] --- maven-surefire-plugin:2.5:test (default-test) @ cayenne-test-utilities ---
[INFO] No tests to run.
[INFO] 
[INFO] --- maven-jar-plugin:2.3.2:jar (default-jar) @ cayenne-test-utilities ---
[INFO] Building jar: <https://builds.apache.org/job/cayenne-master/cayenneTestConnection=derby,jdk=JDK%201.7%20(latest),label=Ubuntu/ws/build-tools/cayenne-test-utilities/target/cayenne-test-utilities-3.2.M2-SNAPSHOT.jar>
[INFO] 
[INFO] >>> maven-source-plugin:2.1.2:jar (bundle-source-jar) @ cayenne-test-utilities
>>>
[INFO] 
[INFO] <<< maven-source-plugin:2.1.2:jar (bundle-source-jar) @ cayenne-test-utilities
<<<
[INFO] 
[INFO] --- maven-source-plugin:2.1.2:jar (bundle-source-jar) @ cayenne-test-utilities ---
[INFO] Building jar: <https://builds.apache.org/job/cayenne-master/cayenneTestConnection=derby,jdk=JDK%201.7%20(latest),label=Ubuntu/ws/build-tools/cayenne-test-utilities/target/cayenne-test-utilities-3.2.M2-SNAPSHOT-sources.jar>
[INFO] 
[INFO] --- maven-install-plugin:2.3.1:install (default-install) @ cayenne-test-utilities ---
[INFO] Installing <https://builds.apache.org/job/cayenne-master/cayenneTestConnection=derby,jdk=JDK%201.7%20(latest),label=Ubuntu/ws/build-tools/cayenne-test-utilities/target/cayenne-test-utilities-3.2.M2-SNAPSHOT.jar>
to /home/jenkins/.m2/repository/org/apache/cayenne/build-tools/cayenne-test-utilities/3.2.M2-SNAPSHOT/cayenne-test-utilities-3.2.M2-SNAPSHOT.jar
[INFO] Installing <https://builds.apache.org/job/cayenne-master/cayenneTestConnection=derby,jdk=JDK%201.7%20(latest),label=Ubuntu/ws/build-tools/cayenne-test-utilities/pom.xml>
to /home/jenkins/.m2/repository/org/apache/cayenne/build-tools/cayenne-test-utilities/3.2.M2-SNAPSHOT/cayenne-test-utilities-3.2.M2-SNAPSHOT.pom
[INFO] Installing <https://builds.apache.org/job/cayenne-master/cayenneTestConnection=derby,jdk=JDK%201.7%20(latest),label=Ubuntu/ws/build-tools/cayenne-test-utilities/target/cayenne-test-utilities-3.2.M2-SNAPSHOT-sources.jar>
to /home/jenkins/.m2/repository/org/apache/cayenne/build-tools/cayenne-test-utilities/3.2.M2-SNAPSHOT/cayenne-test-utilities-3.2.M2-SNAPSHOT-sources.jar
[INFO]                                                                         
[INFO] ------------------------------------------------------------------------
[INFO] Building Cayenne Code Checkers 3.2.M2-SNAPSHOT
[INFO] ------------------------------------------------------------------------
[INFO] 
[INFO] --- maven-clean-plugin:2.4.1:clean (default-clean) @ cayenne-checkers ---
[INFO] Deleting <https://builds.apache.org/job/cayenne-master/cayenneTestConnection=derby,jdk=JDK%201.7%20(latest),label=Ubuntu/ws/build-tools/cayenne-checkers/target>
[INFO] 
[INFO] --- maven-resources-plugin:2.4.3:resources (default-resources) @ cayenne-checkers ---
[INFO] Using 'UTF-8' encoding to copy filtered resources.
[INFO] Copying 4 resources
[INFO] 
[INFO] --- maven-compiler-plugin:2.3.2:compile (default-compile) @ cayenne-checkers ---
[INFO] No sources to compile
[INFO] 
[INFO] --- maven-resources-plugin:2.4.3:testResources (default-testResources) @ cayenne-checkers
---
[INFO] Using 'UTF-8' encoding to copy filtered resources.
[INFO] skip non existing resourceDirectory <https://builds.apache.org/job/cayenne-master/cayenneTestConnection=derby,jdk=JDK%201.7%20(latest),label=Ubuntu/ws/build-tools/cayenne-checkers/src/test/resources>
[INFO] 
[INFO] --- maven-compiler-plugin:2.3.2:testCompile (default-testCompile) @ cayenne-checkers
---
[INFO] Not compiling test sources
[INFO] 
[INFO] --- maven-surefire-plugin:2.5:test (default-test) @ cayenne-checkers ---
[INFO] Tests are skipped.
[INFO] 
[INFO] --- maven-jar-plugin:2.3.2:jar (default-jar) @ cayenne-checkers ---
[INFO] Building jar: <https://builds.apache.org/job/cayenne-master/cayenneTestConnection=derby,jdk=JDK%201.7%20(latest),label=Ubuntu/ws/build-tools/cayenne-checkers/target/cayenne-checkers-3.2.M2-SNAPSHOT.jar>
[INFO] 
[INFO] >>> maven-source-plugin:2.1.2:jar (bundle-source-jar) @ cayenne-checkers >>>
[INFO] 
[INFO] <<< maven-source-plugin:2.1.2:jar (bundle-source-jar) @ cayenne-checkers <<<
[INFO] 
[INFO] --- maven-source-plugin:2.1.2:jar (bundle-source-jar) @ cayenne-checkers ---
[INFO] Building jar: <https://builds.apache.org/job/cayenne-master/cayenneTestConnection=derby,jdk=JDK%201.7%20(latest),label=Ubuntu/ws/build-tools/cayenne-checkers/target/cayenne-checkers-3.2.M2-SNAPSHOT-sources.jar>
[INFO] 
[INFO] --- maven-install-plugin:2.3.1:install (default-install) @ cayenne-checkers ---
[INFO] Installing <https://builds.apache.org/job/cayenne-master/cayenneTestConnection=derby,jdk=JDK%201.7%20(latest),label=Ubuntu/ws/build-tools/cayenne-checkers/target/cayenne-checkers-3.2.M2-SNAPSHOT.jar>
to /home/jenkins/.m2/repository/org/apache/cayenne/build-tools/cayenne-checkers/3.2.M2-SNAPSHOT/cayenne-checkers-3.2.M2-SNAPSHOT.jar
[INFO] Installing <https://builds.apache.org/job/cayenne-master/cayenneTestConnection=derby,jdk=JDK%201.7%20(latest),label=Ubuntu/ws/build-tools/cayenne-checkers/pom.xml>
to /home/jenkins/.m2/repository/org/apache/cayenne/build-tools/cayenne-checkers/3.2.M2-SNAPSHOT/cayenne-checkers-3.2.M2-SNAPSHOT.pom
[INFO] Installing <https://builds.apache.org/job/cayenne-master/cayenneTestConnection=derby,jdk=JDK%201.7%20(latest),label=Ubuntu/ws/build-tools/cayenne-checkers/target/cayenne-checkers-3.2.M2-SNAPSHOT-sources.jar>
to /home/jenkins/.m2/repository/org/apache/cayenne/build-tools/cayenne-checkers/3.2.M2-SNAPSHOT/cayenne-checkers-3.2.M2-SNAPSHOT-sources.jar
[INFO] ------------------------------------------------------------------------
[INFO] Reactor Summary:
[INFO] 
[INFO] Cayenne ........................................... SUCCESS [0.662s]
[INFO] Cayenne Build Tools Parent ........................ SUCCESS [0.016s]
[INFO] Cayenne License and Notice Bundle ................. SUCCESS [1.383s]
[INFO] Common Unit Test Utilities ........................ SUCCESS [0.981s]
[INFO] Cayenne Code Checkers ............................. FAILURE [0.150s]
[INFO] Cayenne Dependency Injection Container ............ SKIPPED
[INFO] Cayenne Server .................................... SKIPPED
[INFO] Cayenne ROP Client ................................ SKIPPED
[INFO] Cayenne Project ................................... SKIPPED
[INFO] Cayenne Tools ..................................... SKIPPED
[INFO] Cayenne Lifecycle Utilities ....................... SKIPPED
[INFO] Cayenne Maven Plugins ............................. SKIPPED
[INFO] Cayenne Maven Plugin .............................. SKIPPED
[INFO] Cayenne Cryptography Extensions ................... SKIPPED
[INFO] Cayenne Integration Tests Parent .................. SKIPPED
[INFO] Integration Tests - Cayenne Tools ................. SKIPPED
[INFO] Cayenne Modeler Parent ............................ SKIPPED
[INFO] Cayenne WebObjects Compatibility Library .......... SKIPPED
[INFO] Cayenne Modeler ................................... SKIPPED
[INFO] Cayenne Modeler Generic and Windows Extensions .... SKIPPED
[INFO] Cayenne Modeler Generic ........................... SKIPPED
[INFO] Cayenne Modeler Mac OS X Extensions ............... SKIPPED
[INFO] Cayenne Modeler Mac OS X .......................... SKIPPED
[INFO] Cayenne Modeler Mac OS X - Old Apple Java ......... SKIPPED
[INFO] Cayenne Modeler Windows ........................... SKIPPED
[INFO] Cayenne Modeler Maven Plugin ...................... SKIPPED
[INFO] Cayenne Tutorial .................................. SKIPPED
[INFO] Cayenne ROP Server Tutorial ....................... SKIPPED
[INFO] Cayenne ROP Client Tutorial ....................... SKIPPED
[INFO] Cayenne Tutorials ................................. SKIPPED
[INFO] Cayenne Documenation Parent ....................... SKIPPED
[INFO] Cayenne Documentation ............................. SKIPPED
[INFO] Cayenne Docbook Documentation ..................... SKIPPED
[INFO] Docbook: Cayenne Stylesheets ...................... SKIPPED
[INFO] Docbook: Cayenne Guide ............................ SKIPPED
[INFO] Docbook: Getting Started with Cayenne ............. SKIPPED
[INFO] Docbook: Getting Started with Cayenne ROP ......... SKIPPED
[INFO] Docbook: Cayenne New Features and Upgrade Guide ... SKIPPED
[INFO] Cayenne Release Assembly .......................... SKIPPED
[INFO] ------------------------------------------------------------------------
[INFO] BUILD FAILURE
[INFO] ------------------------------------------------------------------------
[INFO] Total time: 4.644s
[INFO] Finished at: Sat Oct 18 09:22:07 UTC 2014
[INFO] Final Memory: 19M/182M
[INFO] ------------------------------------------------------------------------
[ERROR] Failed to execute goal org.apache.maven.plugins:maven-install-plugin:2.3.1:install
(default-install) on project cayenne-checkers: Failed to install metadata org.apache.cayenne.build-tools:cayenne-checkers:3.2.M2-SNAPSHOT/maven-metadata.xml:
Could not read metadata /home/jenkins/.m2/repository/org/apache/cayenne/build-tools/cayenne-checkers/3.2.M2-SNAPSHOT/maven-metadata-local.xml:
input contained no data -> [Help 1]
org.apache.maven.lifecycle.LifecycleExecutionException: Failed to execute goal org.apache.maven.plugins:maven-install-plugin:2.3.1:install
(default-install) on project cayenne-checkers: Failed to install metadata org.apache.cayenne.build-tools:cayenne-checkers:3.2.M2-SNAPSHOT/maven-metadata.xml:
Could not read metadata /home/jenkins/.m2/repository/org/apache/cayenne/build-tools/cayenne-checkers/3.2.M2-SNAPSHOT/maven-metadata-local.xml:
input contained no data
	at org.apache.maven.lifecycle.internal.MojoExecutor.execute(MojoExecutor.java:217)
	at org.apache.maven.lifecycle.internal.MojoExecutor.execute(MojoExecutor.java:153)
	at org.apache.maven.lifecycle.internal.MojoExecutor.execute(MojoExecutor.java:145)
	at org.apache.maven.lifecycle.internal.LifecycleModuleBuilder.buildProject(LifecycleModuleBuilder.java:84)
	at org.apache.maven.lifecycle.internal.LifecycleModuleBuilder.buildProject(LifecycleModuleBuilder.java:59)
	at org.apache.maven.lifecycle.internal.LifecycleStarter.singleThreadedBuild(LifecycleStarter.java:183)
	at org.apache.maven.lifecycle.internal.LifecycleStarter.execute(LifecycleStarter.java:161)
	at org.apache.maven.DefaultMaven.doExecute(DefaultMaven.java:320)
	at org.apache.maven.DefaultMaven.execute(DefaultMaven.java:156)
	at org.apache.maven.cli.MavenCli.execute(MavenCli.java:537)
	at org.apache.maven.cli.MavenCli.doMain(MavenCli.java:196)
	at org.apache.maven.cli.MavenCli.main(MavenCli.java:141)
	at sun.reflect.NativeMethodAccessorImpl.invoke0(Native Method)
	at sun.reflect.NativeMethodAccessorImpl.invoke(NativeMethodAccessorImpl.java:57)
	at sun.reflect.DelegatingMethodAccessorImpl.invoke(DelegatingMethodAccessorImpl.java:43)
	at java.lang.reflect.Method.invoke(Method.java:606)
	at org.codehaus.plexus.classworlds.launcher.Launcher.launchEnhanced(Launcher.java:290)
	at org.codehaus.plexus.classworlds.launcher.Launcher.launch(Launcher.java:230)
	at org.codehaus.plexus.classworlds.launcher.Launcher.mainWithExitCode(Launcher.java:409)
	at org.codehaus.plexus.classworlds.launcher.Launcher.main(Launcher.java:352)
Caused by: org.apache.maven.plugin.MojoExecutionException: Failed to install metadata org.apache.cayenne.build-tools:cayenne-checkers:3.2.M2-SNAPSHOT/maven-metadata.xml:
Could not read metadata /home/jenkins/.m2/repository/org/apache/cayenne/build-tools/cayenne-checkers/3.2.M2-SNAPSHOT/maven-metadata-local.xml:
input contained no data
	at org.apache.maven.plugin.install.InstallMojo.execute(InstallMojo.java:139)
	at org.apache.maven.plugin.DefaultBuildPluginManager.executeMojo(DefaultBuildPluginManager.java:101)
	at org.apache.maven.lifecycle.internal.MojoExecutor.execute(MojoExecutor.java:209)
	... 19 more
Caused by: org.apache.maven.artifact.installer.ArtifactInstallationException: Failed to install
metadata org.apache.cayenne.build-tools:cayenne-checkers:3.2.M2-SNAPSHOT/maven-metadata.xml:
Could not read metadata /home/jenkins/.m2/repository/org/apache/cayenne/build-tools/cayenne-checkers/3.2.M2-SNAPSHOT/maven-metadata-local.xml:
input contained no data
	at org.apache.maven.artifact.installer.DefaultArtifactInstaller.install(DefaultArtifactInstaller.java:111)
	at org.apache.maven.plugin.install.InstallMojo.execute(InstallMojo.java:133)
	... 21 more
Caused by: org.sonatype.aether.installation.InstallationException: Failed to install metadata
org.apache.cayenne.build-tools:cayenne-checkers:3.2.M2-SNAPSHOT/maven-metadata.xml: Could
not read metadata /home/jenkins/.m2/repository/org/apache/cayenne/build-tools/cayenne-checkers/3.2.M2-SNAPSHOT/maven-metadata-local.xml:
input contained no data
	at org.sonatype.aether.impl.internal.DefaultInstaller.install(DefaultInstaller.java:313)
	at org.sonatype.aether.impl.internal.DefaultInstaller.install(DefaultInstaller.java:211)
	at org.sonatype.aether.impl.internal.DefaultInstaller.install(DefaultInstaller.java:158)
	at org.sonatype.aether.impl.internal.DefaultRepositorySystem.install(DefaultRepositorySystem.java:436)
	at org.apache.maven.artifact.installer.DefaultArtifactInstaller.install(DefaultArtifactInstaller.java:107)
	... 22 more
Caused by: org.sonatype.aether.RepositoryException: Could not read metadata /home/jenkins/.m2/repository/org/apache/cayenne/build-tools/cayenne-checkers/3.2.M2-SNAPSHOT/maven-metadata-local.xml:
input contained no data
	at org.apache.maven.repository.internal.MavenMetadata.read(MavenMetadata.java:101)
	at org.apache.maven.repository.internal.MavenMetadata.merge(MavenMetadata.java:69)
	at org.sonatype.aether.impl.internal.DefaultInstaller.install(DefaultInstaller.java:301)
	... 26 more
Caused by: java.io.EOFException: input contained no data
	at org.codehaus.plexus.util.xml.pull.MXParser.fillBuf(MXParser.java:3005)
	at org.codehaus.plexus.util.xml.pull.MXParser.more(MXParser.java:3048)
	at org.codehaus.plexus.util.xml.pull.MXParser.parseProlog(MXParser.java:1422)
	at org.codehaus.plexus.util.xml.pull.MXParser.nextImpl(MXParser.java:1407)
	at org.codehaus.plexus.util.xml.pull.MXParser.next(MXParser.java:1105)
	at org.apache.maven.artifact.repository.metadata.io.xpp3.MetadataXpp3Reader.read(MetadataXpp3Reader.java:1193)
	at org.apache.maven.artifact.repository.metadata.io.xpp3.MetadataXpp3Reader.read(MetadataXpp3Reader.java:1122)
	at org.apache.maven.repository.internal.MavenMetadata.read(MavenMetadata.java:97)
	... 28 more
[ERROR] 
[ERROR] Re-run Maven using the -X switch to enable full debug logging.
[ERROR] 
[ERROR] For more information about the errors and possible solutions, please read the following
articles:
[ERROR] [Help 1] http://cwiki.apache.org/confluence/display/MAVEN/MojoExecutionException
[ERROR] 
[ERROR] After correcting the problems, you can resume the build with the command
[ERROR]   mvn <goals> -rf :cayenne-checkers
Build step 'Invoke top-level Maven targets' marked build as failure

Mime
View raw message