cayenne-commits mailing list archives

Site index · List index
Message view « Date » · « Thread »
Top « Date » · « Thread »
From Apache Jenkins Server <jenk...@builds.apache.org>
Subject Build failed in Jenkins: cayenne-master » h2,JDK 1.6 (latest),Ubuntu #46
Date Sun, 05 Oct 2014 12:33:40 GMT
See <https://builds.apache.org/job/cayenne-master/cayenneTestConnection=h2,jdk=JDK%201.6%20(latest),label=Ubuntu/46/changes>

Changes:

[aadamchik] merging QualifiedQuery into SelectQuery

[aadamchik] stale javadocs

[aadamchik] CAY-1958 IdSelect - a new full-featured select query to get objects by id

------------------------------------------
[...truncated 93966 lines...]
2541/2574 KB   
2545/2574 KB   
2545/2574 KB   
2549/2574 KB   
2550/2574 KB   
2554/2574 KB   
2554/2574 KB   
2558/2574 KB   
2562/2574 KB   
2562/2574 KB   
2566/2574 KB   
2567/2574 KB   
2571/2574 KB   
2571/2574 KB   
2574/2574 KB   
               
Downloaded: http://maven.objectstyle.org/nexus/content/groups/cayenne-deps/org/apache/derby/derby/10.7.1.1/derby-10.7.1.1.jar
(2574 KB at 1398.8 KB/sec)
[INFO] 
[INFO] --- maven-clean-plugin:2.4.1:clean (default-clean) @ maven-cayenne-plugin ---
[INFO] 
[INFO] --- maven-plugin-plugin:2.9:descriptor (default-descriptor) @ maven-cayenne-plugin
---
Downloading: http://maven.objectstyle.org/nexus/content/groups/cayenne-deps/org/apache/maven/plugin-tools/maven-plugin-tools-api/2.9/maven-plugin-tools-api-2.9.pom
4/5 KB         
5/5 KB   
         
Downloaded: http://maven.objectstyle.org/nexus/content/groups/cayenne-deps/org/apache/maven/plugin-tools/maven-plugin-tools-api/2.9/maven-plugin-tools-api-2.9.pom
(5 KB at 11.6 KB/sec)
Downloading: http://maven.objectstyle.org/nexus/content/groups/cayenne-deps/org/apache/maven/plugin-tools/maven-plugin-tools/2.9/maven-plugin-tools-2.9.pom
4/10 KB   
8/10 KB   
10/10 KB   
           
Downloaded: http://maven.objectstyle.org/nexus/content/groups/cayenne-deps/org/apache/maven/plugin-tools/maven-plugin-tools/2.9/maven-plugin-tools-2.9.pom
(10 KB at 34.2 KB/sec)
Downloading: http://maven.objectstyle.org/nexus/content/groups/cayenne-deps/org/apache/maven/plugin-tools/maven-plugin-tools-java/2.9/maven-plugin-tools-java-2.9.pom
3/3 KB     
         
Downloaded: http://maven.objectstyle.org/nexus/content/groups/cayenne-deps/org/apache/maven/plugin-tools/maven-plugin-tools-java/2.9/maven-plugin-tools-java-2.9.pom
(3 KB at 8.4 KB/sec)
Downloading: http://maven.objectstyle.org/nexus/content/groups/cayenne-deps/com/thoughtworks/qdox/qdox/1.11/qdox-1.11.pom
4/19 KB   
8/19 KB   
12/19 KB   
14/19 KB   
16/19 KB   
19/19 KB   
           
Downloaded: http://maven.objectstyle.org/nexus/content/groups/cayenne-deps/com/thoughtworks/qdox/qdox/1.11/qdox-1.11.pom
(19 KB at 40.6 KB/sec)
Downloading: http://maven.objectstyle.org/nexus/content/groups/cayenne-deps/org/apache/maven/plugin-tools/maven-plugin-tools-beanshell/2.9/maven-plugin-tools-beanshell-2.9.pom
3/3 KB     
         
Downloaded: http://maven.objectstyle.org/nexus/content/groups/cayenne-deps/org/apache/maven/plugin-tools/maven-plugin-tools-beanshell/2.9/maven-plugin-tools-beanshell-2.9.pom
(3 KB at 7.2 KB/sec)
Downloading: http://maven.objectstyle.org/nexus/content/groups/cayenne-deps/com/thoughtworks/qdox/qdox/1.11/qdox-1.11.jar
4/172 KB   
8/172 KB   
12/172 KB   
14/172 KB   
18/172 KB   
21/172 KB   
25/172 KB   
28/172 KB   
32/172 KB   
34/172 KB   
37/172 KB   
41/172 KB   
45/172 KB   
48/172 KB   
52/172 KB   
56/172 KB   
59/172 KB   
63/172 KB   
66/172 KB   
70/172 KB   
73/172 KB   
77/172 KB   
81/172 KB   
85/172 KB   
89/172 KB   
93/172 KB   
97/172 KB   
101/172 KB   
104/172 KB   
108/172 KB   
112/172 KB   
116/172 KB   
120/172 KB   
124/172 KB   
128/172 KB   
132/172 KB   
136/172 KB   
140/172 KB   
144/172 KB   
148/172 KB   
152/172 KB   
156/172 KB   
160/172 KB   
164/172 KB   
168/172 KB   
172/172 KB   
172/172 KB   
             
Downloaded: http://maven.objectstyle.org/nexus/content/groups/cayenne-deps/com/thoughtworks/qdox/qdox/1.11/qdox-1.11.jar
(172 KB at 239.8 KB/sec)
[ERROR] 

Artifact Ids of the format maven-___-plugin are reserved for 
plugins in the Group Id org.apache.maven.plugins
Please change your artifactId to the format ___-maven-plugin
In the future this error will break the build.


[WARNING] Using platform encoding (ISO-8859-1 actually) to read mojo metadata, i.e. build
is platform dependent!
[INFO] Applying mojo extractor for language: java
[INFO] Mojo extractor for language: java found 3 mojo descriptors.
[INFO] Applying mojo extractor for language: bsh
[INFO] Mojo extractor for language: bsh found 0 mojo descriptors.
[INFO] 
[INFO] --- maven-remote-resources-plugin:1.5:process (default) @ maven-cayenne-plugin ---
[INFO] 
[INFO] --- maven-resources-plugin:2.4.3:resources (default-resources) @ maven-cayenne-plugin
---
[INFO] Using 'UTF-8' encoding to copy filtered resources.
[INFO] Copying 1 resource
[INFO] Copying 4 resources
[INFO] 
[INFO] --- maven-compiler-plugin:2.3.2:compile (default-compile) @ maven-cayenne-plugin ---
[INFO] Compiling 4 source files to <https://builds.apache.org/job/cayenne-master/cayenneTestConnection=h2,jdk=JDK%201.6%20(latest),label=Ubuntu/ws/plugins/maven-cayenne-plugin/target/classes>
[INFO] 
[INFO] --- maven-resources-plugin:2.4.3:testResources (default-testResources) @ maven-cayenne-plugin
---
[INFO] Using 'UTF-8' encoding to copy filtered resources.
[INFO] Copying 17 resources
[INFO] Copying 8 resources
[INFO] 
[INFO] --- maven-compiler-plugin:2.3.2:testCompile (default-testCompile) @ maven-cayenne-plugin
---
[INFO] Compiling 2 source files to <https://builds.apache.org/job/cayenne-master/cayenneTestConnection=h2,jdk=JDK%201.6%20(latest),label=Ubuntu/ws/plugins/maven-cayenne-plugin/target/test-classes>
[INFO] 
[INFO] --- maven-surefire-plugin:2.5:test (default-test) @ maven-cayenne-plugin ---
[INFO] Surefire report directory: <https://builds.apache.org/job/cayenne-master/cayenneTestConnection=h2,jdk=JDK%201.6%20(latest),label=Ubuntu/ws/plugins/maven-cayenne-plugin/target/surefire-reports>

-------------------------------------------------------
 T E S T S
-------------------------------------------------------
Running org.apache.cayenne.tools.CayenneGeneratorMojoTest
[INFO] Generating superclass file: <https://builds.apache.org/job/cayenne-master/cayenneTestConnection=h2,jdk=JDK%201.6%20(latest),label=Ubuntu/ws/plugins/maven-cayenne-plugin/target/cayenneGeneratedClasses/superPkg/_TestEntity.txt>
[INFO] Generating class file: <https://builds.apache.org/job/cayenne-master/cayenneTestConnection=h2,jdk=JDK%201.6%20(latest),label=Ubuntu/ws/plugins/maven-cayenne-plugin/target/cayenneGeneratedClasses/pack/TestEntity.txt>
[INFO] Generating superclass file: <https://builds.apache.org/job/cayenne-master/cayenneTestConnection=h2,jdk=JDK%201.6%20(latest),label=Ubuntu/ws/plugins/maven-cayenne-plugin/target/cayenneGeneratedClasses/superPkg/_Embeddable.txt>
[INFO] Generating class file: <https://builds.apache.org/job/cayenne-master/cayenneTestConnection=h2,jdk=JDK%201.6%20(latest),label=Ubuntu/ws/plugins/maven-cayenne-plugin/target/cayenneGeneratedClasses/pack/Embeddable.txt>
[INFO] Generating superclass file: <https://builds.apache.org/job/cayenne-master/cayenneTestConnection=h2,jdk=JDK%201.6%20(latest),label=Ubuntu/ws/plugins/maven-cayenne-plugin/target/cayenneGeneratedClasses/superPkg/_TestDomainMap.txt>
[INFO] Generating class file: <https://builds.apache.org/job/cayenne-master/cayenneTestConnection=h2,jdk=JDK%201.6%20(latest),label=Ubuntu/ws/plugins/maven-cayenne-plugin/target/cayenneGeneratedClasses/pack/TestDomainMap.txt>
Tests run: 1, Failures: 0, Errors: 0, Skipped: 0, Time elapsed: 0.683 sec
Running org.apache.cayenne.tools.DbImporterMojoTest
[WARNING] 'meaningfulPk' property is deprecated. Use 'meaningfulPkTables' pattern instead
Tests run: 5, Failures: 0, Errors: 3, Skipped: 0, Time elapsed: 1.062 sec <<< FAILURE!

Results :

Tests in error: 
  testImportNewDataMap(org.apache.cayenne.tools.DbImporterMojoTest)
  testImportAddTableAndColumn(org.apache.cayenne.tools.DbImporterMojoTest)
  testImportWithoutChanges(org.apache.cayenne.tools.DbImporterMojoTest)

Tests run: 6, Failures: 0, Errors: 3, Skipped: 0

[INFO] ------------------------------------------------------------------------
[INFO] Reactor Summary:
[INFO] 
[INFO] Cayenne ........................................... SUCCESS [0.366s]
[INFO] Cayenne Build Tools Parent ........................ SUCCESS [0.012s]
[INFO] Cayenne License and Notice Bundle ................. SUCCESS [6.951s]
[INFO] Common Unit Test Utilities ........................ SUCCESS [0.876s]
[INFO] Cayenne Dependency Injection Container ............ SUCCESS [7.574s]
[INFO] Cayenne Server .................................... SUCCESS [7:23.874s]
[INFO] Cayenne ROP Client ................................ SUCCESS [1:40.625s]
[INFO] Cayenne Project ................................... SUCCESS [2.572s]
[INFO] Cayenne Tools ..................................... SUCCESS [6.487s]
[INFO] Cayenne Lifecycle Utilities ....................... SUCCESS [5.404s]
[INFO] Cayenne Maven Plugins ............................. SUCCESS [0.015s]
[INFO] Cayenne Maven Plugin .............................. FAILURE [9.582s]
[INFO] Cayenne Cryptography Extensions ................... SKIPPED
[INFO] Cayenne Integration Tests Parent .................. SKIPPED
[INFO] Integration Tests - Cayenne Tools ................. SKIPPED
[INFO] Cayenne Modeler Parent ............................ SKIPPED
[INFO] Cayenne WebObjects Compatibility Library .......... SKIPPED
[INFO] Cayenne Modeler ................................... SKIPPED
[INFO] Cayenne Modeler Generic and Windows Extensions .... SKIPPED
[INFO] Cayenne Modeler Generic ........................... SKIPPED
[INFO] Cayenne Modeler Mac OS X Extensions ............... SKIPPED
[INFO] Cayenne Modeler Mac OS X .......................... SKIPPED
[INFO] Cayenne Modeler Mac OS X - Old Apple Java ......... SKIPPED
[INFO] Cayenne Modeler Windows ........................... SKIPPED
[INFO] Cayenne Modeler Maven Plugin ...................... SKIPPED
[INFO] Cayenne Tutorial .................................. SKIPPED
[INFO] Cayenne ROP Server Tutorial ....................... SKIPPED
[INFO] Cayenne ROP Client Tutorial ....................... SKIPPED
[INFO] Cayenne Tutorials ................................. SKIPPED
[INFO] Cayenne Documenation Parent ....................... SKIPPED
[INFO] Cayenne Documentation ............................. SKIPPED
[INFO] Cayenne Docbook Documentation ..................... SKIPPED
[INFO] Docbook: Cayenne Stylesheets ...................... SKIPPED
[INFO] Docbook: Cayenne Guide ............................ SKIPPED
[INFO] Docbook: Getting Started with Cayenne ............. SKIPPED
[INFO] Docbook: Getting Started with Cayenne ROP ......... SKIPPED
[INFO] Docbook: Cayenne New Features and Upgrade Guide ... SKIPPED
[INFO] Cayenne Release Assembly .......................... SKIPPED
[INFO] ------------------------------------------------------------------------
[INFO] BUILD FAILURE
[INFO] ------------------------------------------------------------------------
[INFO] Total time: 9:47.834s
[INFO] Finished at: Sun Oct 05 12:32:11 UTC 2014
[INFO] Final Memory: 78M/384M
[INFO] ------------------------------------------------------------------------
[ERROR] Failed to execute goal org.apache.maven.plugins:maven-surefire-plugin:2.5:test (default-test)
on project maven-cayenne-plugin: There are test failures.
[ERROR] 
[ERROR] Please refer to <https://builds.apache.org/job/cayenne-master/cayenneTestConnection=h2,jdk=JDK%201.6%20(latest),label=Ubuntu/ws/plugins/maven-cayenne-plugin/target/surefire-reports>
for the individual test results.
[ERROR] -> [Help 1]
org.apache.maven.lifecycle.LifecycleExecutionException: Failed to execute goal org.apache.maven.plugins:maven-surefire-plugin:2.5:test
(default-test) on project maven-cayenne-plugin: There are test failures.

Please refer to <https://builds.apache.org/job/cayenne-master/cayenneTestConnection=h2,jdk=JDK%201.6%20(latest),label=Ubuntu/ws/plugins/maven-cayenne-plugin/target/surefire-reports>
for the individual test results.
	at org.apache.maven.lifecycle.internal.MojoExecutor.execute(MojoExecutor.java:213)
	at org.apache.maven.lifecycle.internal.MojoExecutor.execute(MojoExecutor.java:153)
	at org.apache.maven.lifecycle.internal.MojoExecutor.execute(MojoExecutor.java:145)
	at org.apache.maven.lifecycle.internal.LifecycleModuleBuilder.buildProject(LifecycleModuleBuilder.java:84)
	at org.apache.maven.lifecycle.internal.LifecycleModuleBuilder.buildProject(LifecycleModuleBuilder.java:59)
	at org.apache.maven.lifecycle.internal.LifecycleStarter.singleThreadedBuild(LifecycleStarter.java:183)
	at org.apache.maven.lifecycle.internal.LifecycleStarter.execute(LifecycleStarter.java:161)
	at org.apache.maven.DefaultMaven.doExecute(DefaultMaven.java:320)
	at org.apache.maven.DefaultMaven.execute(DefaultMaven.java:156)
	at org.apache.maven.cli.MavenCli.execute(MavenCli.java:537)
	at org.apache.maven.cli.MavenCli.doMain(MavenCli.java:196)
	at org.apache.maven.cli.MavenCli.main(MavenCli.java:141)
	at sun.reflect.NativeMethodAccessorImpl.invoke0(Native Method)
	at sun.reflect.NativeMethodAccessorImpl.invoke(NativeMethodAccessorImpl.java:39)
	at sun.reflect.DelegatingMethodAccessorImpl.invoke(DelegatingMethodAccessorImpl.java:25)
	at java.lang.reflect.Method.invoke(Method.java:597)
	at org.codehaus.plexus.classworlds.launcher.Launcher.launchEnhanced(Launcher.java:290)
	at org.codehaus.plexus.classworlds.launcher.Launcher.launch(Launcher.java:230)
	at org.codehaus.plexus.classworlds.launcher.Launcher.mainWithExitCode(Launcher.java:409)
	at org.codehaus.plexus.classworlds.launcher.Launcher.main(Launcher.java:352)
Caused by: org.apache.maven.plugin.MojoFailureException: There are test failures.

Please refer to <https://builds.apache.org/job/cayenne-master/cayenneTestConnection=h2,jdk=JDK%201.6%20(latest),label=Ubuntu/ws/plugins/maven-cayenne-plugin/target/surefire-reports>
for the individual test results.
	at org.apache.maven.plugin.surefire.SurefirePlugin.execute(SurefirePlugin.java:629)
	at org.apache.maven.plugin.DefaultBuildPluginManager.executeMojo(DefaultBuildPluginManager.java:101)
	at org.apache.maven.lifecycle.internal.MojoExecutor.execute(MojoExecutor.java:209)
	... 19 more
[ERROR] 
[ERROR] Re-run Maven using the -X switch to enable full debug logging.
[ERROR] 
[ERROR] For more information about the errors and possible solutions, please read the following
articles:
[ERROR] [Help 1] http://cwiki.apache.org/confluence/display/MAVEN/MojoFailureException
[ERROR] 
[ERROR] After correcting the problems, you can resume the build with the command
[ERROR]   mvn <goals> -rf :maven-cayenne-plugin
Build step 'Invoke top-level Maven targets' marked build as failure

Mime
View raw message