cayenne-commits mailing list archives

Site index · List index
Message view « Date » · « Thread »
Top « Date » · « Thread »
From Apache Jenkins Server <jenk...@builds.apache.org>
Subject Build failed in Jenkins: Cayenne pull requests #1
Date Thu, 23 Oct 2014 10:57:55 GMT
See <https://builds.apache.org/job/Cayenne%20pull%20requests/1/changes>

Changes:

[s.kolbachev] CAY-1837 | Generate classes/generate DB schema should be enabled when higher
tree objects are selected

------------------------------------------
[...truncated 96049 lines...]
[INFO] 
[INFO] --- maven-compiler-plugin:2.3.2:compile (default-compile) @ tutorial ---
[WARNING] File encoding has not been set, using platform encoding ISO-8859-1, i.e. build is
platform dependent!
[INFO] Compiling 9 source files to <https://builds.apache.org/job/Cayenne%20pull%20requests/ws/tutorials/tutorial/target/classes>
[INFO] 
[INFO] --- maven-resources-plugin:2.5:testResources (default-testResources) @ tutorial ---
[debug] execute contextualize
[WARNING] Using platform encoding (ISO-8859-1 actually) to copy filtered resources, i.e. build
is platform dependent!
[INFO] Copying 1 resource
[INFO] 
[INFO] --- maven-compiler-plugin:2.3.2:testCompile (default-testCompile) @ tutorial ---
[INFO] Nothing to compile - all classes are up to date
[INFO] 
[INFO] --- maven-surefire-plugin:2.10:test (default-test) @ tutorial ---
[INFO] Surefire report directory: <https://builds.apache.org/job/Cayenne%20pull%20requests/ws/tutorials/tutorial/target/surefire-reports>

-------------------------------------------------------
 T E S T S
-------------------------------------------------------

Results :

Tests run: 0, Failures: 0, Errors: 0, Skipped: 0

[JENKINS] Recording test results
[INFO]                                                                         
[INFO] ------------------------------------------------------------------------
[INFO] Building Cayenne ROP Server Tutorial 3.2.M2-SNAPSHOT
[INFO] ------------------------------------------------------------------------
[INFO] 
[INFO] --- maven-resources-plugin:2.5:resources (default-resources) @ tutorial-rop-server
---
[debug] execute contextualize
[WARNING] Using platform encoding (ISO-8859-1 actually) to copy filtered resources, i.e. build
is platform dependent!
[INFO] Copying 2 resources
[INFO] 
[INFO] --- maven-compiler-plugin:2.3.2:compile (default-compile) @ tutorial-rop-server ---
[WARNING] File encoding has not been set, using platform encoding ISO-8859-1, i.e. build is
platform dependent!
[INFO] Compiling 16 source files to <https://builds.apache.org/job/Cayenne%20pull%20requests/ws/tutorials/tutorial-rop-server/target/classes>
[INFO] 
[INFO] --- maven-resources-plugin:2.5:testResources (default-testResources) @ tutorial-rop-server
---
[debug] execute contextualize
[WARNING] Using platform encoding (ISO-8859-1 actually) to copy filtered resources, i.e. build
is platform dependent!
[INFO] Copying 1 resource
[INFO] 
[INFO] --- maven-compiler-plugin:2.3.2:testCompile (default-testCompile) @ tutorial-rop-server
---
[INFO] Nothing to compile - all classes are up to date
[INFO] 
[INFO] --- maven-surefire-plugin:2.10:test (default-test) @ tutorial-rop-server ---
[INFO] Surefire report directory: <https://builds.apache.org/job/Cayenne%20pull%20requests/ws/tutorials/tutorial-rop-server/target/surefire-reports>

-------------------------------------------------------
 T E S T S
-------------------------------------------------------

Results :

Tests run: 0, Failures: 0, Errors: 0, Skipped: 0

[JENKINS] Recording test results
[INFO]                                                                         
[INFO] ------------------------------------------------------------------------
[INFO] Building Cayenne ROP Client Tutorial 3.2.M2-SNAPSHOT
[INFO] ------------------------------------------------------------------------
[INFO] 
[INFO] --- maven-resources-plugin:2.5:resources (default-resources) @ tutorial-rop-client
---
[debug] execute contextualize
[WARNING] Using platform encoding (ISO-8859-1 actually) to copy filtered resources, i.e. build
is platform dependent!
[INFO] Copying 1 resource
[INFO] 
[INFO] --- maven-compiler-plugin:2.3.2:compile (default-compile) @ tutorial-rop-client ---
[WARNING] File encoding has not been set, using platform encoding ISO-8859-1, i.e. build is
platform dependent!
[INFO] Compiling 9 source files to <https://builds.apache.org/job/Cayenne%20pull%20requests/ws/tutorials/tutorial-rop-client/target/classes>
[INFO] 
[INFO] --- maven-resources-plugin:2.5:testResources (default-testResources) @ tutorial-rop-client
---
[debug] execute contextualize
[WARNING] Using platform encoding (ISO-8859-1 actually) to copy filtered resources, i.e. build
is platform dependent!
[INFO] Copying 1 resource
[INFO] 
[INFO] --- maven-compiler-plugin:2.3.2:testCompile (default-testCompile) @ tutorial-rop-client
---
[INFO] Nothing to compile - all classes are up to date
[INFO] 
[INFO] --- maven-surefire-plugin:2.10:test (default-test) @ tutorial-rop-client ---
[INFO] Surefire report directory: <https://builds.apache.org/job/Cayenne%20pull%20requests/ws/tutorials/tutorial-rop-client/target/surefire-reports>

-------------------------------------------------------
 T E S T S
-------------------------------------------------------

Results :

Tests run: 0, Failures: 0, Errors: 0, Skipped: 0

[JENKINS] Recording test results
[INFO]                                                                         
[INFO] ------------------------------------------------------------------------
[INFO] Building Cayenne Tutorials 3.2.M2-SNAPSHOT
[INFO] ------------------------------------------------------------------------
[INFO]                                                                         
[INFO] ------------------------------------------------------------------------
[INFO] Building Cayenne Documenation Parent 3.2.M2-SNAPSHOT
[INFO] ------------------------------------------------------------------------
[INFO]                                                                         
[INFO] ------------------------------------------------------------------------
[INFO] Building Cayenne Documentation 3.2.M2-SNAPSHOT
[INFO] ------------------------------------------------------------------------
[INFO] 
[INFO] --- dependency-maven-plugin:1.0:unpack (unpack-sources) @ cayenne-doc ---
[INFO] Configured Artifact: org.apache.cayenne:cayenne-di:sources:3.2.M2-SNAPSHOT:jar
[INFO] Configured Artifact: org.apache.cayenne:cayenne-server:sources:3.2.M2-SNAPSHOT:jar
[INFO] Configured Artifact: org.apache.cayenne:cayenne-client:sources:3.2.M2-SNAPSHOT:jar
[INFO] ------------------------------------------------------------------------
[INFO] Reactor Summary:
[INFO] 
[INFO] Cayenne ........................................... SUCCESS [2.583s]
[INFO] Cayenne Build Tools Parent ........................ SUCCESS [0.108s]
[INFO] Cayenne License and Notice Bundle ................. SUCCESS [39.430s]
[INFO] Common Unit Test Utilities ........................ SUCCESS [2.293s]
[INFO] Cayenne Code Checkers ............................. SUCCESS [0.319s]
[INFO] Cayenne Dependency Injection Container ............ SUCCESS [30.765s]
[INFO] Cayenne Server .................................... SUCCESS [2:26.826s]
[INFO] Cayenne ROP Client ................................ SUCCESS [35.153s]
[INFO] Cayenne Project ................................... SUCCESS [14.528s]
[INFO] Cayenne Tools ..................................... SUCCESS [15.257s]
[INFO] Cayenne Lifecycle Utilities ....................... SUCCESS [15.507s]
[INFO] Cayenne Maven Plugins ............................. SUCCESS [0.152s]
[INFO] Cayenne Maven Plugin .............................. SUCCESS [14.633s]
[INFO] Cayenne Cryptography Extensions ................... SUCCESS [16.948s]
[INFO] Cayenne Integration Tests Parent .................. SUCCESS [0.084s]
[INFO] Integration Tests - Cayenne Tools ................. SUCCESS [6.119s]
[INFO] Cayenne Modeler Parent ............................ SUCCESS [0.238s]
[INFO] Cayenne WebObjects Compatibility Library .......... SUCCESS [12.415s]
[INFO] Cayenne Modeler ................................... SUCCESS [29.616s]
[INFO] Cayenne Modeler Generic and Windows Extensions .... SUCCESS [6.474s]
[INFO] Cayenne Modeler Generic ........................... SUCCESS [3.441s]
[INFO] Cayenne Modeler Mac OS X Extensions ............... SUCCESS [9.121s]
[INFO] Cayenne Modeler Mac OS X .......................... SUCCESS [3.274s]
[INFO] Cayenne Modeler Mac OS X - Old Apple Java ......... SUCCESS [5.038s]
[INFO] Cayenne Modeler Windows ........................... SUCCESS [2.385s]
[INFO] Cayenne Modeler Maven Plugin ...................... SUCCESS [5.623s]
[INFO] Cayenne Tutorial .................................. SUCCESS [5.258s]
[INFO] Cayenne ROP Server Tutorial ....................... SUCCESS [2.774s]
[INFO] Cayenne ROP Client Tutorial ....................... SUCCESS [5.583s]
[INFO] Cayenne Tutorials ................................. SUCCESS [0.140s]
[INFO] Cayenne Documenation Parent ....................... SUCCESS [1.955s]
[INFO] Cayenne Documentation ............................. FAILURE [0.263s]
[INFO] Cayenne Docbook Documentation ..................... SKIPPED
[INFO] Docbook: Cayenne Stylesheets ...................... SKIPPED
[INFO] Docbook: Cayenne Guide ............................ SKIPPED
[INFO] Docbook: Getting Started with Cayenne ............. SKIPPED
[INFO] Docbook: Getting Started with Cayenne ROP ......... SKIPPED
[INFO] Docbook: Cayenne New Features and Upgrade Guide ... SKIPPED
[INFO] Cayenne Release Assembly .......................... SKIPPED
[INFO] ------------------------------------------------------------------------
[INFO] BUILD FAILURE
[INFO] ------------------------------------------------------------------------
[INFO] Total time: 8:05.064s
[INFO] Finished at: Thu Oct 23 10:56:18 UTC 2014
[INFO] Final Memory: 287M/3183M
[INFO] ------------------------------------------------------------------------
Waiting for Jenkins to finish collecting data[ERROR] Failed to execute goal org.codehaus.mojo:dependency-maven-plugin:1.0:unpack
(unpack-sources) on project cayenne-doc: Unknown archiver type: No such archiver: ''. ->
[Help 1]
[ERROR] 
[ERROR] To see the full stack trace of the errors, re-run Maven with the -e switch.
[ERROR] Re-run Maven using the -X switch to enable full debug logging.
[ERROR] 
[ERROR] For more information about the errors and possible solutions, please read the following
articles:
[ERROR] [Help 1] http://cwiki.apache.org/confluence/display/MAVEN/MojoExecutionException
[ERROR] 
[ERROR] After correcting the problems, you can resume the build with the command
[ERROR]   mvn <goals> -rf :cayenne-doc

[JENKINS] Archiving <https://builds.apache.org/job/Cayenne%20pull%20requests/ws/docs/docbook/getting-started/pom.xml>
to org.apache.cayenne.docs/getting-started/3.2.M2-SNAPSHOT/getting-started-3.2.M2-SNAPSHOT.pom
No prior successful build to compare, so performing full copy of artifacts
[JENKINS] Archiving <https://builds.apache.org/job/Cayenne%20pull%20requests/ws/cayenne-crypto/pom.xml>
to org.apache.cayenne/cayenne-crypto/3.2.M2-SNAPSHOT/cayenne-crypto-3.2.M2-SNAPSHOT.pom
No prior successful build to compare, so performing full copy of artifacts
[JENKINS] Archiving <https://builds.apache.org/job/Cayenne%20pull%20requests/ws/tutorials/pom.xml>
to org.apache.cayenne.parents/cayenne-tutorials-parent/3.2.M2-SNAPSHOT/cayenne-tutorials-parent-3.2.M2-SNAPSHOT.pom
No prior successful build to compare, so performing full copy of artifacts
[JENKINS] Archiving <https://builds.apache.org/job/Cayenne%20pull%20requests/ws/build-tools/cayenne-checkers/pom.xml>
to org.apache.cayenne.build-tools/cayenne-checkers/3.2.M2-SNAPSHOT/cayenne-checkers-3.2.M2-SNAPSHOT.pom
No prior successful build to compare, so performing full copy of artifacts
[JENKINS] Archiving <https://builds.apache.org/job/Cayenne%20pull%20requests/ws/docs/docbook/cayenne-guide/pom.xml>
to org.apache.cayenne.docs/cayenne-guide/3.2.M2-SNAPSHOT/cayenne-guide-3.2.M2-SNAPSHOT.pom
No prior successful build to compare, so performing full copy of artifacts
[JENKINS] Archiving <https://builds.apache.org/job/Cayenne%20pull%20requests/ws/assembly/pom.xml>
to org.apache.cayenne.assembly/cayenne-assembly/3.2.M2-SNAPSHOT/cayenne-assembly-3.2.M2-SNAPSHOT.pom
No prior successful build to compare, so performing full copy of artifacts
[JENKINS] Archiving <https://builds.apache.org/job/Cayenne%20pull%20requests/ws/tutorials/tutorial-rop-server/pom.xml>
to org.apache.cayenne/tutorial-rop-server/3.2.M2-SNAPSHOT/tutorial-rop-server-3.2.M2-SNAPSHOT.pom
No prior successful build to compare, so performing full copy of artifacts
[JENKINS] Archiving <https://builds.apache.org/job/Cayenne%20pull%20requests/ws/tutorials/tutorial-rop-client/pom.xml>
to org.apache.cayenne/tutorial-rop-client/3.2.M2-SNAPSHOT/tutorial-rop-client-3.2.M2-SNAPSHOT.pom
No prior successful build to compare, so performing full copy of artifacts
[JENKINS] Archiving <https://builds.apache.org/job/Cayenne%20pull%20requests/ws/modeler/cayenne-modeler-mac-ext/pom.xml>
to org.apache.cayenne.modeler/cayenne-modeler-mac-ext/3.2.M2-SNAPSHOT/cayenne-modeler-mac-ext-3.2.M2-SNAPSHOT.pom
No prior successful build to compare, so performing full copy of artifacts
[JENKINS] Archiving <https://builds.apache.org/job/Cayenne%20pull%20requests/ws/docs/docbook/upgrade-guide/pom.xml>
to org.apache.cayenne.docs/upgrade-guide/3.2.M2-SNAPSHOT/upgrade-guide-3.2.M2-SNAPSHOT.pom
No prior successful build to compare, so performing full copy of artifacts
[JENKINS] Archiving <https://builds.apache.org/job/Cayenne%20pull%20requests/ws/build-tools/pom.xml>
to org.apache.cayenne.build-tools/build-tools-parent/3.2.M2-SNAPSHOT/build-tools-parent-3.2.M2-SNAPSHOT.pom
No prior successful build to compare, so performing full copy of artifacts
[JENKINS] Archiving <https://builds.apache.org/job/Cayenne%20pull%20requests/ws/modeler/cayenne-modeler-win/pom.xml>
to org.apache.cayenne.modeler/cayenne-modeler-win/3.2.M2-SNAPSHOT/cayenne-modeler-win-3.2.M2-SNAPSHOT.pom
No prior successful build to compare, so performing full copy of artifacts
[JENKINS] Archiving <https://builds.apache.org/job/Cayenne%20pull%20requests/ws/modeler/cayenne-modeler-mac/pom.xml>
to org.apache.cayenne.modeler/cayenne-modeler-mac/3.2.M2-SNAPSHOT/cayenne-modeler-mac-3.2.M2-SNAPSHOT.pom
No prior successful build to compare, so performing full copy of artifacts
[JENKINS] Archiving <https://builds.apache.org/job/Cayenne%20pull%20requests/ws/docs/docbook/pom.xml>
to org.apache.cayenne.docs/cayenne-docbook/3.2.M2-SNAPSHOT/cayenne-docbook-3.2.M2-SNAPSHOT.pom
No prior successful build to compare, so performing full copy of artifacts
[JENKINS] Archiving <https://builds.apache.org/job/Cayenne%20pull%20requests/ws/cayenne-tools/pom.xml>
to org.apache.cayenne/cayenne-tools/3.2.M2-SNAPSHOT/cayenne-tools-3.2.M2-SNAPSHOT.pom
No prior successful build to compare, so performing full copy of artifacts
[JENKINS] Archiving <https://builds.apache.org/job/Cayenne%20pull%20requests/ws/cayenne-client/pom.xml>
to org.apache.cayenne/cayenne-client/3.2.M2-SNAPSHOT/cayenne-client-3.2.M2-SNAPSHOT.pom
No prior successful build to compare, so performing full copy of artifacts
[JENKINS] Archiving <https://builds.apache.org/job/Cayenne%20pull%20requests/ws/docs/docbook/getting-started-rop/pom.xml>
to org.apache.cayenne.docs/getting-started-rop/3.2.M2-SNAPSHOT/getting-started-rop-3.2.M2-SNAPSHOT.pom
No prior successful build to compare, so performing full copy of artifacts
[JENKINS] Archiving <https://builds.apache.org/job/Cayenne%20pull%20requests/ws/cayenne-lifecycle/pom.xml>
to org.apache.cayenne/cayenne-lifecycle/3.2.M2-SNAPSHOT/cayenne-lifecycle-3.2.M2-SNAPSHOT.pom
No prior successful build to compare, so performing full copy of artifacts
[JENKINS] Archiving <https://builds.apache.org/job/Cayenne%20pull%20requests/ws/plugins/maven-cayenne-modeler-plugin/pom.xml>
to org.apache.cayenne.plugins/maven-cayenne-modeler-plugin/3.2.M2-SNAPSHOT/maven-cayenne-modeler-plugin-3.2.M2-SNAPSHOT.pom
No prior successful build to compare, so performing full copy of artifacts
[JENKINS] Archiving <https://builds.apache.org/job/Cayenne%20pull%20requests/ws/modeler/cayenne-modeler/pom.xml>
to org.apache.cayenne.modeler/cayenne-modeler/3.2.M2-SNAPSHOT/cayenne-modeler-3.2.M2-SNAPSHOT.pom
No prior successful build to compare, so performing full copy of artifacts
[JENKINS] Archiving <https://builds.apache.org/job/Cayenne%20pull%20requests/ws/cayenne-project/pom.xml>
to org.apache.cayenne/cayenne-project/3.2.M2-SNAPSHOT/cayenne-project-3.2.M2-SNAPSHOT.pom
No prior successful build to compare, so performing full copy of artifacts
[JENKINS] Archiving <https://builds.apache.org/job/Cayenne%20pull%20requests/ws/docs/doc/pom.xml>
to org.apache.cayenne.docs/cayenne-doc/3.2.M2-SNAPSHOT/cayenne-doc-3.2.M2-SNAPSHOT.pom
No prior successful build to compare, so performing full copy of artifacts
[JENKINS] Archiving <https://builds.apache.org/job/Cayenne%20pull%20requests/ws/modeler/cayenne-modeler-generic-ext/pom.xml>
to org.apache.cayenne.modeler/cayenne-modeler-generic-ext/3.2.M2-SNAPSHOT/cayenne-modeler-generic-ext-3.2.M2-SNAPSHOT.pom
No prior successful build to compare, so performing full copy of artifacts
[JENKINS] Archiving <https://builds.apache.org/job/Cayenne%20pull%20requests/ws/docs/pom.xml>
to org.apache.cayenne.docs/cayenne-docs-parent/3.2.M2-SNAPSHOT/cayenne-docs-parent-3.2.M2-SNAPSHOT.pom
No prior successful build to compare, so performing full copy of artifacts
[JENKINS] Archiving <https://builds.apache.org/job/Cayenne%20pull%20requests/ws/itests/cayenne-tools-itest/pom.xml>
to org.apache.cayenne.itests/cayenne-tools-itest/3.2.M2-SNAPSHOT/cayenne-tools-itest-3.2.M2-SNAPSHOT.pom
No prior successful build to compare, so performing full copy of artifacts
[JENKINS] Archiving <https://builds.apache.org/job/Cayenne%20pull%20requests/ws/modeler/cayenne-wocompat/pom.xml>
to org.apache.cayenne.modeler/cayenne-wocompat/3.2.M2-SNAPSHOT/cayenne-wocompat-3.2.M2-SNAPSHOT.pom
No prior successful build to compare, so performing full copy of artifacts
[JENKINS] Archiving <https://builds.apache.org/job/Cayenne%20pull%20requests/ws/build-tools/cayenne-legal/pom.xml>
to org.apache.cayenne.build-tools/cayenne-legal/3.2.M2-SNAPSHOT/cayenne-legal-3.2.M2-SNAPSHOT.pom
No prior successful build to compare, so performing full copy of artifacts
[JENKINS] Archiving <https://builds.apache.org/job/Cayenne%20pull%20requests/ws/itests/pom.xml>
to org.apache.cayenne.itests/cayenne-itests-parent/3.2.M2-SNAPSHOT/cayenne-itests-parent-3.2.M2-SNAPSHOT.pom
No prior successful build to compare, so performing full copy of artifacts
[JENKINS] Archiving <https://builds.apache.org/job/Cayenne%20pull%20requests/ws/modeler/cayenne-modeler-generic/pom.xml>
to org.apache.cayenne.modeler/cayenne-modeler-generic/3.2.M2-SNAPSHOT/cayenne-modeler-generic-3.2.M2-SNAPSHOT.pom
No prior successful build to compare, so performing full copy of artifacts
[JENKINS] Archiving <https://builds.apache.org/job/Cayenne%20pull%20requests/ws/plugins/maven-cayenne-plugin/pom.xml>
to org.apache.cayenne.plugins/maven-cayenne-plugin/3.2.M2-SNAPSHOT/maven-cayenne-plugin-3.2.M2-SNAPSHOT.pom
No prior successful build to compare, so performing full copy of artifacts
[JENKINS] Archiving <https://builds.apache.org/job/Cayenne%20pull%20requests/ws/cayenne-di/pom.xml>
to org.apache.cayenne/cayenne-di/3.2.M2-SNAPSHOT/cayenne-di-3.2.M2-SNAPSHOT.pom
No prior successful build to compare, so performing full copy of artifacts
[JENKINS] Archiving <https://builds.apache.org/job/Cayenne%20pull%20requests/ws/modeler/cayenne-modeler-mac-legacy/pom.xml>
to org.apache.cayenne.modeler/cayenne-modeler-mac-legacy/3.2.M2-SNAPSHOT/cayenne-modeler-mac-legacy-3.2.M2-SNAPSHOT.pom
No prior successful build to compare, so performing full copy of artifacts
[JENKINS] Archiving <https://builds.apache.org/job/Cayenne%20pull%20requests/ws/docs/docbook/docbook-stylesheets/pom.xml>
to org.apache.cayenne.docs/docbook-stylesheets/3.2.M2-SNAPSHOT/docbook-stylesheets-3.2.M2-SNAPSHOT.pom
No prior successful build to compare, so performing full copy of artifacts
[JENKINS] Archiving <https://builds.apache.org/job/Cayenne%20pull%20requests/ws/pom.xml>
to org.apache.cayenne/cayenne-parent/3.2.M2-SNAPSHOT/cayenne-parent-3.2.M2-SNAPSHOT.pom
No prior successful build to compare, so performing full copy of artifacts
[JENKINS] Archiving <https://builds.apache.org/job/Cayenne%20pull%20requests/ws/build-tools/cayenne-test-utilities/pom.xml>
to org.apache.cayenne.build-tools/cayenne-test-utilities/3.2.M2-SNAPSHOT/cayenne-test-utilities-3.2.M2-SNAPSHOT.pom
No prior successful build to compare, so performing full copy of artifacts
[JENKINS] Archiving <https://builds.apache.org/job/Cayenne%20pull%20requests/ws/modeler/pom.xml>
to org.apache.cayenne.modeler/cayenne-modeler-parent/3.2.M2-SNAPSHOT/cayenne-modeler-parent-3.2.M2-SNAPSHOT.pom
No prior successful build to compare, so performing full copy of artifacts
[JENKINS] Archiving <https://builds.apache.org/job/Cayenne%20pull%20requests/ws/plugins/pom.xml>
to org.apache.cayenne.plugins/cayenne-plugins-parent/3.2.M2-SNAPSHOT/cayenne-plugins-parent-3.2.M2-SNAPSHOT.pom
No prior successful build to compare, so performing full copy of artifacts
[JENKINS] Archiving <https://builds.apache.org/job/Cayenne%20pull%20requests/ws/tutorials/tutorial/pom.xml>
to org.apache.cayenne/tutorial/3.2.M2-SNAPSHOT/tutorial-3.2.M2-SNAPSHOT.pom
No prior successful build to compare, so performing full copy of artifacts
[JENKINS] Archiving <https://builds.apache.org/job/Cayenne%20pull%20requests/ws/cayenne-server/pom.xml>
to org.apache.cayenne/cayenne-server/3.2.M2-SNAPSHOT/cayenne-server-3.2.M2-SNAPSHOT.pom
No prior successful build to compare, so performing full copy of artifacts
channel stopped

Mime
View raw message