cayenne-commits mailing list archives

Site index · List index
Message view « Date » · « Thread »
Top « Date » · « Thread »
From Apache Jenkins Server <jenk...@builds.apache.org>
Subject Build failed in Jenkins: cayenne-master » derby,jdk-1.8.0,Ubuntu #69
Date Sun, 02 Nov 2014 18:41:34 GMT
See <https://builds.apache.org/job/cayenne-master/cayenneTestConnection=derby,jdk=jdk-1.8.0,label=Ubuntu/69/changes>

Changes:

[aadamchik] for cleaner output of unit tests bridging Cayenne with SLF4J

------------------------------------------
[...truncated 12987 lines...]
Please change your artifactId to the format ___-maven-plugin
In the future this error will break the build.


[WARNING] Using platform encoding (ISO-8859-1 actually) to read mojo metadata, i.e. build
is platform dependent!
[INFO] Applying mojo extractor for language: java
[INFO] Mojo extractor for language: java found 1 mojo descriptors.
[INFO] Applying mojo extractor for language: bsh
[INFO] Mojo extractor for language: bsh found 0 mojo descriptors.
[INFO] 
[INFO] --- maven-remote-resources-plugin:1.5:process (default) @ maven-cayenne-modeler-plugin
---
[INFO] 
[INFO] --- maven-resources-plugin:2.4.3:resources (default-resources) @ maven-cayenne-modeler-plugin
---
[INFO] Using 'UTF-8' encoding to copy filtered resources.
[INFO] skip non existing resourceDirectory <https://builds.apache.org/job/cayenne-master/cayenneTestConnection=derby,jdk=jdk-1.8.0,label=Ubuntu/ws/plugins/maven-cayenne-modeler-plugin/src/main/resources>
[INFO] Copying 3 resources
[INFO] 
[INFO] --- maven-compiler-plugin:2.3.2:compile (default-compile) @ maven-cayenne-modeler-plugin
---
[INFO] Compiling 1 source file to <https://builds.apache.org/job/cayenne-master/cayenneTestConnection=derby,jdk=jdk-1.8.0,label=Ubuntu/ws/plugins/maven-cayenne-modeler-plugin/target/classes>
[INFO] 
[INFO] --- maven-resources-plugin:2.4.3:testResources (default-testResources) @ maven-cayenne-modeler-plugin
---
[INFO] Using 'UTF-8' encoding to copy filtered resources.
[INFO] skip non existing resourceDirectory <https://builds.apache.org/job/cayenne-master/cayenneTestConnection=derby,jdk=jdk-1.8.0,label=Ubuntu/ws/plugins/maven-cayenne-modeler-plugin/src/test/resources>
[INFO] Copying 4 resources
[INFO] 
[INFO] --- maven-compiler-plugin:2.3.2:testCompile (default-testCompile) @ maven-cayenne-modeler-plugin
---
[INFO] No sources to compile
[INFO] 
[INFO] --- maven-surefire-plugin:2.5:test (default-test) @ maven-cayenne-modeler-plugin ---
[INFO] Surefire report directory: <https://builds.apache.org/job/cayenne-master/cayenneTestConnection=derby,jdk=jdk-1.8.0,label=Ubuntu/ws/plugins/maven-cayenne-modeler-plugin/target/surefire-reports>

-------------------------------------------------------
 T E S T S
-------------------------------------------------------
There are no tests to run.

Results :

Tests run: 0, Failures: 0, Errors: 0, Skipped: 0

[INFO]                                                                         
[INFO] ------------------------------------------------------------------------
[INFO] Building Cayenne Tutorial 4.0.M2-SNAPSHOT
[INFO] ------------------------------------------------------------------------
[INFO] 
[INFO] --- maven-resources-plugin:2.5:resources (default-resources) @ tutorial ---
[debug] execute contextualize
[WARNING] Using platform encoding (ISO-8859-1 actually) to copy filtered resources, i.e. build
is platform dependent!
[INFO] Copying 2 resources
[INFO] 
[INFO] --- maven-compiler-plugin:2.3.2:compile (default-compile) @ tutorial ---
[WARNING] File encoding has not been set, using platform encoding ISO-8859-1, i.e. build is
platform dependent!
[INFO] Compiling 9 source files to <https://builds.apache.org/job/cayenne-master/cayenneTestConnection=derby,jdk=jdk-1.8.0,label=Ubuntu/ws/tutorials/tutorial/target/classes>
[INFO] 
[INFO] --- maven-resources-plugin:2.5:testResources (default-testResources) @ tutorial ---
[debug] execute contextualize
[WARNING] Using platform encoding (ISO-8859-1 actually) to copy filtered resources, i.e. build
is platform dependent!
[INFO] Copying 1 resource
[INFO] 
[INFO] --- maven-compiler-plugin:2.3.2:testCompile (default-testCompile) @ tutorial ---
[INFO] Nothing to compile - all classes are up to date
[INFO] 
[INFO] --- maven-surefire-plugin:2.10:test (default-test) @ tutorial ---
[INFO] Surefire report directory: <https://builds.apache.org/job/cayenne-master/cayenneTestConnection=derby,jdk=jdk-1.8.0,label=Ubuntu/ws/tutorials/tutorial/target/surefire-reports>

-------------------------------------------------------
 T E S T S
-------------------------------------------------------

Results :

Tests run: 0, Failures: 0, Errors: 0, Skipped: 0

[INFO]                                                                         
[INFO] ------------------------------------------------------------------------
[INFO] Building Cayenne ROP Server Tutorial 4.0.M2-SNAPSHOT
[INFO] ------------------------------------------------------------------------
[INFO] 
[INFO] --- maven-resources-plugin:2.5:resources (default-resources) @ tutorial-rop-server
---
[debug] execute contextualize
[WARNING] Using platform encoding (ISO-8859-1 actually) to copy filtered resources, i.e. build
is platform dependent!
[INFO] Copying 2 resources
[INFO] 
[INFO] --- maven-compiler-plugin:2.3.2:compile (default-compile) @ tutorial-rop-server ---
[WARNING] File encoding has not been set, using platform encoding ISO-8859-1, i.e. build is
platform dependent!
[INFO] Compiling 16 source files to <https://builds.apache.org/job/cayenne-master/cayenneTestConnection=derby,jdk=jdk-1.8.0,label=Ubuntu/ws/tutorials/tutorial-rop-server/target/classes>
[INFO] 
[INFO] --- maven-resources-plugin:2.5:testResources (default-testResources) @ tutorial-rop-server
---
[debug] execute contextualize
[WARNING] Using platform encoding (ISO-8859-1 actually) to copy filtered resources, i.e. build
is platform dependent!
[INFO] Copying 1 resource
[INFO] 
[INFO] --- maven-compiler-plugin:2.3.2:testCompile (default-testCompile) @ tutorial-rop-server
---
[INFO] Nothing to compile - all classes are up to date
[INFO] 
[INFO] --- maven-surefire-plugin:2.10:test (default-test) @ tutorial-rop-server ---
[INFO] Surefire report directory: <https://builds.apache.org/job/cayenne-master/cayenneTestConnection=derby,jdk=jdk-1.8.0,label=Ubuntu/ws/tutorials/tutorial-rop-server/target/surefire-reports>

-------------------------------------------------------
 T E S T S
-------------------------------------------------------

Results :

Tests run: 0, Failures: 0, Errors: 0, Skipped: 0

[INFO]                                                                         
[INFO] ------------------------------------------------------------------------
[INFO] Building Cayenne ROP Client Tutorial 4.0.M2-SNAPSHOT
[INFO] ------------------------------------------------------------------------
[INFO] 
[INFO] --- maven-resources-plugin:2.5:resources (default-resources) @ tutorial-rop-client
---
[debug] execute contextualize
[WARNING] Using platform encoding (ISO-8859-1 actually) to copy filtered resources, i.e. build
is platform dependent!
[INFO] Copying 1 resource
[INFO] 
[INFO] --- maven-compiler-plugin:2.3.2:compile (default-compile) @ tutorial-rop-client ---
[WARNING] File encoding has not been set, using platform encoding ISO-8859-1, i.e. build is
platform dependent!
[INFO] Compiling 9 source files to <https://builds.apache.org/job/cayenne-master/cayenneTestConnection=derby,jdk=jdk-1.8.0,label=Ubuntu/ws/tutorials/tutorial-rop-client/target/classes>
[INFO] 
[INFO] --- maven-resources-plugin:2.5:testResources (default-testResources) @ tutorial-rop-client
---
[debug] execute contextualize
[WARNING] Using platform encoding (ISO-8859-1 actually) to copy filtered resources, i.e. build
is platform dependent!
[INFO] Copying 1 resource
[INFO] 
[INFO] --- maven-compiler-plugin:2.3.2:testCompile (default-testCompile) @ tutorial-rop-client
---
[INFO] Nothing to compile - all classes are up to date
[INFO] 
[INFO] --- maven-surefire-plugin:2.10:test (default-test) @ tutorial-rop-client ---
[INFO] Surefire report directory: <https://builds.apache.org/job/cayenne-master/cayenneTestConnection=derby,jdk=jdk-1.8.0,label=Ubuntu/ws/tutorials/tutorial-rop-client/target/surefire-reports>

-------------------------------------------------------
 T E S T S
-------------------------------------------------------

Results :

Tests run: 0, Failures: 0, Errors: 0, Skipped: 0

[INFO]                                                                         
[INFO] ------------------------------------------------------------------------
[INFO] Building Cayenne Tutorials 4.0.M2-SNAPSHOT
[INFO] ------------------------------------------------------------------------
[INFO]                                                                         
[INFO] ------------------------------------------------------------------------
[INFO] Building Cayenne Documenation Parent 4.0.M2-SNAPSHOT
[INFO] ------------------------------------------------------------------------
[INFO]                                                                         
[INFO] ------------------------------------------------------------------------
[INFO] Building Cayenne Documentation 4.0.M2-SNAPSHOT
[INFO] ------------------------------------------------------------------------
[INFO] 
[INFO] --- dependency-maven-plugin:1.0:unpack (unpack-sources) @ cayenne-doc ---
[INFO] Configured Artifact: org.apache.cayenne:cayenne-di:sources:4.0.M2-SNAPSHOT:jar
[INFO] Configured Artifact: org.apache.cayenne:cayenne-server:sources:4.0.M2-SNAPSHOT:jar
[INFO] Configured Artifact: org.apache.cayenne:cayenne-client:sources:4.0.M2-SNAPSHOT:jar
[INFO] ------------------------------------------------------------------------
[INFO] Reactor Summary:
[INFO] 
[INFO] Cayenne ........................................... SUCCESS [0.002s]
[INFO] Cayenne Build Tools Parent ........................ SUCCESS [0.000s]
[INFO] Cayenne License and Notice Bundle ................. SUCCESS [0.925s]
[INFO] Common Unit Test Utilities ........................ SUCCESS [0.850s]
[INFO] Cayenne Code Checkers ............................. SUCCESS [0.016s]
[INFO] Cayenne Dependency Injection Container ............ SUCCESS [11.178s]
[INFO] Cayenne Server .................................... SUCCESS [43.272s]
[INFO] Cayenne ROP Client ................................ SUCCESS [7.640s]
[INFO] Cayenne Project ................................... SUCCESS [6.861s]
[INFO] Cayenne Tools ..................................... SUCCESS [8.366s]
[INFO] Cayenne Lifecycle Utilities ....................... SUCCESS [7.106s]
[INFO] Cayenne Maven Plugins ............................. SUCCESS [0.008s]
[INFO] Cayenne Maven Plugin .............................. SUCCESS [18.473s]
[INFO] Cayenne Cryptography Extensions ................... SUCCESS [7.499s]
[INFO] Cayenne Integration Tests Parent .................. SUCCESS [0.001s]
[INFO] Integration Tests - Cayenne Tools ................. SUCCESS [1.733s]
[INFO] Cayenne Modeler Parent ............................ SUCCESS [0.009s]
[INFO] Cayenne WebObjects Compatibility Library .......... SUCCESS [6.399s]
[INFO] Cayenne Modeler ................................... SUCCESS [14.830s]
[INFO] Cayenne Modeler Generic and Windows Extensions .... SUCCESS [2.881s]
[INFO] Cayenne Modeler Generic ........................... SUCCESS [0.707s]
[INFO] Cayenne Modeler Mac OS X Extensions ............... SUCCESS [3.111s]
[INFO] Cayenne Modeler Mac OS X .......................... SUCCESS [1.029s]
[INFO] Cayenne Modeler Mac OS X - Old Apple Java ......... SUCCESS [0.688s]
[INFO] Cayenne Modeler Windows ........................... SUCCESS [0.290s]
[INFO] Cayenne Modeler Maven Plugin ...................... SUCCESS [1.789s]
[INFO] Cayenne Tutorial .................................. SUCCESS [1.205s]
[INFO] Cayenne ROP Server Tutorial ....................... SUCCESS [0.879s]
[INFO] Cayenne ROP Client Tutorial ....................... SUCCESS [0.798s]
[INFO] Cayenne Tutorials ................................. SUCCESS [0.000s]
[INFO] Cayenne Documenation Parent ....................... SUCCESS [0.000s]
[INFO] Cayenne Documentation ............................. FAILURE [0.106s]
[INFO] Cayenne Docbook Documentation ..................... SKIPPED
[INFO] Docbook: Cayenne Stylesheets ...................... SKIPPED
[INFO] Docbook: Cayenne Guide ............................ SKIPPED
[INFO] Docbook: Getting Started with Cayenne ............. SKIPPED
[INFO] Docbook: Getting Started with Cayenne ROP ......... SKIPPED
[INFO] Docbook: Cayenne New Features and Upgrade Guide ... SKIPPED
[INFO] Cayenne Release Assembly .......................... SKIPPED
[INFO] ------------------------------------------------------------------------
[INFO] BUILD FAILURE
[INFO] ------------------------------------------------------------------------
[INFO] Total time: 2:29.518s
[INFO] Finished at: Sun Nov 02 18:41:16 UTC 2014
[INFO] Final Memory: 269M/3653M
[INFO] ------------------------------------------------------------------------
[ERROR] Failed to execute goal org.codehaus.mojo:dependency-maven-plugin:1.0:unpack (unpack-sources)
on project cayenne-doc: Unknown archiver type: No such archiver: '0/label/ubuntu/cayenne-di/target/classes'.
-> [Help 1]
org.apache.maven.lifecycle.LifecycleExecutionException: Failed to execute goal org.codehaus.mojo:dependency-maven-plugin:1.0:unpack
(unpack-sources) on project cayenne-doc: Unknown archiver type
	at org.apache.maven.lifecycle.internal.MojoExecutor.execute(MojoExecutor.java:217)
	at org.apache.maven.lifecycle.internal.MojoExecutor.execute(MojoExecutor.java:153)
	at org.apache.maven.lifecycle.internal.MojoExecutor.execute(MojoExecutor.java:145)
	at org.apache.maven.lifecycle.internal.LifecycleModuleBuilder.buildProject(LifecycleModuleBuilder.java:84)
	at org.apache.maven.lifecycle.internal.LifecycleModuleBuilder.buildProject(LifecycleModuleBuilder.java:59)
	at org.apache.maven.lifecycle.internal.LifecycleStarter.singleThreadedBuild(LifecycleStarter.java:183)
	at org.apache.maven.lifecycle.internal.LifecycleStarter.execute(LifecycleStarter.java:161)
	at org.apache.maven.DefaultMaven.doExecute(DefaultMaven.java:320)
	at org.apache.maven.DefaultMaven.execute(DefaultMaven.java:156)
	at org.apache.maven.cli.MavenCli.execute(MavenCli.java:537)
	at org.apache.maven.cli.MavenCli.doMain(MavenCli.java:196)
	at org.apache.maven.cli.MavenCli.main(MavenCli.java:141)
	at sun.reflect.NativeMethodAccessorImpl.invoke0(Native Method)
	at sun.reflect.NativeMethodAccessorImpl.invoke(NativeMethodAccessorImpl.java:62)
	at sun.reflect.DelegatingMethodAccessorImpl.invoke(DelegatingMethodAccessorImpl.java:43)
	at java.lang.reflect.Method.invoke(Method.java:483)
	at org.codehaus.plexus.classworlds.launcher.Launcher.launchEnhanced(Launcher.java:290)
	at org.codehaus.plexus.classworlds.launcher.Launcher.launch(Launcher.java:230)
	at org.codehaus.plexus.classworlds.launcher.Launcher.mainWithExitCode(Launcher.java:409)
	at org.codehaus.plexus.classworlds.launcher.Launcher.main(Launcher.java:352)
Caused by: org.apache.maven.plugin.MojoExecutionException: Unknown archiver type
	at org.codehaus.mojo.dependency.DependencyUtil.unpack(DependencyUtil.java:124)
	at org.codehaus.mojo.dependency.DependencyUtil.unpackFile(DependencyUtil.java:79)
	at org.codehaus.mojo.dependency.UnpackMojo.unpackArtifact(UnpackMojo.java:85)
	at org.codehaus.mojo.dependency.UnpackMojo.execute(UnpackMojo.java:63)
	at org.apache.maven.plugin.DefaultBuildPluginManager.executeMojo(DefaultBuildPluginManager.java:101)
	at org.apache.maven.lifecycle.internal.MojoExecutor.execute(MojoExecutor.java:209)
	... 19 more
Caused by: org.codehaus.plexus.archiver.manager.NoSuchArchiverException: No such archiver:
'0/label/ubuntu/cayenne-di/target/classes'.
	at org.codehaus.plexus.archiver.manager.DefaultArchiverManager.getUnArchiver(DefaultArchiverManager.java:77)
	at org.codehaus.mojo.dependency.DependencyUtil.unpack(DependencyUtil.java:114)
	... 24 more
[ERROR] 
[ERROR] Re-run Maven using the -X switch to enable full debug logging.
[ERROR] 
[ERROR] For more information about the errors and possible solutions, please read the following
articles:
[ERROR] [Help 1] http://cwiki.apache.org/confluence/display/MAVEN/MojoExecutionException
[ERROR] 
[ERROR] After correcting the problems, you can resume the build with the command
[ERROR]   mvn <goals> -rf :cayenne-doc
Build step 'Invoke top-level Maven targets' marked build as failure
Recording test results

Mime
View raw message