cayenne-commits mailing list archives

Site index · List index
Message view « Date » · « Thread »
Top « Date » · « Thread »
From Apache Jenkins Server <jenk...@builds.apache.org>
Subject Build failed in Jenkins: cayenne-master » hsql,jdk1.8.0_11,Ubuntu #119
Date Wed, 03 Dec 2014 17:51:53 GMT
See <https://builds.apache.org/job/cayenne-master/cayenneTestConnection=hsql,jdk=jdk1.8.0_11,label=Ubuntu/119/changes>

Changes:

[s.kolbachev] fix DataContextDisjointByIdPrefetch_ExtrasIT

------------------------------------------
[...truncated 81460 lines...]
[main] INFO org.apache.cayenne.access.DbLoader - skipping Cayenne PK procedure: org.hsqldb.Library.isReadOnlyDatabase
[main] INFO org.apache.cayenne.access.DbLoader - skipping Cayenne PK procedure: org.hsqldb.Library.isReadOnlyDatabaseFiles
[main] INFO org.apache.cayenne.access.DbLoader - skipping Cayenne PK procedure: org.hsqldb.Library.lcase
[main] INFO org.apache.cayenne.access.DbLoader - skipping Cayenne PK procedure: org.hsqldb.Library.left
[main] INFO org.apache.cayenne.access.DbLoader - skipping Cayenne PK procedure: org.hsqldb.Library.length
[main] INFO org.apache.cayenne.access.DbLoader - skipping Cayenne PK procedure: org.hsqldb.Library.locate
[main] INFO org.apache.cayenne.access.DbLoader - skipping Cayenne PK procedure: org.hsqldb.Library.log10
[main] INFO org.apache.cayenne.access.DbLoader - skipping Cayenne PK procedure: org.hsqldb.Library.ltrim
[main] INFO org.apache.cayenne.access.DbLoader - skipping Cayenne PK procedure: org.hsqldb.Library.minute
[main] INFO org.apache.cayenne.access.DbLoader - skipping Cayenne PK procedure: org.hsqldb.Library.mod
[main] INFO org.apache.cayenne.access.DbLoader - skipping Cayenne PK procedure: org.hsqldb.Library.month
[main] INFO org.apache.cayenne.access.DbLoader - skipping Cayenne PK procedure: org.hsqldb.Library.monthname
[main] INFO org.apache.cayenne.access.DbLoader - skipping Cayenne PK procedure: org.hsqldb.Library.now
[main] INFO org.apache.cayenne.access.DbLoader - skipping Cayenne PK procedure: org.hsqldb.Library.octetLength
[main] INFO org.apache.cayenne.access.DbLoader - skipping Cayenne PK procedure: org.hsqldb.Library.pi
[main] INFO org.apache.cayenne.access.DbLoader - skipping Cayenne PK procedure: org.hsqldb.Library.position
[main] INFO org.apache.cayenne.access.DbLoader - skipping Cayenne PK procedure: org.hsqldb.Library.quarter
[main] INFO org.apache.cayenne.access.DbLoader - skipping Cayenne PK procedure: org.hsqldb.Library.rand
[main] INFO org.apache.cayenne.access.DbLoader - skipping Cayenne PK procedure: org.hsqldb.Library.rawToHex
[main] INFO org.apache.cayenne.access.DbLoader - skipping Cayenne PK procedure: org.hsqldb.Library.repeat
[main] INFO org.apache.cayenne.access.DbLoader - skipping Cayenne PK procedure: org.hsqldb.Library.replace
[main] INFO org.apache.cayenne.access.DbLoader - skipping Cayenne PK procedure: org.hsqldb.Library.right
[main] INFO org.apache.cayenne.access.DbLoader - skipping Cayenne PK procedure: org.hsqldb.Library.round
[main] INFO org.apache.cayenne.access.DbLoader - skipping Cayenne PK procedure: org.hsqldb.Library.roundMagic
[main] INFO org.apache.cayenne.access.DbLoader - skipping Cayenne PK procedure: org.hsqldb.Library.rtrim
[main] INFO org.apache.cayenne.access.DbLoader - skipping Cayenne PK procedure: org.hsqldb.Library.second
[main] INFO org.apache.cayenne.access.DbLoader - skipping Cayenne PK procedure: org.hsqldb.Library.sign
[main] INFO org.apache.cayenne.access.DbLoader - skipping Cayenne PK procedure: org.hsqldb.Library.soundex
[main] INFO org.apache.cayenne.access.DbLoader - skipping Cayenne PK procedure: org.hsqldb.Library.space
[main] INFO org.apache.cayenne.access.DbLoader - skipping Cayenne PK procedure: org.hsqldb.Library.substring
[main] INFO org.apache.cayenne.access.DbLoader - skipping Cayenne PK procedure: org.hsqldb.Library.to_char
[main] INFO org.apache.cayenne.access.DbLoader - skipping Cayenne PK procedure: org.hsqldb.Library.trim
[main] INFO org.apache.cayenne.access.DbLoader - skipping Cayenne PK procedure: org.hsqldb.Library.truncate
[main] INFO org.apache.cayenne.access.DbLoader - skipping Cayenne PK procedure: org.hsqldb.Library.ucase
[main] INFO org.apache.cayenne.access.DbLoader - skipping Cayenne PK procedure: org.hsqldb.Library.user
[main] INFO org.apache.cayenne.access.DbLoader - skipping Cayenne PK procedure: org.hsqldb.Library.week
[main] INFO org.apache.cayenne.access.DbLoader - skipping Cayenne PK procedure: org.hsqldb.Library.year
Tests run: 1, Failures: 0, Errors: 0, Skipped: 0, Time elapsed: 3.261 sec - in org.apache.cayenne.util.EntityMergeSupportIT
Running org.apache.cayenne.util.DeepMergeOperationIT
[main] INFO org.apache.cayenne.configuration.XMLDataChannelDescriptorLoader - Loading XML
configuration resource from <https://builds.apache.org/job/cayenne-master/cayenneTestConnection=hsql,jdk=jdk1.8.0_11,label=Ubuntu/ws/cayenne-server/target/test-classes/cayenne-testmap.xml>
[main] INFO org.apache.cayenne.configuration.XMLDataChannelDescriptorLoader - Loading XML
DataMap resource from <https://builds.apache.org/job/cayenne-master/cayenneTestConnection=hsql,jdk=jdk1.8.0_11,label=Ubuntu/ws/cayenne-server/target/test-classes/testmap.map.xml>
[main] INFO org.apache.cayenne.map.EntityResolver - added runtime complimentary DbRelationship
from ARTIST to PAINTING1
[main] INFO org.apache.cayenne.configuration.XMLDataChannelDescriptorLoader - Loading XML
configuration resource from <https://builds.apache.org/job/cayenne-master/cayenneTestConnection=hsql,jdk=jdk1.8.0_11,label=Ubuntu/ws/cayenne-server/target/test-classes/cayenne-testmap.xml>
[main] INFO org.apache.cayenne.configuration.XMLDataChannelDescriptorLoader - Loading XML
DataMap resource from <https://builds.apache.org/job/cayenne-master/cayenneTestConnection=hsql,jdk=jdk1.8.0_11,label=Ubuntu/ws/cayenne-server/target/test-classes/testmap.map.xml>
[main] INFO org.apache.cayenne.test.jdbc.UtilityLogger - delete from PAINTING_INFO
[main] INFO org.apache.cayenne.test.jdbc.UtilityLogger - delete from PAINTING
[main] INFO org.apache.cayenne.test.jdbc.UtilityLogger - delete from PAINTING1
[main] INFO org.apache.cayenne.test.jdbc.UtilityLogger - delete from ARTIST_CT
[main] INFO org.apache.cayenne.test.jdbc.UtilityLogger - delete from ARTIST_GROUP
[main] INFO org.apache.cayenne.test.jdbc.UtilityLogger - delete from ARTIST_EXHIBIT
[main] INFO org.apache.cayenne.test.jdbc.UtilityLogger - delete from EXHIBIT
[main] INFO org.apache.cayenne.test.jdbc.UtilityLogger - delete from NULL_TEST
[main] INFO org.apache.cayenne.test.jdbc.UtilityLogger - delete from ARTGROUP
[main] INFO org.apache.cayenne.test.jdbc.UtilityLogger - delete from GALLERY
[main] INFO org.apache.cayenne.test.jdbc.UtilityLogger - delete from ARTIST
[main] INFO org.apache.cayenne.test.jdbc.UtilityLogger - delete from GENERATED_COLUMN
[main] INFO org.apache.cayenne.log.CommonsJdbcEventLogger - --- transaction started.
[main] INFO org.apache.cayenne.log.CommonsJdbcEventLogger - INSERT INTO ARTIST (ARTIST_ID,
ARTIST_NAME, DATE_OF_BIRTH) VALUES (?, ?, ?)
[main] INFO org.apache.cayenne.log.CommonsJdbcEventLogger - [bind: 1->ARTIST_ID:201, 2->ARTIST_NAME:'AAA',
3->DATE_OF_BIRTH:NULL]
[main] INFO org.apache.cayenne.log.CommonsJdbcEventLogger - === updated 1 row.
[main] INFO org.apache.cayenne.log.CommonsJdbcEventLogger - +++ transaction committed.
[main] INFO org.apache.cayenne.configuration.XMLDataChannelDescriptorLoader - Loading XML
configuration resource from <https://builds.apache.org/job/cayenne-master/cayenneTestConnection=hsql,jdk=jdk1.8.0_11,label=Ubuntu/ws/cayenne-server/target/test-classes/cayenne-testmap.xml>
[main] INFO org.apache.cayenne.configuration.XMLDataChannelDescriptorLoader - Loading XML
DataMap resource from <https://builds.apache.org/job/cayenne-master/cayenneTestConnection=hsql,jdk=jdk1.8.0_11,label=Ubuntu/ws/cayenne-server/target/test-classes/testmap.map.xml>
[main] INFO org.apache.cayenne.map.EntityResolver - added runtime complimentary DbRelationship
from ARTIST to PAINTING1
[main] INFO org.apache.cayenne.configuration.XMLDataChannelDescriptorLoader - Loading XML
configuration resource from <https://builds.apache.org/job/cayenne-master/cayenneTestConnection=hsql,jdk=jdk1.8.0_11,label=Ubuntu/ws/cayenne-server/target/test-classes/cayenne-testmap.xml>
[main] INFO org.apache.cayenne.configuration.XMLDataChannelDescriptorLoader - Loading XML
DataMap resource from <https://builds.apache.org/job/cayenne-master/cayenneTestConnection=hsql,jdk=jdk1.8.0_11,label=Ubuntu/ws/cayenne-server/target/test-classes/testmap.map.xml>
[main] INFO org.apache.cayenne.test.jdbc.UtilityLogger - delete from PAINTING_INFO
[main] INFO org.apache.cayenne.test.jdbc.UtilityLogger - delete from PAINTING
[main] INFO org.apache.cayenne.test.jdbc.UtilityLogger - delete from PAINTING1
[main] INFO org.apache.cayenne.test.jdbc.UtilityLogger - delete from ARTIST_CT
[main] INFO org.apache.cayenne.test.jdbc.UtilityLogger - delete from ARTIST_GROUP
[main] INFO org.apache.cayenne.test.jdbc.UtilityLogger - delete from ARTIST_EXHIBIT
[main] INFO org.apache.cayenne.test.jdbc.UtilityLogger - delete from EXHIBIT
[main] INFO org.apache.cayenne.test.jdbc.UtilityLogger - delete from NULL_TEST
[main] INFO org.apache.cayenne.test.jdbc.UtilityLogger - delete from ARTGROUP
[main] INFO org.apache.cayenne.test.jdbc.UtilityLogger - delete from GALLERY
[main] INFO org.apache.cayenne.test.jdbc.UtilityLogger - delete from ARTIST
[main] INFO org.apache.cayenne.test.jdbc.UtilityLogger - delete from GENERATED_COLUMN
[main] INFO org.apache.cayenne.log.CommonsJdbcEventLogger - --- transaction started.
[main] INFO org.apache.cayenne.log.CommonsJdbcEventLogger - INSERT INTO ARTIST (ARTIST_ID,
ARTIST_NAME, DATE_OF_BIRTH) VALUES (?, ?, ?)
[main] INFO org.apache.cayenne.log.CommonsJdbcEventLogger - [bind: 1->ARTIST_ID:202, 2->ARTIST_NAME:'AAA',
3->DATE_OF_BIRTH:NULL]
[main] INFO org.apache.cayenne.log.CommonsJdbcEventLogger - === updated 1 row.
[main] INFO org.apache.cayenne.log.CommonsJdbcEventLogger - +++ transaction committed.
Tests run: 2, Failures: 0, Errors: 0, Skipped: 0, Time elapsed: 1.996 sec - in org.apache.cayenne.util.DeepMergeOperationIT
Running org.apache.cayenne.util.DeepMergeOperationInheritanceIT
[main] INFO org.apache.cayenne.configuration.XMLDataChannelDescriptorLoader - Loading XML
configuration resource from <https://builds.apache.org/job/cayenne-master/cayenneTestConnection=hsql,jdk=jdk1.8.0_11,label=Ubuntu/ws/cayenne-server/target/test-classes/cayenne-people.xml>
[main] INFO org.apache.cayenne.configuration.XMLDataChannelDescriptorLoader - Loading XML
DataMap resource from <https://builds.apache.org/job/cayenne-master/cayenneTestConnection=hsql,jdk=jdk1.8.0_11,label=Ubuntu/ws/cayenne-server/target/test-classes/people.map.xml>
[main] INFO org.apache.cayenne.test.jdbc.UtilityLogger - update PERSON set DEPARTMENT_ID =
?
[main] INFO org.apache.cayenne.configuration.XMLDataChannelDescriptorLoader - Loading XML
configuration resource from <https://builds.apache.org/job/cayenne-master/cayenneTestConnection=hsql,jdk=jdk1.8.0_11,label=Ubuntu/ws/cayenne-server/target/test-classes/cayenne-people.xml>
[main] INFO org.apache.cayenne.configuration.XMLDataChannelDescriptorLoader - Loading XML
DataMap resource from <https://builds.apache.org/job/cayenne-master/cayenneTestConnection=hsql,jdk=jdk1.8.0_11,label=Ubuntu/ws/cayenne-server/target/test-classes/people.map.xml>
[main] INFO org.apache.cayenne.test.jdbc.UtilityLogger - delete from ADDRESS
[main] INFO org.apache.cayenne.test.jdbc.UtilityLogger - delete from PERSON_NOTES
[main] INFO org.apache.cayenne.test.jdbc.UtilityLogger - delete from DEPARTMENT
[main] INFO org.apache.cayenne.test.jdbc.UtilityLogger - delete from PERSON
[main] INFO org.apache.cayenne.test.jdbc.UtilityLogger - delete from CLIENT_COMPANY
[main] INFO org.apache.cayenne.log.CommonsJdbcEventLogger - --- transaction started.
[main] INFO org.apache.cayenne.log.CommonsJdbcEventLogger - SELECT NEXT_ID FROM AUTO_PK_SUPPORT
WHERE TABLE_NAME = 'DEPARTMENT'
[main] INFO org.apache.cayenne.log.CommonsJdbcEventLogger - === returned 1 row. - took 0 ms.
[main] INFO org.apache.cayenne.log.CommonsJdbcEventLogger - UPDATE AUTO_PK_SUPPORT SET NEXT_ID
= NEXT_ID + 20 WHERE TABLE_NAME = 'DEPARTMENT'
[main] INFO org.apache.cayenne.log.CommonsJdbcEventLogger - === updated 1 row.
[main] INFO org.apache.cayenne.log.CommonsJdbcEventLogger - INSERT INTO DEPARTMENT (DEPARTMENT_ID,
MANAGER_ID, NAME) VALUES (?, ?, ?)
[main] INFO org.apache.cayenne.log.CommonsJdbcEventLogger - [bind: 1->DEPARTMENT_ID:200,
2->MANAGER_ID:NULL, 3->NAME:'D1']
[main] INFO org.apache.cayenne.log.CommonsJdbcEventLogger - === updated 1 row.
[main] INFO org.apache.cayenne.log.CommonsJdbcEventLogger - +++ transaction committed.
[main] INFO org.apache.cayenne.log.CommonsJdbcEventLogger - --- transaction started.
[main] INFO org.apache.cayenne.log.CommonsJdbcEventLogger - SELECT NEXT_ID FROM AUTO_PK_SUPPORT
WHERE TABLE_NAME = 'PERSON'
[main] INFO org.apache.cayenne.log.CommonsJdbcEventLogger - === returned 1 row. - took 0 ms.
[main] INFO org.apache.cayenne.log.CommonsJdbcEventLogger - UPDATE AUTO_PK_SUPPORT SET NEXT_ID
= NEXT_ID + 20 WHERE TABLE_NAME = 'PERSON'
[main] INFO org.apache.cayenne.log.CommonsJdbcEventLogger - === updated 1 row.
[main] INFO org.apache.cayenne.log.CommonsJdbcEventLogger - INSERT INTO PERSON (CLIENT_COMPANY_ID,
CLIENT_CONTACT_TYPE, DEPARTMENT_ID, NAME, PERSON_ID, PERSON_TYPE, SALARY) VALUES (?, ?, ?,
?, ?, ?, ?)
[main] INFO org.apache.cayenne.log.CommonsJdbcEventLogger - [bind: 1->CLIENT_COMPANY_ID:NULL,
2->CLIENT_CONTACT_TYPE:NULL, 3->DEPARTMENT_ID:200, 4->NAME:'E1', 5->PERSON_ID:200,
6->PERSON_TYPE:'EE', 7->SALARY:NULL]
[main] INFO org.apache.cayenne.log.CommonsJdbcEventLogger - === updated 1 row.
[main] INFO org.apache.cayenne.log.CommonsJdbcEventLogger - [bind: 1->CLIENT_COMPANY_ID:NULL,
2->CLIENT_CONTACT_TYPE:NULL, 3->DEPARTMENT_ID:200, 4->NAME:'E2', 5->PERSON_ID:201,
6->PERSON_TYPE:'EM', 7->SALARY:NULL]
[main] INFO org.apache.cayenne.log.CommonsJdbcEventLogger - === updated 1 row.
[main] INFO org.apache.cayenne.log.CommonsJdbcEventLogger - +++ transaction committed.
[main] INFO org.apache.cayenne.configuration.XMLDataChannelDescriptorLoader - Loading XML
configuration resource from <https://builds.apache.org/job/cayenne-master/cayenneTestConnection=hsql,jdk=jdk1.8.0_11,label=Ubuntu/ws/cayenne-server/target/test-classes/cayenne-people.xml>
[main] INFO org.apache.cayenne.configuration.XMLDataChannelDescriptorLoader - Loading XML
DataMap resource from <https://builds.apache.org/job/cayenne-master/cayenneTestConnection=hsql,jdk=jdk1.8.0_11,label=Ubuntu/ws/cayenne-server/target/test-classes/people.map.xml>
[main] INFO org.apache.cayenne.test.jdbc.UtilityLogger - update PERSON set DEPARTMENT_ID =
?
[main] INFO org.apache.cayenne.configuration.XMLDataChannelDescriptorLoader - Loading XML
configuration resource from <https://builds.apache.org/job/cayenne-master/cayenneTestConnection=hsql,jdk=jdk1.8.0_11,label=Ubuntu/ws/cayenne-server/target/test-classes/cayenne-people.xml>
[main] INFO org.apache.cayenne.configuration.XMLDataChannelDescriptorLoader - Loading XML
DataMap resource from <https://builds.apache.org/job/cayenne-master/cayenneTestConnection=hsql,jdk=jdk1.8.0_11,label=Ubuntu/ws/cayenne-server/target/test-classes/people.map.xml>
[main] INFO org.apache.cayenne.test.jdbc.UtilityLogger - delete from ADDRESS
[main] INFO org.apache.cayenne.test.jdbc.UtilityLogger - delete from PERSON_NOTES
[main] INFO org.apache.cayenne.test.jdbc.UtilityLogger - delete from DEPARTMENT
[main] INFO org.apache.cayenne.test.jdbc.UtilityLogger - delete from PERSON
[main] INFO org.apache.cayenne.test.jdbc.UtilityLogger - delete from CLIENT_COMPANY
[main] INFO org.apache.cayenne.log.CommonsJdbcEventLogger - --- transaction started.
[main] INFO org.apache.cayenne.log.CommonsJdbcEventLogger - INSERT INTO DEPARTMENT (DEPARTMENT_ID,
MANAGER_ID, NAME) VALUES (?, ?, ?)
[main] INFO org.apache.cayenne.log.CommonsJdbcEventLogger - [bind: 1->DEPARTMENT_ID:201,
2->MANAGER_ID:NULL, 3->NAME:'D1']
[main] INFO org.apache.cayenne.log.CommonsJdbcEventLogger - === updated 1 row.
[main] INFO org.apache.cayenne.log.CommonsJdbcEventLogger - +++ transaction committed.
[main] INFO org.apache.cayenne.log.CommonsJdbcEventLogger - --- transaction started.
[main] INFO org.apache.cayenne.log.CommonsJdbcEventLogger - INSERT INTO PERSON (CLIENT_COMPANY_ID,
CLIENT_CONTACT_TYPE, DEPARTMENT_ID, NAME, PERSON_ID, PERSON_TYPE, SALARY) VALUES (?, ?, ?,
?, ?, ?, ?)
[main] INFO org.apache.cayenne.log.CommonsJdbcEventLogger - [bind: 1->CLIENT_COMPANY_ID:NULL,
2->CLIENT_CONTACT_TYPE:NULL, 3->DEPARTMENT_ID:201, 4->NAME:'E1', 5->PERSON_ID:202,
6->PERSON_TYPE:'EE', 7->SALARY:NULL]
[main] INFO org.apache.cayenne.log.CommonsJdbcEventLogger - === updated 1 row.
[main] INFO org.apache.cayenne.log.CommonsJdbcEventLogger - [bind: 1->CLIENT_COMPANY_ID:NULL,
2->CLIENT_CONTACT_TYPE:NULL, 3->DEPARTMENT_ID:201, 4->NAME:'E2', 5->PERSON_ID:203,
6->PERSON_TYPE:'EM', 7->SALARY:NULL]
[main] INFO org.apache.cayenne.log.CommonsJdbcEventLogger - === updated 1 row.
[main] INFO org.apache.cayenne.log.CommonsJdbcEventLogger - +++ transaction committed.
[main] INFO org.apache.cayenne.log.CommonsJdbcEventLogger - --- transaction started.
[main] INFO org.apache.cayenne.log.CommonsJdbcEventLogger - SELECT t0.NAME, t0.PERSON_TYPE,
t0.SALARY, t0.PERSON_ID, t0.DEPARTMENT_ID FROM PERSON t0 WHERE (t0.PERSON_TYPE = ?) OR (t0.PERSON_TYPE
= ?) [bind: 1->PERSON_TYPE:'EE', 2->PERSON_TYPE:'EM']
[main] INFO org.apache.cayenne.log.CommonsJdbcEventLogger - === returned 2 rows. - took 1
ms.
[main] INFO org.apache.cayenne.log.CommonsJdbcEventLogger - +++ transaction committed.
Tests run: 2, Failures: 0, Errors: 0, Skipped: 0, Time elapsed: 0.276 sec - in org.apache.cayenne.util.DeepMergeOperationInheritanceIT

Results :

Failed tests: 
  DataDomainCallbacksIT.testPostLoad_ThatModifiesObject:265 expected:<1> but was:<2>

Tests run: 1442, Failures: 1, Errors: 0, Skipped: 0

[WARNING] File encoding has not been set, using platform encoding ISO-8859-1, i.e. build is
platform dependent!
[INFO] 
[INFO] --- maven-failsafe-plugin:2.17:verify (integration-test) @ cayenne-server ---
[INFO] Failsafe report directory: <https://builds.apache.org/job/cayenne-master/cayenneTestConnection=hsql,jdk=jdk1.8.0_11,label=Ubuntu/ws/cayenne-server/target/failsafe-reports>
[WARNING] File encoding has not been set, using platform encoding ISO-8859-1, i.e. build is
platform dependent!
[INFO] ------------------------------------------------------------------------
[INFO] Reactor Summary:
[INFO] 
[INFO] Cayenne ........................................... SUCCESS [0.279s]
[INFO] Cayenne Build Tools Parent ........................ SUCCESS [0.010s]
[INFO] Cayenne License and Notice Bundle ................. SUCCESS [1.227s]
[INFO] Common Unit Test Utilities ........................ SUCCESS [3.091s]
[INFO] Cayenne Code Checkers ............................. SUCCESS [0.047s]
[INFO] Cayenne Dependency Injection Container ............ SUCCESS [11.655s]
[INFO] Cayenne Server .................................... FAILURE [7:40.185s]
[INFO] Cayenne ROP Client ................................ SKIPPED
[INFO] Cayenne Project ................................... SKIPPED
[INFO] Cayenne Tools ..................................... SKIPPED
[INFO] Cayenne Lifecycle Utilities ....................... SKIPPED
[INFO] Cayenne Maven Plugins ............................. SKIPPED
[INFO] Cayenne Maven Plugin .............................. SKIPPED
[INFO] Cayenne Cryptography Extensions ................... SKIPPED
[INFO] Cayenne Integration Tests Parent .................. SKIPPED
[INFO] Integration Tests - Cayenne Tools ................. SKIPPED
[INFO] Cayenne Modeler Parent ............................ SKIPPED
[INFO] Cayenne WebObjects Compatibility Library .......... SKIPPED
[INFO] Cayenne Modeler ................................... SKIPPED
[INFO] Cayenne Modeler Generic and Windows Extensions .... SKIPPED
[INFO] Cayenne Modeler Generic ........................... SKIPPED
[INFO] Cayenne Modeler Mac OS X Extensions ............... SKIPPED
[INFO] Cayenne Modeler Mac OS X .......................... SKIPPED
[INFO] Cayenne Modeler Mac OS X - Old Apple Java ......... SKIPPED
[INFO] Cayenne Modeler Windows ........................... SKIPPED
[INFO] Cayenne Modeler Maven Plugin ...................... SKIPPED
[INFO] Cayenne Tutorials ................................. SKIPPED
[INFO] Cayenne Tutorial .................................. SKIPPED
[INFO] Cayenne ROP Server Tutorial ....................... SKIPPED
[INFO] Cayenne ROP Client Tutorial ....................... SKIPPED
[INFO] Cayenne Documenation Parent ....................... SKIPPED
[INFO] Cayenne Documentation ............................. SKIPPED
[INFO] Cayenne Docbook Documentation ..................... SKIPPED
[INFO] Docbook: Cayenne Stylesheets ...................... SKIPPED
[INFO] Docbook: Cayenne Guide ............................ SKIPPED
[INFO] Docbook: Getting Started with Cayenne ............. SKIPPED
[INFO] Docbook: Getting Started with Cayenne ROP ......... SKIPPED
[INFO] Docbook: Cayenne New Features and Upgrade Guide ... SKIPPED
[INFO] Cayenne Release Assembly .......................... SKIPPED
[INFO] ------------------------------------------------------------------------
[INFO] BUILD FAILURE
[INFO] ------------------------------------------------------------------------
[INFO] Total time: 7:58.078s
[INFO] Finished at: Wed Dec 03 17:50:28 UTC 2014
[INFO] Final Memory: 64M/449M
[INFO] ------------------------------------------------------------------------
[ERROR] Failed to execute goal org.apache.maven.plugins:maven-failsafe-plugin:2.17:verify
(integration-test) on project cayenne-server: There are test failures.
[ERROR] 
[ERROR] Please refer to <https://builds.apache.org/job/cayenne-master/cayenneTestConnection=hsql,jdk=jdk1.8.0_11,label=Ubuntu/ws/cayenne-server/target/failsafe-reports>
for the individual test results.
[ERROR] -> [Help 1]
org.apache.maven.lifecycle.LifecycleExecutionException: Failed to execute goal org.apache.maven.plugins:maven-failsafe-plugin:2.17:verify
(integration-test) on project cayenne-server: There are test failures.

Please refer to <https://builds.apache.org/job/cayenne-master/cayenneTestConnection=hsql,jdk=jdk1.8.0_11,label=Ubuntu/ws/cayenne-server/target/failsafe-reports>
for the individual test results.
	at org.apache.maven.lifecycle.internal.MojoExecutor.execute(MojoExecutor.java:213)
	at org.apache.maven.lifecycle.internal.MojoExecutor.execute(MojoExecutor.java:153)
	at org.apache.maven.lifecycle.internal.MojoExecutor.execute(MojoExecutor.java:145)
	at org.apache.maven.lifecycle.internal.LifecycleModuleBuilder.buildProject(LifecycleModuleBuilder.java:84)
	at org.apache.maven.lifecycle.internal.LifecycleModuleBuilder.buildProject(LifecycleModuleBuilder.java:59)
	at org.apache.maven.lifecycle.internal.LifecycleStarter.singleThreadedBuild(LifecycleStarter.java:183)
	at org.apache.maven.lifecycle.internal.LifecycleStarter.execute(LifecycleStarter.java:161)
	at org.apache.maven.DefaultMaven.doExecute(DefaultMaven.java:320)
	at org.apache.maven.DefaultMaven.execute(DefaultMaven.java:156)
	at org.apache.maven.cli.MavenCli.execute(MavenCli.java:537)
	at org.apache.maven.cli.MavenCli.doMain(MavenCli.java:196)
	at org.apache.maven.cli.MavenCli.main(MavenCli.java:141)
	at sun.reflect.NativeMethodAccessorImpl.invoke0(Native Method)
	at sun.reflect.NativeMethodAccessorImpl.invoke(NativeMethodAccessorImpl.java:62)
	at sun.reflect.DelegatingMethodAccessorImpl.invoke(DelegatingMethodAccessorImpl.java:43)
	at java.lang.reflect.Method.invoke(Method.java:483)
	at org.codehaus.plexus.classworlds.launcher.Launcher.launchEnhanced(Launcher.java:290)
	at org.codehaus.plexus.classworlds.launcher.Launcher.launch(Launcher.java:230)
	at org.codehaus.plexus.classworlds.launcher.Launcher.mainWithExitCode(Launcher.java:409)
	at org.codehaus.plexus.classworlds.launcher.Launcher.main(Launcher.java:352)
Caused by: org.apache.maven.plugin.MojoFailureException: There are test failures.

Please refer to <https://builds.apache.org/job/cayenne-master/cayenneTestConnection=hsql,jdk=jdk1.8.0_11,label=Ubuntu/ws/cayenne-server/target/failsafe-reports>
for the individual test results.
	at org.apache.maven.plugin.surefire.SurefireHelper.reportExecution(SurefireHelper.java:82)
	at org.apache.maven.plugin.failsafe.VerifyMojo.execute(VerifyMojo.java:194)
	at org.apache.maven.plugin.DefaultBuildPluginManager.executeMojo(DefaultBuildPluginManager.java:101)
	at org.apache.maven.lifecycle.internal.MojoExecutor.execute(MojoExecutor.java:209)
	... 19 more
[ERROR] 
[ERROR] Re-run Maven using the -X switch to enable full debug logging.
[ERROR] 
[ERROR] For more information about the errors and possible solutions, please read the following
articles:
[ERROR] [Help 1] http://cwiki.apache.org/confluence/display/MAVEN/MojoFailureException
[ERROR] 
[ERROR] After correcting the problems, you can resume the build with the command
[ERROR]   mvn <goals> -rf :cayenne-server
Build step 'Invoke top-level Maven targets' marked build as failure
Recording test results

Mime
View raw message