cayenne-commits mailing list archives

Site index · List index
Message view « Date » · « Thread »
Top « Date » · « Thread »
From Apache Jenkins Server <jenk...@builds.apache.org>
Subject Build failed in Jenkins: cayenne-master » hsql,JDK 1.7 (latest),Ubuntu #203
Date Thu, 30 Apr 2015 16:37:25 GMT
See <https://builds.apache.org/job/cayenne-master/cayenneTestConnection=hsql,jdk=JDK%201.7%20(latest),label=Ubuntu/203/changes>

Changes:

[aadamchik] CAY-2008 Connection pool refactoring and validation query support in Cayenne DataSource

------------------------------------------
[...truncated 66451 lines...]
[ERROR] COMPILATION ERROR : 
[INFO] -------------------------------------------------------------
[ERROR] Failure executing javac, but could not parse the error:


The system is out of resources.
Consult the following stack trace for details.
java.lang.OutOfMemoryError: PermGen space
	at java.lang.ClassLoader.defineClass1(Native Method)
	at java.lang.ClassLoader.defineClass(ClassLoader.java:792)
	at java.security.SecureClassLoader.defineClass(SecureClassLoader.java:142)
	at java.net.URLClassLoader.defineClass(URLClassLoader.java:449)
	at java.net.URLClassLoader.access$100(URLClassLoader.java:71)
	at java.net.URLClassLoader$1.run(URLClassLoader.java:361)
	at java.net.URLClassLoader$1.run(URLClassLoader.java:355)
	at java.security.AccessController.doPrivileged(Native Method)
	at java.net.URLClassLoader.findClass(URLClassLoader.java:354)
	at org.codehaus.plexus.compiler.javac.IsolatedClassLoader.loadClass(IsolatedClassLoader.java:56)
	at java.lang.ClassLoader.defineClass1(Native Method)
	at java.lang.ClassLoader.defineClass(ClassLoader.java:792)
	at java.security.SecureClassLoader.defineClass(SecureClassLoader.java:142)
	at java.net.URLClassLoader.defineClass(URLClassLoader.java:449)
	at java.net.URLClassLoader.access$100(URLClassLoader.java:71)
	at java.net.URLClassLoader$1.run(URLClassLoader.java:361)
	at java.net.URLClassLoader$1.run(URLClassLoader.java:355)
	at java.security.AccessController.doPrivileged(Native Method)
	at java.net.URLClassLoader.findClass(URLClassLoader.java:354)
	at org.codehaus.plexus.compiler.javac.IsolatedClassLoader.loadClass(IsolatedClassLoader.java:56)
	at com.sun.tools.javac.comp.Check.<init>(Check.java:96)
	at com.sun.tools.javac.comp.Check.instance(Check.java:86)
	at com.sun.tools.javac.code.Types.<init>(Types.java:101)
	at com.sun.tools.javac.code.Types.instance(Types.java:88)
	at com.sun.tools.javac.jvm.ClassReader.<init>(ClassReader.java:264)
	at com.sun.tools.javac.jvm.ClassReader.instance(ClassReader.java:226)
	at com.sun.tools.javac.main.JavaCompiler.<init>(JavaCompiler.java:331)
	at com.sun.tools.javac.main.JavaCompiler.instance(JavaCompiler.java:88)
	at com.sun.tools.javac.main.Main.compile(Main.java:424)
	at com.sun.tools.javac.main.Main.compile(Main.java:353)
	at com.sun.tools.javac.main.Main.compile(Main.java:342)
	at com.sun.tools.javac.main.Main.compile(Main.java:333)

[INFO] 1 error
[INFO] -------------------------------------------------------------
[INFO] ------------------------------------------------------------------------
[INFO] Reactor Summary:
[INFO] 
[INFO] Cayenne ........................................... SUCCESS [0.314s]
[INFO] Cayenne Build Tools Parent ........................ SUCCESS [0.012s]
[INFO] Cayenne License and Notice Bundle ................. SUCCESS [1.381s]
[INFO] Common Unit Test Utilities ........................ SUCCESS [1.178s]
[INFO] Cayenne Code Checkers ............................. SUCCESS [0.087s]
[INFO] Cayenne Dependency Injection Container ............ SUCCESS [9.681s]
[INFO] Cayenne Server .................................... SUCCESS [1:52.243s]
[INFO] Cayenne ROP Client ................................ SUCCESS [19.167s]
[INFO] Cayenne Project ................................... SUCCESS [4.891s]
[INFO] Cayenne Tools ..................................... SUCCESS [10.920s]
[INFO] Cayenne Lifecycle Utilities ....................... SUCCESS [5.966s]
[INFO] Cayenne Maven Plugins ............................. SUCCESS [0.206s]
[INFO] Cayenne Maven Plugin .............................. SUCCESS [18.086s]
[INFO] Cayenne Cryptography Extensions ................... FAILURE [4.161s]
[INFO] Cayenne Integration Tests Parent .................. SKIPPED
[INFO] Integration Tests - Cayenne Tools ................. SKIPPED
[INFO] Cayenne Modeler Parent ............................ SKIPPED
[INFO] Cayenne WebObjects Compatibility Library .......... SKIPPED
[INFO] Cayenne Modeler ................................... SKIPPED
[INFO] Cayenne Modeler Generic and Windows Extensions .... SKIPPED
[INFO] Cayenne Modeler Generic ........................... SKIPPED
[INFO] Cayenne Modeler Mac OS X Extensions ............... SKIPPED
[INFO] Cayenne Modeler Mac OS X .......................... SKIPPED
[INFO] Cayenne Modeler Mac OS X - Old Apple Java ......... SKIPPED
[INFO] Cayenne Modeler Windows ........................... SKIPPED
[INFO] Cayenne Modeler Maven Plugin ...................... SKIPPED
[INFO] Cayenne Tutorials ................................. SKIPPED
[INFO] Cayenne Tutorial .................................. SKIPPED
[INFO] Cayenne ROP Server Tutorial ....................... SKIPPED
[INFO] Cayenne ROP Client Tutorial ....................... SKIPPED
[INFO] Cayenne Documenation Parent ....................... SKIPPED
[INFO] Cayenne Documentation ............................. SKIPPED
[INFO] Cayenne Docbook Documentation ..................... SKIPPED
[INFO] Docbook: Cayenne Stylesheets ...................... SKIPPED
[INFO] Docbook: Cayenne Guide ............................ SKIPPED
[INFO] Docbook: Getting Started with Cayenne ............. SKIPPED
[INFO] Docbook: Getting Started with Cayenne ROP ......... SKIPPED
[INFO] Docbook: Cayenne New Features and Upgrade Guide ... SKIPPED
[INFO] Cayenne Release Assembly .......................... SKIPPED
[INFO] ------------------------------------------------------------------------
[INFO] BUILD FAILURE
[INFO] ------------------------------------------------------------------------
[INFO] Total time: 3:09.759s
[INFO] Finished at: Thu Apr 30 16:37:07 UTC 2015
[INFO] Final Memory: 33M/620M
[INFO] ------------------------------------------------------------------------
[ERROR] Failed to execute goal org.apache.maven.plugins:maven-compiler-plugin:2.3.2:compile
(default-compile) on project cayenne-crypto: Compilation failure
[ERROR] Failure executing javac, but could not parse the error:
[ERROR] 
[ERROR] 
[ERROR] The system is out of resources.
[ERROR] Consult the following stack trace for details.
[ERROR] java.lang.OutOfMemoryError: PermGen space
[ERROR] at java.lang.ClassLoader.defineClass1(Native Method)
[ERROR] at java.lang.ClassLoader.defineClass(ClassLoader.java:792)
[ERROR] at java.security.SecureClassLoader.defineClass(SecureClassLoader.java:142)
[ERROR] at java.net.URLClassLoader.defineClass(URLClassLoader.java:449)
[ERROR] at java.net.URLClassLoader.access$100(URLClassLoader.java:71)
[ERROR] at java.net.URLClassLoader$1.run(URLClassLoader.java:361)
[ERROR] at java.net.URLClassLoader$1.run(URLClassLoader.java:355)
[ERROR] at java.security.AccessController.doPrivileged(Native Method)
[ERROR] at java.net.URLClassLoader.findClass(URLClassLoader.java:354)
[ERROR] at org.codehaus.plexus.compiler.javac.IsolatedClassLoader.loadClass(IsolatedClassLoader.java:56)
[ERROR] at java.lang.ClassLoader.defineClass1(Native Method)
[ERROR] at java.lang.ClassLoader.defineClass(ClassLoader.java:792)
[ERROR] at java.security.SecureClassLoader.defineClass(SecureClassLoader.java:142)
[ERROR] at java.net.URLClassLoader.defineClass(URLClassLoader.java:449)
[ERROR] at java.net.URLClassLoader.access$100(URLClassLoader.java:71)
[ERROR] at java.net.URLClassLoader$1.run(URLClassLoader.java:361)
[ERROR] at java.net.URLClassLoader$1.run(URLClassLoader.java:355)
[ERROR] at java.security.AccessController.doPrivileged(Native Method)
[ERROR] at java.net.URLClassLoader.findClass(URLClassLoader.java:354)
[ERROR] at org.codehaus.plexus.compiler.javac.IsolatedClassLoader.loadClass(IsolatedClassLoader.java:56)
[ERROR] at com.sun.tools.javac.comp.Check.<init>(Check.java:96)
[ERROR] at com.sun.tools.javac.comp.Check.instance(Check.java:86)
[ERROR] at com.sun.tools.javac.code.Types.<init>(Types.java:101)
[ERROR] at com.sun.tools.javac.code.Types.instance(Types.java:88)
[ERROR] at com.sun.tools.javac.jvm.ClassReader.<init>(ClassReader.java:264)
[ERROR] at com.sun.tools.javac.jvm.ClassReader.instance(ClassReader.java:226)
[ERROR] at com.sun.tools.javac.main.JavaCompiler.<init>(JavaCompiler.java:331)
[ERROR] at com.sun.tools.javac.main.JavaCompiler.instance(JavaCompiler.java:88)
[ERROR] at com.sun.tools.javac.main.Main.compile(Main.java:424)
[ERROR] at com.sun.tools.javac.main.Main.compile(Main.java:353)
[ERROR] at com.sun.tools.javac.main.Main.compile(Main.java:342)
[ERROR] at com.sun.tools.javac.main.Main.compile(Main.java:333)
[ERROR] -> [Help 1]
org.apache.maven.lifecycle.LifecycleExecutionException: Failed to execute goal org.apache.maven.plugins:maven-compiler-plugin:2.3.2:compile
(default-compile) on project cayenne-crypto: Compilation failure
Failure executing javac, but could not parse the error:


The system is out of resources.
Consult the following stack trace for details.
java.lang.OutOfMemoryError: PermGen space
	at java.lang.ClassLoader.defineClass1(Native Method)
	at java.lang.ClassLoader.defineClass(ClassLoader.java:792)
	at java.security.SecureClassLoader.defineClass(SecureClassLoader.java:142)
	at java.net.URLClassLoader.defineClass(URLClassLoader.java:449)
	at java.net.URLClassLoader.access$100(URLClassLoader.java:71)
	at java.net.URLClassLoader$1.run(URLClassLoader.java:361)
	at java.net.URLClassLoader$1.run(URLClassLoader.java:355)
	at java.security.AccessController.doPrivileged(Native Method)
	at java.net.URLClassLoader.findClass(URLClassLoader.java:354)
	at org.codehaus.plexus.compiler.javac.IsolatedClassLoader.loadClass(IsolatedClassLoader.java:56)
	at java.lang.ClassLoader.defineClass1(Native Method)
	at java.lang.ClassLoader.defineClass(ClassLoader.java:792)
	at java.security.SecureClassLoader.defineClass(SecureClassLoader.java:142)
	at java.net.URLClassLoader.defineClass(URLClassLoader.java:449)
	at java.net.URLClassLoader.access$100(URLClassLoader.java:71)
	at java.net.URLClassLoader$1.run(URLClassLoader.java:361)
	at java.net.URLClassLoader$1.run(URLClassLoader.java:355)
	at java.security.AccessController.doPrivileged(Native Method)
	at java.net.URLClassLoader.findClass(URLClassLoader.java:354)
	at org.codehaus.plexus.compiler.javac.IsolatedClassLoader.loadClass(IsolatedClassLoader.java:56)
	at com.sun.tools.javac.comp.Check.<init>(Check.java:96)
	at com.sun.tools.javac.comp.Check.instance(Check.java:86)
	at com.sun.tools.javac.code.Types.<init>(Types.java:101)
	at com.sun.tools.javac.code.Types.instance(Types.java:88)
	at com.sun.tools.javac.jvm.ClassReader.<init>(ClassReader.java:264)
	at com.sun.tools.javac.jvm.ClassReader.instance(ClassReader.java:226)
	at com.sun.tools.javac.main.JavaCompiler.<init>(JavaCompiler.java:331)
	at com.sun.tools.javac.main.JavaCompiler.instance(JavaCompiler.java:88)
	at com.sun.tools.javac.main.Main.compile(Main.java:424)
	at com.sun.tools.javac.main.Main.compile(Main.java:353)
	at com.sun.tools.javac.main.Main.compile(Main.java:342)
	at com.sun.tools.javac.main.Main.compile(Main.java:333)


	at org.apache.maven.lifecycle.internal.MojoExecutor.execute(MojoExecutor.java:213)
	at org.apache.maven.lifecycle.internal.MojoExecutor.execute(MojoExecutor.java:153)
	at org.apache.maven.lifecycle.internal.MojoExecutor.execute(MojoExecutor.java:145)
	at org.apache.maven.lifecycle.internal.LifecycleModuleBuilder.buildProject(LifecycleModuleBuilder.java:84)
	at org.apache.maven.lifecycle.internal.LifecycleModuleBuilder.buildProject(LifecycleModuleBuilder.java:59)
	at org.apache.maven.lifecycle.internal.LifecycleStarter.singleThreadedBuild(LifecycleStarter.java:183)
	at org.apache.maven.lifecycle.internal.LifecycleStarter.execute(LifecycleStarter.java:161)
	at org.apache.maven.DefaultMaven.doExecute(DefaultMaven.java:320)
	at org.apache.maven.DefaultMaven.execute(DefaultMaven.java:156)
	at org.apache.maven.cli.MavenCli.execute(MavenCli.java:537)
	at org.apache.maven.cli.MavenCli.doMain(MavenCli.java:196)
	at org.apache.maven.cli.MavenCli.main(MavenCli.java:141)
	at sun.reflect.NativeMethodAccessorImpl.invoke0(Native Method)
	at sun.reflect.NativeMethodAccessorImpl.invoke(NativeMethodAccessorImpl.java:57)
	at sun.reflect.DelegatingMethodAccessorImpl.invoke(DelegatingMethodAccessorImpl.java:43)
	at java.lang.reflect.Method.invoke(Method.java:606)
	at org.codehaus.plexus.classworlds.launcher.Launcher.launchEnhanced(Launcher.java:290)
	at org.codehaus.plexus.classworlds.launcher.Launcher.launch(Launcher.java:230)
	at org.codehaus.plexus.classworlds.launcher.Launcher.mainWithExitCode(Launcher.java:409)
	at org.codehaus.plexus.classworlds.launcher.Launcher.main(Launcher.java:352)
Caused by: org.apache.maven.plugin.CompilationFailureException: Compilation failure
Failure executing javac, but could not parse the error:


The system is out of resources.
Consult the following stack trace for details.
java.lang.OutOfMemoryError: PermGen space
	at java.lang.ClassLoader.defineClass1(Native Method)
	at java.lang.ClassLoader.defineClass(ClassLoader.java:792)
	at java.security.SecureClassLoader.defineClass(SecureClassLoader.java:142)
	at java.net.URLClassLoader.defineClass(URLClassLoader.java:449)
	at java.net.URLClassLoader.access$100(URLClassLoader.java:71)
	at java.net.URLClassLoader$1.run(URLClassLoader.java:361)
	at java.net.URLClassLoader$1.run(URLClassLoader.java:355)
	at java.security.AccessController.doPrivileged(Native Method)
	at java.net.URLClassLoader.findClass(URLClassLoader.java:354)
	at org.codehaus.plexus.compiler.javac.IsolatedClassLoader.loadClass(IsolatedClassLoader.java:56)
	at java.lang.ClassLoader.defineClass1(Native Method)
	at java.lang.ClassLoader.defineClass(ClassLoader.java:792)
	at java.security.SecureClassLoader.defineClass(SecureClassLoader.java:142)
	at java.net.URLClassLoader.defineClass(URLClassLoader.java:449)
	at java.net.URLClassLoader.access$100(URLClassLoader.java:71)
	at java.net.URLClassLoader$1.run(URLClassLoader.java:361)
	at java.net.URLClassLoader$1.run(URLClassLoader.java:355)
	at java.security.AccessController.doPrivileged(Native Method)
	at java.net.URLClassLoader.findClass(URLClassLoader.java:354)
	at org.codehaus.plexus.compiler.javac.IsolatedClassLoader.loadClass(IsolatedClassLoader.java:56)
	at com.sun.tools.javac.comp.Check.<init>(Check.java:96)
	at com.sun.tools.javac.comp.Check.instance(Check.java:86)
	at com.sun.tools.javac.code.Types.<init>(Types.java:101)
	at com.sun.tools.javac.code.Types.instance(Types.java:88)
	at com.sun.tools.javac.jvm.ClassReader.<init>(ClassReader.java:264)
	at com.sun.tools.javac.jvm.ClassReader.instance(ClassReader.java:226)
	at com.sun.tools.javac.main.JavaCompiler.<init>(JavaCompiler.java:331)
	at com.sun.tools.javac.main.JavaCompiler.instance(JavaCompiler.java:88)
	at com.sun.tools.javac.main.Main.compile(Main.java:424)
	at com.sun.tools.javac.main.Main.compile(Main.java:353)
	at com.sun.tools.javac.main.Main.compile(Main.java:342)
	at com.sun.tools.javac.main.Main.compile(Main.java:333)


	at org.apache.maven.plugin.AbstractCompilerMojo.execute(AbstractCompilerMojo.java:656)
	at org.apache.maven.plugin.CompilerMojo.execute(CompilerMojo.java:128)
	at org.apache.maven.plugin.DefaultBuildPluginManager.executeMojo(DefaultBuildPluginManager.java:101)
	at org.apache.maven.lifecycle.internal.MojoExecutor.execute(MojoExecutor.java:209)
	... 19 more
[ERROR] 
[ERROR] Re-run Maven using the -X switch to enable full debug logging.
[ERROR] 
[ERROR] For more information about the errors and possible solutions, please read the following
articles:
[ERROR] [Help 1] http://cwiki.apache.org/confluence/display/MAVEN/MojoFailureException
[ERROR] 
[ERROR] After correcting the problems, you can resume the build with the command
[ERROR]   mvn <goals> -rf :cayenne-crypto
Build step 'Invoke top-level Maven targets' marked build as failure
Recording test results

Mime
View raw message