cayenne-commits mailing list archives

Site index · List index
Message view « Date » · « Thread »
Top « Date » · « Thread »
From Apache Jenkins Server <jenk...@builds.apache.org>
Subject Build failed in Jenkins: cayenne-master » hsql,JDK 1.7 (latest),Ubuntu #259
Date Fri, 23 Oct 2015 12:32:13 GMT
See <https://builds.apache.org/job/cayenne-master/cayenneTestConnection=hsql,jdk=JDK%201.7%20(latest),label=Ubuntu/259/changes>

Changes:

[aadamchik] CAY-2030 Capturing a stream of commit changes

------------------------------------------
[...truncated 10559 lines...]
Running org.apache.cayenne.access.DataContextNoPkIT
[main] INFO org.apache.cayenne.configuration.XMLDataChannelDescriptorLoader - Loading XML
configuration resource from <https://builds.apache.org/job/cayenne-master/cayenneTestConnection=hsql,jdk=JDK%201.7%20(latest),label=Ubuntu/ws/cayenne-server/target/test-classes/cayenne-no-pk.xml>
[main] INFO org.apache.cayenne.configuration.XMLDataChannelDescriptorLoader - Loading XML
DataMap resource from <https://builds.apache.org/job/cayenne-master/cayenneTestConnection=hsql,jdk=JDK%201.7%20(latest),label=Ubuntu/ws/cayenne-server/target/test-classes/no-pk.map.xml>
[main] INFO org.apache.cayenne.configuration.XMLDataChannelDescriptorLoader - Loading XML
configuration resource from <https://builds.apache.org/job/cayenne-master/cayenneTestConnection=hsql,jdk=JDK%201.7%20(latest),label=Ubuntu/ws/cayenne-server/target/test-classes/cayenne-no-pk.xml>
[main] INFO org.apache.cayenne.configuration.XMLDataChannelDescriptorLoader - Loading XML
DataMap resource from <https://builds.apache.org/job/cayenne-master/cayenneTestConnection=hsql,jdk=JDK%201.7%20(latest),label=Ubuntu/ws/cayenne-server/target/test-classes/no-pk.map.xml>
[main] INFO org.apache.cayenne.test.jdbc.UtilityLogger - delete from NO_PK_TEST
[main] INFO org.apache.cayenne.test.jdbc.UtilityLogger - delete from NO_PK_TEST
[main] INFO org.apache.cayenne.test.jdbc.UtilityLogger - INSERT INTO NO_PK_TEST (ATTRIBUTE1)
VALUES (?)
[main] INFO org.apache.cayenne.test.jdbc.UtilityLogger - INSERT INTO NO_PK_TEST (ATTRIBUTE1)
VALUES (?)
[main] INFO org.apache.cayenne.log.CommonsJdbcEventLogger - --- transaction started.
[main] INFO org.apache.cayenne.log.CommonsJdbcEventLogger - SELECT t0.ATTRIBUTE1 FROM NO_PK_TEST
t0 
[main] INFO org.apache.cayenne.log.CommonsJdbcEventLogger - === returned 2 rows. - took 0
ms.
[main] INFO org.apache.cayenne.log.CommonsJdbcEventLogger - +++ transaction committed.
[main] INFO org.apache.cayenne.configuration.XMLDataChannelDescriptorLoader - Loading XML
configuration resource from <https://builds.apache.org/job/cayenne-master/cayenneTestConnection=hsql,jdk=JDK%201.7%20(latest),label=Ubuntu/ws/cayenne-server/target/test-classes/cayenne-no-pk.xml>
[main] INFO org.apache.cayenne.configuration.XMLDataChannelDescriptorLoader - Loading XML
DataMap resource from <https://builds.apache.org/job/cayenne-master/cayenneTestConnection=hsql,jdk=JDK%201.7%20(latest),label=Ubuntu/ws/cayenne-server/target/test-classes/no-pk.map.xml>
[main] INFO org.apache.cayenne.configuration.XMLDataChannelDescriptorLoader - Loading XML
configuration resource from <https://builds.apache.org/job/cayenne-master/cayenneTestConnection=hsql,jdk=JDK%201.7%20(latest),label=Ubuntu/ws/cayenne-server/target/test-classes/cayenne-no-pk.xml>
[main] INFO org.apache.cayenne.configuration.XMLDataChannelDescriptorLoader - Loading XML
DataMap resource from <https://builds.apache.org/job/cayenne-master/cayenneTestConnection=hsql,jdk=JDK%201.7%20(latest),label=Ubuntu/ws/cayenne-server/target/test-classes/no-pk.map.xml>
[main] INFO org.apache.cayenne.test.jdbc.UtilityLogger - delete from NO_PK_TEST
[main] INFO org.apache.cayenne.test.jdbc.UtilityLogger - delete from NO_PK_TEST
[main] INFO org.apache.cayenne.test.jdbc.UtilityLogger - INSERT INTO NO_PK_TEST (ATTRIBUTE1)
VALUES (?)
[main] INFO org.apache.cayenne.test.jdbc.UtilityLogger - INSERT INTO NO_PK_TEST (ATTRIBUTE1)
VALUES (?)
[main] INFO org.apache.cayenne.log.CommonsJdbcEventLogger - --- transaction started.
[main] INFO org.apache.cayenne.log.CommonsJdbcEventLogger - SELECT t0.ATTRIBUTE1 FROM NO_PK_TEST
t0 
[main] INFO org.apache.cayenne.log.CommonsJdbcEventLogger - === returned 2 rows. - took 1
ms.
[main] INFO org.apache.cayenne.log.CommonsJdbcEventLogger - +++ transaction committed.
Tests run: 2, Failures: 0, Errors: 0, Skipped: 0, Time elapsed: 0.024 sec - in org.apache.cayenne.access.DataContextNoPkIT
Running org.apache.cayenne.access.DataContextEJBQLInheritanceIT
[main] INFO org.apache.cayenne.configuration.XMLDataChannelDescriptorLoader - Loading XML
configuration resource from <https://builds.apache.org/job/cayenne-master/cayenneTestConnection=hsql,jdk=JDK%201.7%20(latest),label=Ubuntu/ws/cayenne-server/target/test-classes/cayenne-people.xml>
[main] INFO org.apache.cayenne.configuration.XMLDataChannelDescriptorLoader - Loading XML
DataMap resource from <https://builds.apache.org/job/cayenne-master/cayenneTestConnection=hsql,jdk=JDK%201.7%20(latest),label=Ubuntu/ws/cayenne-server/target/test-classes/people.map.xml>
[main] INFO org.apache.cayenne.test.jdbc.UtilityLogger - update PERSON set DEPARTMENT_ID =
?
[main] INFO org.apache.cayenne.configuration.XMLDataChannelDescriptorLoader - Loading XML
configuration resource from <https://builds.apache.org/job/cayenne-master/cayenneTestConnection=hsql,jdk=JDK%201.7%20(latest),label=Ubuntu/ws/cayenne-server/target/test-classes/cayenne-people.xml>
[main] INFO org.apache.cayenne.configuration.XMLDataChannelDescriptorLoader - Loading XML
DataMap resource from <https://builds.apache.org/job/cayenne-master/cayenneTestConnection=hsql,jdk=JDK%201.7%20(latest),label=Ubuntu/ws/cayenne-server/target/test-classes/people.map.xml>
[main] INFO org.apache.cayenne.test.jdbc.UtilityLogger - delete from ADDRESS
[main] INFO org.apache.cayenne.test.jdbc.UtilityLogger - delete from PERSON_NOTES
[main] INFO org.apache.cayenne.test.jdbc.UtilityLogger - delete from DEPARTMENT
[main] INFO org.apache.cayenne.test.jdbc.UtilityLogger - delete from PERSON
[main] INFO org.apache.cayenne.test.jdbc.UtilityLogger - delete from CLIENT_COMPANY
[main] INFO org.apache.cayenne.test.jdbc.UtilityLogger - INSERT INTO PERSON (PERSON_ID, NAME,
PERSON_TYPE, SALARY) VALUES (?, ?, ?, ?)
[main] INFO org.apache.cayenne.test.jdbc.UtilityLogger - INSERT INTO PERSON (PERSON_ID, NAME,
PERSON_TYPE, SALARY) VALUES (?, ?, ?, ?)
[main] INFO org.apache.cayenne.test.jdbc.UtilityLogger - INSERT INTO PERSON (PERSON_ID, NAME,
PERSON_TYPE, SALARY) VALUES (?, ?, ?, ?)
[main] INFO org.apache.cayenne.test.jdbc.UtilityLogger - INSERT INTO PERSON (PERSON_ID, NAME,
PERSON_TYPE, SALARY) VALUES (?, ?, ?, ?)
[main] INFO org.apache.cayenne.test.jdbc.UtilityLogger - INSERT INTO PERSON (PERSON_ID, NAME,
PERSON_TYPE, SALARY) VALUES (?, ?, ?, ?)
[main] INFO org.apache.cayenne.log.CommonsJdbcEventLogger - --- transaction started.
[main] INFO org.apache.cayenne.log.CommonsJdbcEventLogger - SELECT t0.NAME AS ec0_0, t0.PERSON_TYPE
AS ec0_1, t0.PERSON_ID AS ec0_6, t0.CLIENT_CONTACT_TYPE AS ec0_2, t0.CLIENT_COMPANY_ID AS
ec0_3, t0.SALARY AS ec0_4, t0.DEPARTMENT_ID AS ec0_5 FROM PERSON t0 ORDER BY t0.NAME
[main] INFO org.apache.cayenne.log.CommonsJdbcEventLogger - === returned 5 rows. - took 1
ms.
[main] INFO org.apache.cayenne.log.CommonsJdbcEventLogger - +++ transaction committed.
[main] INFO org.apache.cayenne.log.CommonsJdbcEventLogger - --- transaction started.
[main] INFO org.apache.cayenne.log.CommonsJdbcEventLogger - SELECT t0.NAME AS ec0_0, t0.PERSON_TYPE
AS ec0_5, t0.SALARY AS ec0_2, t0.PERSON_ID AS ec0_4, t0.DEPARTMENT_ID AS ec0_3 FROM PERSON
t0 WHERE t0.PERSON_TYPE = ? OR t0.PERSON_TYPE = ? ORDER BY t0.NAME [bind: 1:'EE', 2:'EM']
[main] INFO org.apache.cayenne.log.CommonsJdbcEventLogger - === returned 4 rows. - took 1
ms.
[main] INFO org.apache.cayenne.log.CommonsJdbcEventLogger - +++ transaction committed.
Tests run: 1, Failures: 0, Errors: 0, Skipped: 0, Time elapsed: 0.026 sec - in org.apache.cayenne.access.DataContextEJBQLInheritanceIT
Running org.apache.cayenne.access.DataContextSelectQuerySplitAliasesIT
[main] INFO org.apache.cayenne.configuration.XMLDataChannelDescriptorLoader - Loading XML
configuration resource from <https://builds.apache.org/job/cayenne-master/cayenneTestConnection=hsql,jdk=JDK%201.7%20(latest),label=Ubuntu/ws/cayenne-server/target/test-classes/cayenne-testmap.xml>
[main] INFO org.apache.cayenne.configuration.XMLDataChannelDescriptorLoader - Loading XML
DataMap resource from <https://builds.apache.org/job/cayenne-master/cayenneTestConnection=hsql,jdk=JDK%201.7%20(latest),label=Ubuntu/ws/cayenne-server/target/test-classes/testmap.map.xml>
[main] INFO org.apache.cayenne.map.EntityResolver - added runtime complimentary DbRelationship
from ARTIST to PAINTING1
[main] INFO org.apache.cayenne.configuration.XMLDataChannelDescriptorLoader - Loading XML
configuration resource from <https://builds.apache.org/job/cayenne-master/cayenneTestConnection=hsql,jdk=JDK%201.7%20(latest),label=Ubuntu/ws/cayenne-server/target/test-classes/cayenne-testmap.xml>
[main] INFO org.apache.cayenne.configuration.XMLDataChannelDescriptorLoader - Loading XML
DataMap resource from <https://builds.apache.org/job/cayenne-master/cayenneTestConnection=hsql,jdk=JDK%201.7%20(latest),label=Ubuntu/ws/cayenne-server/target/test-classes/testmap.map.xml>
[main] INFO org.apache.cayenne.test.jdbc.UtilityLogger - delete from PAINTING_INFO
[main] INFO org.apache.cayenne.test.jdbc.UtilityLogger - delete from ARTIST_EXHIBIT
[main] INFO org.apache.cayenne.test.jdbc.UtilityLogger - delete from PAINTING1
[main] INFO org.apache.cayenne.test.jdbc.UtilityLogger - delete from PAINTING
[main] INFO org.apache.cayenne.test.jdbc.UtilityLogger - delete from ARTIST_GROUP
[main] INFO org.apache.cayenne.test.jdbc.UtilityLogger - delete from GENERATED_COLUMN
[main] INFO org.apache.cayenne.test.jdbc.UtilityLogger - delete from ARTIST
[main] INFO org.apache.cayenne.test.jdbc.UtilityLogger - delete from EXHIBIT
[main] INFO org.apache.cayenne.test.jdbc.UtilityLogger - delete from ARTIST_CT
[main] INFO org.apache.cayenne.test.jdbc.UtilityLogger - delete from GALLERY
[main] INFO org.apache.cayenne.test.jdbc.UtilityLogger - delete from NULL_TEST
[main] INFO org.apache.cayenne.test.jdbc.UtilityLogger - delete from ARTGROUP
[main] INFO org.apache.cayenne.test.jdbc.UtilityLogger - INSERT INTO ARTIST (ARTIST_ID, ARTIST_NAME)
VALUES (?, ?)
[main] INFO org.apache.cayenne.test.jdbc.UtilityLogger - INSERT INTO ARTIST (ARTIST_ID, ARTIST_NAME)
VALUES (?, ?)
[main] INFO org.apache.cayenne.test.jdbc.UtilityLogger - INSERT INTO PAINTING (PAINTING_ID,
ARTIST_ID, PAINTING_TITLE) VALUES (?, ?, ?)
[main] INFO org.apache.cayenne.test.jdbc.UtilityLogger - INSERT INTO PAINTING (PAINTING_ID,
ARTIST_ID, PAINTING_TITLE) VALUES (?, ?, ?)
[main] INFO org.apache.cayenne.test.jdbc.UtilityLogger - INSERT INTO PAINTING (PAINTING_ID,
ARTIST_ID, PAINTING_TITLE) VALUES (?, ?, ?)
[main] INFO org.apache.cayenne.log.CommonsJdbcEventLogger - --- transaction started.
[main] INFO org.apache.cayenne.log.CommonsJdbcEventLogger - SELECT DISTINCT t0.ARTIST_NAME,
t0.DATE_OF_BIRTH, t0.ARTIST_ID FROM ARTIST t0 JOIN PAINTING t1 ON (t0.ARTIST_ID = t1.ARTIST_ID)
JOIN PAINTING t2 ON (t0.ARTIST_ID = t2.ARTIST_ID) WHERE (t1.PAINTING_TITLE = ?) AND (t2.PAINTING_TITLE
= ?) [bind: 1->PAINTING_TITLE:'X', 2->PAINTING_TITLE:'Y']
[main] INFO org.apache.cayenne.log.CommonsJdbcEventLogger - === returned 1 row. - took 1 ms.
[main] INFO org.apache.cayenne.log.CommonsJdbcEventLogger - +++ transaction committed.
[main] INFO org.apache.cayenne.configuration.XMLDataChannelDescriptorLoader - Loading XML
configuration resource from <https://builds.apache.org/job/cayenne-master/cayenneTestConnection=hsql,jdk=JDK%201.7%20(latest),label=Ubuntu/ws/cayenne-server/target/test-classes/cayenne-testmap.xml>
[main] INFO org.apache.cayenne.configuration.XMLDataChannelDescriptorLoader - Loading XML
DataMap resource from <https://builds.apache.org/job/cayenne-master/cayenneTestConnection=hsql,jdk=JDK%201.7%20(latest),label=Ubuntu/ws/cayenne-server/target/test-classes/testmap.map.xml>
[main] INFO org.apache.cayenne.map.EntityResolver - added runtime complimentary DbRelationship
from ARTIST to PAINTING1
[main] INFO org.apache.cayenne.configuration.XMLDataChannelDescriptorLoader - Loading XML
configuration resource from <https://builds.apache.org/job/cayenne-master/cayenneTestConnection=hsql,jdk=JDK%201.7%20(latest),label=Ubuntu/ws/cayenne-server/target/test-classes/cayenne-testmap.xml>
[main] INFO org.apache.cayenne.configuration.XMLDataChannelDescriptorLoader - Loading XML
DataMap resource from <https://builds.apache.org/job/cayenne-master/cayenneTestConnection=hsql,jdk=JDK%201.7%20(latest),label=Ubuntu/ws/cayenne-server/target/test-classes/testmap.map.xml>
[main] INFO org.apache.cayenne.test.jdbc.UtilityLogger - delete from PAINTING_INFO
[main] INFO org.apache.cayenne.test.jdbc.UtilityLogger - delete from ARTIST_EXHIBIT
[main] INFO org.apache.cayenne.test.jdbc.UtilityLogger - delete from PAINTING1
[main] INFO org.apache.cayenne.test.jdbc.UtilityLogger - delete from PAINTING
[main] INFO org.apache.cayenne.test.jdbc.UtilityLogger - delete from ARTIST_GROUP
[main] INFO org.apache.cayenne.test.jdbc.UtilityLogger - delete from GENERATED_COLUMN
[main] INFO org.apache.cayenne.test.jdbc.UtilityLogger - delete from ARTIST
[main] INFO org.apache.cayenne.test.jdbc.UtilityLogger - delete from EXHIBIT
[main] INFO org.apache.cayenne.test.jdbc.UtilityLogger - delete from ARTIST_CT
[main] INFO org.apache.cayenne.test.jdbc.UtilityLogger - delete from GALLERY
[main] INFO org.apache.cayenne.test.jdbc.UtilityLogger - delete from NULL_TEST
[main] INFO org.apache.cayenne.test.jdbc.UtilityLogger - delete from ARTGROUP
[main] INFO org.apache.cayenne.test.jdbc.UtilityLogger - INSERT INTO ARTIST (ARTIST_ID, ARTIST_NAME)
VALUES (?, ?)
[main] INFO org.apache.cayenne.test.jdbc.UtilityLogger - INSERT INTO ARTIST (ARTIST_ID, ARTIST_NAME)
VALUES (?, ?)
[main] INFO org.apache.cayenne.test.jdbc.UtilityLogger - INSERT INTO PAINTING (PAINTING_ID,
ARTIST_ID, PAINTING_TITLE) VALUES (?, ?, ?)
[main] INFO org.apache.cayenne.test.jdbc.UtilityLogger - INSERT INTO PAINTING (PAINTING_ID,
ARTIST_ID, PAINTING_TITLE) VALUES (?, ?, ?)
[main] INFO org.apache.cayenne.log.CommonsJdbcEventLogger - --- transaction started.
[main] INFO org.apache.cayenne.log.CommonsJdbcEventLogger - SELECT DISTINCT t0.ARTIST_NAME,
t0.DATE_OF_BIRTH, t0.ARTIST_ID FROM ARTIST t0 JOIN PAINTING t1 ON (t0.ARTIST_ID = t1.ARTIST_ID)
WHERE t1.PAINTING_TITLE = ? [bind: 1->PAINTING_TITLE:'X']
[main] INFO org.apache.cayenne.log.CommonsJdbcEventLogger - === returned 1 row. - took 1 ms.
[main] INFO org.apache.cayenne.log.CommonsJdbcEventLogger - +++ transaction committed.
Tests run: 2, Failures: 0, Errors: 0, Skipped: 0, Time elapsed: 0.036 sec - in org.apache.cayenne.access.DataContextSelectQuerySplitAliasesIT
Running org.apache.cayenne.access.DataRowStoreIT
[main] INFO org.apache.cayenne.configuration.XMLDataChannelDescriptorLoader - Loading XML
configuration resource from <https://builds.apache.org/job/cayenne-master/cayenneTestConnection=hsql,jdk=JDK%201.7%20(latest),label=Ubuntu/ws/cayenne-server/target/test-classes/cayenne-testmap.xml>
[main] INFO org.apache.cayenne.configuration.XMLDataChannelDescriptorLoader - Loading XML
DataMap resource from <https://builds.apache.org/job/cayenne-master/cayenneTestConnection=hsql,jdk=JDK%201.7%20(latest),label=Ubuntu/ws/cayenne-server/target/test-classes/testmap.map.xml>
[main] INFO org.apache.cayenne.map.EntityResolver - added runtime complimentary DbRelationship
from ARTIST to PAINTING1
[main] INFO org.apache.cayenne.configuration.XMLDataChannelDescriptorLoader - Loading XML
configuration resource from <https://builds.apache.org/job/cayenne-master/cayenneTestConnection=hsql,jdk=JDK%201.7%20(latest),label=Ubuntu/ws/cayenne-server/target/test-classes/cayenne-testmap.xml>
[main] INFO org.apache.cayenne.configuration.XMLDataChannelDescriptorLoader - Loading XML
DataMap resource from <https://builds.apache.org/job/cayenne-master/cayenneTestConnection=hsql,jdk=JDK%201.7%20(latest),label=Ubuntu/ws/cayenne-server/target/test-classes/testmap.map.xml>
[main] INFO org.apache.cayenne.test.jdbc.UtilityLogger - delete from PAINTING_INFO
[main] INFO org.apache.cayenne.test.jdbc.UtilityLogger - delete from ARTIST_EXHIBIT
[main] INFO org.apache.cayenne.test.jdbc.UtilityLogger - delete from PAINTING1
[main] INFO org.apache.cayenne.test.jdbc.UtilityLogger - delete from PAINTING
[main] INFO org.apache.cayenne.test.jdbc.UtilityLogger - delete from ARTIST_GROUP
[main] INFO org.apache.cayenne.test.jdbc.UtilityLogger - delete from GENERATED_COLUMN
[main] INFO org.apache.cayenne.test.jdbc.UtilityLogger - delete from ARTIST
[main] INFO org.apache.cayenne.test.jdbc.UtilityLogger - delete from EXHIBIT
[main] INFO org.apache.cayenne.test.jdbc.UtilityLogger - delete from ARTIST_CT
[main] INFO org.apache.cayenne.test.jdbc.UtilityLogger - delete from GALLERY
[main] INFO org.apache.cayenne.test.jdbc.UtilityLogger - delete from NULL_TEST
[main] INFO org.apache.cayenne.test.jdbc.UtilityLogger - delete from ARTGROUP
[DownHandler (UDP)] INFO org.jgroups.protocols.UDP - unicast sockets will use interface 67.195.81.190
#
# A fatal error has been detected by the Java Runtime Environment:
#
#  SIGSEGV (0xb) at pc=0xae92d654, pid=1992, tid=2831539008
#
# JRE version: 7.0_25-b15
# Java VM: Java HotSpot(TM) Server VM (23.25-b01 mixed mode linux-x86 )
# Problematic frame:
# C  [libnet.so+0x14654]  _fini+0x1d0c
#
# Failed to write core dump. Core dumps have been disabled. To enable core dumping, try "ulimit
-c unlimited" before starting Java again
#
# An error report file with more information is saved as:
# <https://builds.apache.org/job/cayenne-master/cayenneTestConnection=hsql,jdk=JDK%201.7%20(latest),label=Ubuntu/ws/cayenne-server/hs_err_pid1992.log>
#
# If you would like to submit a bug report, please visit:
#   http://bugreport.sun.com/bugreport/crash.jsp
# The crash happened outside the Java Virtual Machine in native code.
# See problematic frame for where to report the bug.
#
Aborted

Results :

Tests run: 160, Failures: 0, Errors: 0, Skipped: 0

[INFO] ------------------------------------------------------------------------
[INFO] Reactor Summary:
[INFO] 
[INFO] Cayenne ........................................... SUCCESS [0.460s]
[INFO] Cayenne Build Tools Parent ........................ SUCCESS [0.010s]
[INFO] Cayenne License and Notice Bundle ................. SUCCESS [1.479s]
[INFO] Common Unit Test Utilities ........................ SUCCESS [1.384s]
[INFO] Cayenne Code Checkers ............................. SUCCESS [0.069s]
[INFO] Cayenne Dependency Injection Container ............ SUCCESS [13.226s]
[INFO] Cayenne Server .................................... FAILURE [54.729s]
[INFO] Cayenne ROP Client ................................ SKIPPED
[INFO] Cayenne Project ................................... SKIPPED
[INFO] Cayenne Tools ..................................... SKIPPED
[INFO] Cayenne Lifecycle Utilities ....................... SKIPPED
[INFO] Cayenne Maven Plugins ............................. SKIPPED
[INFO] Cayenne Maven Plugin .............................. SKIPPED
[INFO] Cayenne Cryptography Extensions ................... SKIPPED
[INFO] Cayenne Joda Extensions ........................... SKIPPED
[INFO] Cayenne DBCP2 Extension ........................... SKIPPED
[INFO] Cayenne Integration Tests Parent .................. SKIPPED
[INFO] Integration Tests - Cayenne Tools ................. SKIPPED
[INFO] Cayenne Modeler Parent ............................ SKIPPED
[INFO] Cayenne WebObjects Compatibility Library .......... SKIPPED
[INFO] Cayenne Modeler ................................... SKIPPED
[INFO] Cayenne Modeler Generic and Windows Extensions .... SKIPPED
[INFO] Cayenne Modeler Generic ........................... SKIPPED
[INFO] Cayenne Modeler Mac OS X Extensions ............... SKIPPED
[INFO] Cayenne Modeler Mac OS X .......................... SKIPPED
[INFO] Cayenne Modeler Windows ........................... SKIPPED
[INFO] Cayenne Modeler Maven Plugin ...................... SKIPPED
[INFO] Cayenne Tutorials ................................. SKIPPED
[INFO] Cayenne Tutorial .................................. SKIPPED
[INFO] Cayenne ROP Server Tutorial ....................... SKIPPED
[INFO] Cayenne ROP Client Tutorial ....................... SKIPPED
[INFO] Cayenne Documenation Parent ....................... SKIPPED
[INFO] Cayenne Documentation ............................. SKIPPED
[INFO] Cayenne Docbook Documentation ..................... SKIPPED
[INFO] Docbook: Cayenne Stylesheets ...................... SKIPPED
[INFO] Docbook: Cayenne Guide ............................ SKIPPED
[INFO] Docbook: Getting Started with Cayenne ............. SKIPPED
[INFO] Docbook: Getting Started with Cayenne ROP ......... SKIPPED
[INFO] Docbook: Cayenne New Features and Upgrade Guide ... SKIPPED
[INFO] Cayenne Release Assembly .......................... SKIPPED
[INFO] ------------------------------------------------------------------------
[INFO] BUILD FAILURE
[INFO] ------------------------------------------------------------------------
[INFO] Total time: 1:12.834s
[INFO] Finished at: Fri Oct 23 12:33:04 UTC 2015
[INFO] Final Memory: 53M/392M
[INFO] ------------------------------------------------------------------------
[ERROR] Failed to execute goal org.apache.maven.plugins:maven-failsafe-plugin:2.17:integration-test
(integration-test) on project cayenne-server: Execution integration-test of goal org.apache.maven.plugins:maven-failsafe-plugin:2.17:integration-test
failed: The forked VM terminated without properly saying goodbye. VM crash or System.exit
called?
[ERROR] Command was /bin/sh -c cd "<https://builds.apache.org/job/cayenne-master/cayenneTestConnection=hsql,jdk=JDK%201.7%20(latest),label=Ubuntu/ws/cayenne-server">
&& /home/jenkins/tools/java/jdk1.7.0_25-32/jre/bin/java -jar '<https://builds.apache.org/job/cayenne-master/cayenneTestConnection=hsql,jdk=JDK%201.7%20(latest),label=Ubuntu/ws/cayenne-server/target/surefire/surefirebooter5704418143203573566.jar'>
'<https://builds.apache.org/job/cayenne-master/cayenneTestConnection=hsql,jdk=JDK%201.7%20(latest),label=Ubuntu/ws/cayenne-server/target/surefire/surefire5526533991570367394tmp'>
'<https://builds.apache.org/job/cayenne-master/cayenneTestConnection=hsql,jdk=JDK%201.7%20(latest),label=Ubuntu/ws/cayenne-server/target/surefire/surefire_08803558412970185103tmp'>
[ERROR] -> [Help 1]
org.apache.maven.lifecycle.LifecycleExecutionException: Failed to execute goal org.apache.maven.plugins:maven-failsafe-plugin:2.17:integration-test
(integration-test) on project cayenne-server: Execution integration-test of goal org.apache.maven.plugins:maven-failsafe-plugin:2.17:integration-test
failed: The forked VM terminated without properly saying goodbye. VM crash or System.exit
called?
Command was /bin/sh -c cd "<https://builds.apache.org/job/cayenne-master/cayenneTestConnection=hsql,jdk=JDK%201.7%20(latest),label=Ubuntu/ws/cayenne-server">
&& /home/jenkins/tools/java/jdk1.7.0_25-32/jre/bin/java -jar '<https://builds.apache.org/job/cayenne-master/cayenneTestConnection=hsql,jdk=JDK%201.7%20(latest),label=Ubuntu/ws/cayenne-server/target/surefire/surefirebooter5704418143203573566.jar'>
'<https://builds.apache.org/job/cayenne-master/cayenneTestConnection=hsql,jdk=JDK%201.7%20(latest),label=Ubuntu/ws/cayenne-server/target/surefire/surefire5526533991570367394tmp'>
'<https://builds.apache.org/job/cayenne-master/cayenneTestConnection=hsql,jdk=JDK%201.7%20(latest),label=Ubuntu/ws/cayenne-server/target/surefire/surefire_08803558412970185103tmp'>
	at org.apache.maven.lifecycle.internal.MojoExecutor.execute(MojoExecutor.java:225)
	at org.apache.maven.lifecycle.internal.MojoExecutor.execute(MojoExecutor.java:153)
	at org.apache.maven.lifecycle.internal.MojoExecutor.execute(MojoExecutor.java:145)
	at org.apache.maven.lifecycle.internal.LifecycleModuleBuilder.buildProject(LifecycleModuleBuilder.java:84)
	at org.apache.maven.lifecycle.internal.LifecycleModuleBuilder.buildProject(LifecycleModuleBuilder.java:59)
	at org.apache.maven.lifecycle.internal.LifecycleStarter.singleThreadedBuild(LifecycleStarter.java:183)
	at org.apache.maven.lifecycle.internal.LifecycleStarter.execute(LifecycleStarter.java:161)
	at org.apache.maven.DefaultMaven.doExecute(DefaultMaven.java:320)
	at org.apache.maven.DefaultMaven.execute(DefaultMaven.java:156)
	at org.apache.maven.cli.MavenCli.execute(MavenCli.java:537)
	at org.apache.maven.cli.MavenCli.doMain(MavenCli.java:196)
	at org.apache.maven.cli.MavenCli.main(MavenCli.java:141)
	at sun.reflect.NativeMethodAccessorImpl.invoke0(Native Method)
	at sun.reflect.NativeMethodAccessorImpl.invoke(NativeMethodAccessorImpl.java:57)
	at sun.reflect.DelegatingMethodAccessorImpl.invoke(DelegatingMethodAccessorImpl.java:43)
	at java.lang.reflect.Method.invoke(Method.java:606)
	at org.codehaus.plexus.classworlds.launcher.Launcher.launchEnhanced(Launcher.java:290)
	at org.codehaus.plexus.classworlds.launcher.Launcher.launch(Launcher.java:230)
	at org.codehaus.plexus.classworlds.launcher.Launcher.mainWithExitCode(Launcher.java:409)
	at org.codehaus.plexus.classworlds.launcher.Launcher.main(Launcher.java:352)
Caused by: org.apache.maven.plugin.PluginExecutionException: Execution integration-test of
goal org.apache.maven.plugins:maven-failsafe-plugin:2.17:integration-test failed: The forked
VM terminated without properly saying goodbye. VM crash or System.exit called?
Command was /bin/sh -c cd "<https://builds.apache.org/job/cayenne-master/cayenneTestConnection=hsql,jdk=JDK%201.7%20(latest),label=Ubuntu/ws/cayenne-server">
&& /home/jenkins/tools/java/jdk1.7.0_25-32/jre/bin/java -jar '<https://builds.apache.org/job/cayenne-master/cayenneTestConnection=hsql,jdk=JDK%201.7%20(latest),label=Ubuntu/ws/cayenne-server/target/surefire/surefirebooter5704418143203573566.jar'>
'<https://builds.apache.org/job/cayenne-master/cayenneTestConnection=hsql,jdk=JDK%201.7%20(latest),label=Ubuntu/ws/cayenne-server/target/surefire/surefire5526533991570367394tmp'>
'<https://builds.apache.org/job/cayenne-master/cayenneTestConnection=hsql,jdk=JDK%201.7%20(latest),label=Ubuntu/ws/cayenne-server/target/surefire/surefire_08803558412970185103tmp'>
	at org.apache.maven.plugin.DefaultBuildPluginManager.executeMojo(DefaultBuildPluginManager.java:110)
	at org.apache.maven.lifecycle.internal.MojoExecutor.execute(MojoExecutor.java:209)
	... 19 more
Caused by: java.lang.RuntimeException: The forked VM terminated without properly saying goodbye.
VM crash or System.exit called?
Command was /bin/sh -c cd "<https://builds.apache.org/job/cayenne-master/cayenneTestConnection=hsql,jdk=JDK%201.7%20(latest),label=Ubuntu/ws/cayenne-server">
&& /home/jenkins/tools/java/jdk1.7.0_25-32/jre/bin/java -jar '<https://builds.apache.org/job/cayenne-master/cayenneTestConnection=hsql,jdk=JDK%201.7%20(latest),label=Ubuntu/ws/cayenne-server/target/surefire/surefirebooter5704418143203573566.jar'>
'<https://builds.apache.org/job/cayenne-master/cayenneTestConnection=hsql,jdk=JDK%201.7%20(latest),label=Ubuntu/ws/cayenne-server/target/surefire/surefire5526533991570367394tmp'>
'<https://builds.apache.org/job/cayenne-master/cayenneTestConnection=hsql,jdk=JDK%201.7%20(latest),label=Ubuntu/ws/cayenne-server/target/surefire/surefire_08803558412970185103tmp'>
	at org.apache.maven.plugin.surefire.booterclient.ForkStarter.fork(ForkStarter.java:485)
	at org.apache.maven.plugin.surefire.booterclient.ForkStarter.fork(ForkStarter.java:352)
	at org.apache.maven.plugin.surefire.booterclient.ForkStarter.run(ForkStarter.java:158)
	at org.apache.maven.plugin.surefire.AbstractSurefireMojo.executeProvider(AbstractSurefireMojo.java:967)
	at org.apache.maven.plugin.surefire.AbstractSurefireMojo.executeAfterPreconditionsChecked(AbstractSurefireMojo.java:831)
	at org.apache.maven.plugin.surefire.AbstractSurefireMojo.execute(AbstractSurefireMojo.java:729)
	at org.apache.maven.plugin.DefaultBuildPluginManager.executeMojo(DefaultBuildPluginManager.java:101)
	... 20 more
[ERROR] 
[ERROR] Re-run Maven using the -X switch to enable full debug logging.
[ERROR] 
[ERROR] For more information about the errors and possible solutions, please read the following
articles:
[ERROR] [Help 1] http://cwiki.apache.org/confluence/display/MAVEN/PluginExecutionException
[ERROR] 
[ERROR] After correcting the problems, you can resume the build with the command
[ERROR]   mvn <goals> -rf :cayenne-server
Build step 'Invoke top-level Maven targets' marked build as failure
Recording test results

Mime
View raw message