cayenne-commits mailing list archives

Site index · List index
Message view « Date » · « Thread »
Top « Date » · « Thread »
From Apache Jenkins Server <jenk...@builds.apache.org>
Subject Build failed in Jenkins: cayenne-master » derby,latest1.8,Ubuntu #334
Date Tue, 24 May 2016 16:33:29 GMT
See <https://builds.apache.org/job/cayenne-master/cayenneTestConnection=derby,jdk=latest1.8,label=Ubuntu/334/changes>

Changes:

[s.kolbachev] make configuration resources transient, as we shouldn't send them in

------------------------------------------
[...truncated 67124 lines...]
	at org.apache.cayenne.di.spi.FieldInjectingProvider.injectMember(FieldInjectingProvider.java:68)
	at org.apache.cayenne.di.spi.FieldInjectingProvider.injectMembers(FieldInjectingProvider.java:59)
	at org.apache.cayenne.di.spi.FieldInjectingProvider.get(FieldInjectingProvider.java:44)
	at org.apache.cayenne.di.spi.DefaultScopeProvider.get(DefaultScopeProvider.java:50)
	at org.apache.cayenne.di.spi.DefaultInjector.getInstance(DefaultInjector.java:134)
	at org.apache.cayenne.configuration.rop.client.LocalClientServerChannelProvider.get(LocalClientServerChannelProvider.java:45)
	at org.apache.cayenne.configuration.rop.client.LocalClientServerChannelProvider.get(LocalClientServerChannelProvider.java:35)
	at org.apache.cayenne.di.spi.CustomProvidersProvider.get(CustomProvidersProvider.java:39)
	at org.apache.cayenne.di.spi.FieldInjectingProvider.get(FieldInjectingProvider.java:43)
	at org.apache.cayenne.di.spi.DefaultScopeProvider.get(DefaultScopeProvider.java:50)
	at org.apache.cayenne.remote.service.ProtostuffLocalConnectionProvider.get(ProtostuffLocalConnectionProvider.java:36)
	at org.apache.cayenne.remote.service.ProtostuffLocalConnectionProvider.get(ProtostuffLocalConnectionProvider.java:29)
	at org.apache.cayenne.di.spi.CustomProvidersProvider.get(CustomProvidersProvider.java:39)
	at org.apache.cayenne.di.spi.FieldInjectingProvider.get(FieldInjectingProvider.java:43)
	at org.apache.cayenne.di.spi.DefaultScopeProvider.get(DefaultScopeProvider.java:50)
	at org.apache.cayenne.di.spi.DefaultInjector.getInstance(DefaultInjector.java:139)
	at org.apache.cayenne.di.spi.FieldInjectingProvider.value(FieldInjectingProvider.java:105)
	at org.apache.cayenne.di.spi.FieldInjectingProvider.injectMember(FieldInjectingProvider.java:68)
	at org.apache.cayenne.di.spi.FieldInjectingProvider.injectMembers(FieldInjectingProvider.java:59)
	at org.apache.cayenne.di.spi.FieldInjectingProvider.get(FieldInjectingProvider.java:44)
	at org.apache.cayenne.di.spi.CustomProvidersProvider.get(CustomProvidersProvider.java:39)
	at org.apache.cayenne.di.spi.FieldInjectingProvider.get(FieldInjectingProvider.java:43)
	at org.apache.cayenne.di.spi.DefaultScopeProvider.get(DefaultScopeProvider.java:50)
	at org.apache.cayenne.di.spi.DefaultInjector.getInstance(DefaultInjector.java:139)
	at org.apache.cayenne.di.spi.FieldInjectingProvider.value(FieldInjectingProvider.java:105)
	at org.apache.cayenne.di.spi.FieldInjectingProvider.injectMember(FieldInjectingProvider.java:68)
	at org.apache.cayenne.di.spi.FieldInjectingProvider.injectMembers(FieldInjectingProvider.java:59)
	at org.apache.cayenne.di.spi.FieldInjectingProvider.get(FieldInjectingProvider.java:44)
	at org.apache.cayenne.di.spi.DefaultScopeProvider.get(DefaultScopeProvider.java:50)
	at org.apache.cayenne.di.spi.DefaultInjector.getInstance(DefaultInjector.java:134)
	at org.apache.cayenne.configuration.CayenneRuntime.newContext(CayenneRuntime.java:134)
	at org.apache.cayenne.rop.protostuff.RuntimeBase.setUpRuntimes(RuntimeBase.java:71)
	at sun.reflect.NativeMethodAccessorImpl.invoke0(Native Method)
	at sun.reflect.NativeMethodAccessorImpl.invoke(NativeMethodAccessorImpl.java:62)
	at sun.reflect.DelegatingMethodAccessorImpl.invoke(DelegatingMethodAccessorImpl.java:43)
	at java.lang.reflect.Method.invoke(Method.java:498)
	at org.junit.runners.model.FrameworkMethod$1.runReflectiveCall(FrameworkMethod.java:47)
	at org.junit.internal.runners.model.ReflectiveCallable.run(ReflectiveCallable.java:12)
	at org.junit.runners.model.FrameworkMethod.invokeExplosively(FrameworkMethod.java:44)
	at org.junit.internal.runners.statements.RunBefores.evaluate(RunBefores.java:24)
	at org.junit.internal.runners.statements.RunAfters.evaluate(RunAfters.java:27)
	at org.junit.runners.ParentRunner.runLeaf(ParentRunner.java:271)
	at org.junit.runners.BlockJUnit4ClassRunner.runChild(BlockJUnit4ClassRunner.java:70)
	at org.junit.runners.BlockJUnit4ClassRunner.runChild(BlockJUnit4ClassRunner.java:50)
	at org.junit.runners.ParentRunner$3.run(ParentRunner.java:238)
	at org.junit.runners.ParentRunner$1.schedule(ParentRunner.java:63)
	at org.junit.runners.ParentRunner.runChildren(ParentRunner.java:236)
	at org.junit.runners.ParentRunner.access$000(ParentRunner.java:53)
	at org.junit.runners.ParentRunner$2.evaluate(ParentRunner.java:229)
	at org.junit.runners.ParentRunner.run(ParentRunner.java:309)
	at org.apache.maven.surefire.junit4.JUnit4Provider.execute(JUnit4Provider.java:264)
	at org.apache.maven.surefire.junit4.JUnit4Provider.executeTestSet(JUnit4Provider.java:153)
	at org.apache.maven.surefire.junit4.JUnit4Provider.invoke(JUnit4Provider.java:124)
	at org.apache.maven.surefire.booter.ForkedBooter.invokeProviderInSameClassLoader(ForkedBooter.java:200)
	at org.apache.maven.surefire.booter.ForkedBooter.runSuitesInProcess(ForkedBooter.java:153)
	at org.apache.maven.surefire.booter.ForkedBooter.main(ForkedBooter.java:103)
Caused by: java.lang.ClassNotFoundException: org.hsqldb.jdbcDriver
	at java.net.URLClassLoader.findClass(URLClassLoader.java:381)
	at java.lang.ClassLoader.loadClass(ClassLoader.java:424)
	at sun.misc.Launcher$AppClassLoader.loadClass(Launcher.java:331)
	at java.lang.ClassLoader.loadClass(ClassLoader.java:357)
	at java.lang.Class.forName0(Native Method)
	at java.lang.Class.forName(Class.java:348)
	at org.apache.cayenne.di.spi.DefaultAdhocObjectFactory.getJavaClass(DefaultAdhocObjectFactory.java:93)
	at org.apache.cayenne.di.spi.DefaultAdhocObjectFactory.newInstance(DefaultAdhocObjectFactory.java:60)
	at org.apache.cayenne.configuration.server.XMLPoolingDataSourceFactory.getDataSource(XMLPoolingDataSourceFactory.java:70)
	at org.apache.cayenne.configuration.server.DelegatingDataSourceFactory.getDataSource(DelegatingDataSourceFactory.java:68)
	at org.apache.cayenne.configuration.server.DefaultDataNodeFactory.createDataNode(DefaultDataNodeFactory.java:79)
	at org.apache.cayenne.configuration.server.DataDomainProvider.addDataNode(DataDomainProvider.java:172)
	at org.apache.cayenne.configuration.server.DataDomainProvider.createAndInitDataDomain(DataDomainProvider.java:138)
	at org.apache.cayenne.configuration.server.DataDomainProvider.get(DataDomainProvider.java:91)
	at org.apache.cayenne.configuration.server.DataDomainProvider.get(DataDomainProvider.java:56)
	at org.apache.cayenne.di.spi.CustomProvidersProvider.get(CustomProvidersProvider.java:39)
	at org.apache.cayenne.di.spi.FieldInjectingProvider.get(FieldInjectingProvider.java:43)
	at org.apache.cayenne.di.spi.DefaultScopeProvider.get(DefaultScopeProvider.java:50)
	at org.apache.cayenne.di.spi.DefaultInjector.getInstance(DefaultInjector.java:139)
	at org.apache.cayenne.di.spi.FieldInjectingProvider.value(FieldInjectingProvider.java:105)
	at org.apache.cayenne.di.spi.FieldInjectingProvider.injectMember(FieldInjectingProvider.java:68)
	at org.apache.cayenne.di.spi.FieldInjectingProvider.injectMembers(FieldInjectingProvider.java:59)
	at org.apache.cayenne.di.spi.FieldInjectingProvider.get(FieldInjectingProvider.java:44)
	at org.apache.cayenne.di.spi.DefaultScopeProvider.get(DefaultScopeProvider.java:50)
	at org.apache.cayenne.di.spi.DefaultInjector.getInstance(DefaultInjector.java:134)
	at org.apache.cayenne.configuration.rop.client.LocalClientServerChannelProvider.get(LocalClientServerChannelProvider.java:45)
	at org.apache.cayenne.configuration.rop.client.LocalClientServerChannelProvider.get(LocalClientServerChannelProvider.java:35)
	at org.apache.cayenne.di.spi.CustomProvidersProvider.get(CustomProvidersProvider.java:39)
	at org.apache.cayenne.di.spi.FieldInjectingProvider.get(FieldInjectingProvider.java:43)
	at org.apache.cayenne.di.spi.DefaultScopeProvider.get(DefaultScopeProvider.java:50)
	at org.apache.cayenne.remote.service.ProtostuffLocalConnectionProvider.get(ProtostuffLocalConnectionProvider.java:36)
	at org.apache.cayenne.remote.service.ProtostuffLocalConnectionProvider.get(ProtostuffLocalConnectionProvider.java:29)
	at org.apache.cayenne.di.spi.CustomProvidersProvider.get(CustomProvidersProvider.java:39)
	at org.apache.cayenne.di.spi.FieldInjectingProvider.get(FieldInjectingProvider.java:43)
	at org.apache.cayenne.di.spi.DefaultScopeProvider.get(DefaultScopeProvider.java:50)
	at org.apache.cayenne.di.spi.DefaultInjector.getInstance(DefaultInjector.java:139)
	at org.apache.cayenne.di.spi.FieldInjectingProvider.value(FieldInjectingProvider.java:105)
	at org.apache.cayenne.di.spi.FieldInjectingProvider.injectMember(FieldInjectingProvider.java:68)
	at org.apache.cayenne.di.spi.FieldInjectingProvider.injectMembers(FieldInjectingProvider.java:59)
	at org.apache.cayenne.di.spi.FieldInjectingProvider.get(FieldInjectingProvider.java:44)
	at org.apache.cayenne.di.spi.CustomProvidersProvider.get(CustomProvidersProvider.java:39)
	at org.apache.cayenne.di.spi.FieldInjectingProvider.get(FieldInjectingProvider.java:43)
	at org.apache.cayenne.di.spi.DefaultScopeProvider.get(DefaultScopeProvider.java:50)
	at org.apache.cayenne.di.spi.DefaultInjector.getInstance(DefaultInjector.java:139)
	at org.apache.cayenne.di.spi.FieldInjectingProvider.value(FieldInjectingProvider.java:105)
	at org.apache.cayenne.di.spi.FieldInjectingProvider.injectMember(FieldInjectingProvider.java:68)
	at org.apache.cayenne.di.spi.FieldInjectingProvider.injectMembers(FieldInjectingProvider.java:59)
	at org.apache.cayenne.di.spi.FieldInjectingProvider.get(FieldInjectingProvider.java:44)
	at org.apache.cayenne.di.spi.DefaultScopeProvider.get(DefaultScopeProvider.java:50)
	at org.apache.cayenne.di.spi.DefaultInjector.getInstance(DefaultInjector.java:134)
	at org.apache.cayenne.configuration.CayenneRuntime.newContext(CayenneRuntime.java:134)
	at org.apache.cayenne.rop.protostuff.RuntimeBase.setUpRuntimes(RuntimeBase.java:71)
	at sun.reflect.NativeMethodAccessorImpl.invoke0(Native Method)
	at sun.reflect.NativeMethodAccessorImpl.invoke(NativeMethodAccessorImpl.java:62)
	at sun.reflect.DelegatingMethodAccessorImpl.invoke(DelegatingMethodAccessorImpl.java:43)
	at java.lang.reflect.Method.invoke(Method.java:498)
	at org.junit.runners.model.FrameworkMethod$1.runReflectiveCall(FrameworkMethod.java:47)
	at org.junit.internal.runners.model.ReflectiveCallable.run(ReflectiveCallable.java:12)
	at org.junit.runners.model.FrameworkMethod.invokeExplosively(FrameworkMethod.java:44)
	at org.junit.internal.runners.statements.RunBefores.evaluate(RunBefores.java:24)
	at org.junit.internal.runners.statements.RunAfters.evaluate(RunAfters.java:27)
	at org.junit.runners.ParentRunner.runLeaf(ParentRunner.java:271)
	at org.junit.runners.BlockJUnit4ClassRunner.runChild(BlockJUnit4ClassRunner.java:70)
	at org.junit.runners.BlockJUnit4ClassRunner.runChild(BlockJUnit4ClassRunner.java:50)
	at org.junit.runners.ParentRunner$3.run(ParentRunner.java:238)
	at org.junit.runners.ParentRunner$1.schedule(ParentRunner.java:63)
	at org.junit.runners.ParentRunner.runChildren(ParentRunner.java:236)
	at org.junit.runners.ParentRunner.access$000(ParentRunner.java:53)
	at org.junit.runners.ParentRunner$2.evaluate(ParentRunner.java:229)
	at org.junit.runners.ParentRunner.run(ParentRunner.java:309)
	at org.apache.maven.surefire.junit4.JUnit4Provider.execute(JUnit4Provider.java:264)
	at org.apache.maven.surefire.junit4.JUnit4Provider.executeTestSet(JUnit4Provider.java:153)
	at org.apache.maven.surefire.junit4.JUnit4Provider.invoke(JUnit4Provider.java:124)
	at org.apache.maven.surefire.booter.ForkedBooter.invokeProviderInSameClassLoader(ForkedBooter.java:200)
	at org.apache.maven.surefire.booter.ForkedBooter.runSuitesInProcess(ForkedBooter.java:153)
	at org.apache.maven.surefire.booter.ForkedBooter.main(ForkedBooter.java:103)

testSerializationWithPrefetch2(org.apache.cayenne.rop.protostuff.ProtostuffROPSerializationServiceIT)
 Time elapsed: 0.037 sec  <<< ERROR!
java.lang.NullPointerException: null
	at org.apache.cayenne.rop.protostuff.ProtostuffROPSerializationServiceIT.setDown(ProtostuffROPSerializationServiceIT.java:56)


Results :

Tests in error: 
  ProtostuffROPSerializationServiceIT>RuntimeBase.setUpRuntimes:71 » DataDomainLoad
  ProtostuffROPSerializationServiceIT.setDown:56 NullPointer
  ProtostuffROPSerializationServiceIT>RuntimeBase.setUpRuntimes:71 » DataDomainLoad
  ProtostuffROPSerializationServiceIT.setDown:56 NullPointer

Tests run: 4, Failures: 0, Errors: 4, Skipped: 0

[INFO] 
[INFO] --- maven-failsafe-plugin:2.17:verify (integration-test) @ cayenne-protostuff ---
[INFO] Failsafe report directory: <https://builds.apache.org/job/cayenne-master/cayenneTestConnection=derby,jdk=latest1.8,label=Ubuntu/ws/cayenne-protostuff/target/failsafe-reports>
[INFO] ------------------------------------------------------------------------
[INFO] Reactor Summary:
[INFO] 
[INFO] Cayenne ........................................... SUCCESS [0.562s]
[INFO] Cayenne Build Tools Parent ........................ SUCCESS [0.008s]
[INFO] Cayenne License and Notice Bundle ................. SUCCESS [2.305s]
[INFO] Common Unit Test Utilities ........................ SUCCESS [2.042s]
[INFO] Cayenne Code Checkers ............................. SUCCESS [0.092s]
[INFO] Cayenne Dependency Injection Container ............ SUCCESS [16.600s]
[INFO] Cayenne Server .................................... SUCCESS [5:08.290s]
[INFO] Cayenne ROP Client ................................ SUCCESS [2:44.748s]
[INFO] Cayenne Project ................................... SUCCESS [9.017s]
[INFO] Cayenne Tools ..................................... SUCCESS [15.871s]
[INFO] Cayenne Lifecycle Utilities ....................... SUCCESS [12.905s]
[INFO] Cayenne Maven Plugins ............................. SUCCESS [0.428s]
[INFO] Cayenne Maven Plugin .............................. SUCCESS [21.470s]
[INFO] Cayenne Cryptography Extensions ................... SUCCESS [9.215s]
[INFO] Cayenne Joda Extensions ........................... SUCCESS [6.038s]
[INFO] Cayenne DBCP2 Extension ........................... SUCCESS [2.342s]
[INFO] Cayenne Integration Tests Parent .................. SUCCESS [0.003s]
[INFO] Integration Tests - Cayenne Tools ................. SUCCESS [2.532s]
[INFO] Cayenne Modeler Parent ............................ SUCCESS [0.014s]
[INFO] Cayenne WebObjects Compatibility Library .......... SUCCESS [8.974s]
[INFO] Cayenne Modeler ................................... SUCCESS [21.029s]
[INFO] Cayenne Modeler Generic and Windows Extensions .... SUCCESS [2.220s]
[INFO] Cayenne Modeler Generic ........................... SUCCESS [0.639s]
[INFO] Cayenne Modeler Mac OS X Extensions ............... SUCCESS [2.600s]
[INFO] Cayenne Modeler Mac OS X .......................... SUCCESS [0.900s]
[INFO] Cayenne Modeler Windows ........................... SUCCESS [0.694s]
[INFO] Cayenne Modeler Maven Plugin ...................... SUCCESS [3.826s]
[INFO] Cayenne Tutorials ................................. SUCCESS [0.003s]
[INFO] Cayenne Tutorial .................................. SUCCESS [1.140s]
[INFO] Cayenne ROP Server Tutorial ....................... SUCCESS [2.126s]
[INFO] Cayenne ROP Client Tutorial ....................... SUCCESS [1.422s]
[INFO] Cayenne Documenation Parent ....................... SUCCESS [0.004s]
[INFO] Cayenne Documentation ............................. SUCCESS [35.437s]
[INFO] Cayenne Docbook Documentation ..................... SUCCESS [1.308s]
[INFO] Docbook: Cayenne Stylesheets ...................... SUCCESS [0.141s]
[INFO] Docbook: Cayenne Guide ............................ SUCCESS [14.333s]
[INFO] Docbook: Getting Started with Cayenne ............. SUCCESS [6.425s]
[INFO] Docbook: Getting Started with Cayenne ROP ......... SUCCESS [2.585s]
[INFO] Docbook: Cayenne New Features and Upgrade Guide ... SUCCESS [2.005s]
[INFO] Cayenne Java8 Extensions .......................... SUCCESS [5.156s]
[INFO] Cayenne Protostuff Extension ...................... FAILURE [8.362s]
[INFO] Cayenne Release Assembly .......................... SKIPPED
[INFO] ------------------------------------------------------------------------
[INFO] BUILD FAILURE
[INFO] ------------------------------------------------------------------------
[INFO] Total time: 11:38.134s
[INFO] Finished at: Tue May 24 16:33:23 UTC 2016
[INFO] Final Memory: 224M/488M
[INFO] ------------------------------------------------------------------------
[ERROR] Failed to execute goal org.apache.maven.plugins:maven-failsafe-plugin:2.17:verify
(integration-test) on project cayenne-protostuff: There are test failures.
[ERROR] 
[ERROR] Please refer to <https://builds.apache.org/job/cayenne-master/cayenneTestConnection=derby,jdk=latest1.8,label=Ubuntu/ws/cayenne-protostuff/target/failsafe-reports>
for the individual test results.
[ERROR] -> [Help 1]
org.apache.maven.lifecycle.LifecycleExecutionException: Failed to execute goal org.apache.maven.plugins:maven-failsafe-plugin:2.17:verify
(integration-test) on project cayenne-protostuff: There are test failures.

Please refer to <https://builds.apache.org/job/cayenne-master/cayenneTestConnection=derby,jdk=latest1.8,label=Ubuntu/ws/cayenne-protostuff/target/failsafe-reports>
for the individual test results.
	at org.apache.maven.lifecycle.internal.MojoExecutor.execute(MojoExecutor.java:213)
	at org.apache.maven.lifecycle.internal.MojoExecutor.execute(MojoExecutor.java:153)
	at org.apache.maven.lifecycle.internal.MojoExecutor.execute(MojoExecutor.java:145)
	at org.apache.maven.lifecycle.internal.LifecycleModuleBuilder.buildProject(LifecycleModuleBuilder.java:84)
	at org.apache.maven.lifecycle.internal.LifecycleModuleBuilder.buildProject(LifecycleModuleBuilder.java:59)
	at org.apache.maven.lifecycle.internal.LifecycleStarter.singleThreadedBuild(LifecycleStarter.java:183)
	at org.apache.maven.lifecycle.internal.LifecycleStarter.execute(LifecycleStarter.java:161)
	at org.apache.maven.DefaultMaven.doExecute(DefaultMaven.java:320)
	at org.apache.maven.DefaultMaven.execute(DefaultMaven.java:156)
	at org.apache.maven.cli.MavenCli.execute(MavenCli.java:537)
	at org.apache.maven.cli.MavenCli.doMain(MavenCli.java:196)
	at org.apache.maven.cli.MavenCli.main(MavenCli.java:141)
	at sun.reflect.NativeMethodAccessorImpl.invoke0(Native Method)
	at sun.reflect.NativeMethodAccessorImpl.invoke(NativeMethodAccessorImpl.java:62)
	at sun.reflect.DelegatingMethodAccessorImpl.invoke(DelegatingMethodAccessorImpl.java:43)
	at java.lang.reflect.Method.invoke(Method.java:498)
	at org.codehaus.plexus.classworlds.launcher.Launcher.launchEnhanced(Launcher.java:290)
	at org.codehaus.plexus.classworlds.launcher.Launcher.launch(Launcher.java:230)
	at org.codehaus.plexus.classworlds.launcher.Launcher.mainWithExitCode(Launcher.java:409)
	at org.codehaus.plexus.classworlds.launcher.Launcher.main(Launcher.java:352)
Caused by: org.apache.maven.plugin.MojoFailureException: There are test failures.

Please refer to <https://builds.apache.org/job/cayenne-master/cayenneTestConnection=derby,jdk=latest1.8,label=Ubuntu/ws/cayenne-protostuff/target/failsafe-reports>
for the individual test results.
	at org.apache.maven.plugin.surefire.SurefireHelper.reportExecution(SurefireHelper.java:82)
	at org.apache.maven.plugin.failsafe.VerifyMojo.execute(VerifyMojo.java:194)
	at org.apache.maven.plugin.DefaultBuildPluginManager.executeMojo(DefaultBuildPluginManager.java:101)
	at org.apache.maven.lifecycle.internal.MojoExecutor.execute(MojoExecutor.java:209)
	... 19 more
[ERROR] 
[ERROR] Re-run Maven using the -X switch to enable full debug logging.
[ERROR] 
[ERROR] For more information about the errors and possible solutions, please read the following
articles:
[ERROR] [Help 1] http://cwiki.apache.org/confluence/display/MAVEN/MojoFailureException
[ERROR] 
[ERROR] After correcting the problems, you can resume the build with the command
[ERROR]   mvn <goals> -rf :cayenne-protostuff
Build step 'Invoke top-level Maven targets' marked build as failure
Recording test results

Mime
View raw message