cayenne-commits mailing list archives

Site index · List index
Message view « Date » · « Thread »
Top « Date » · « Thread »
From Apache Jenkins Server <jenk...@builds.apache.org>
Subject Build failed in Jenkins: cayenne-31 » derby,JDK 1.5 (latest),Ubuntu #134
Date Thu, 19 May 2016 11:15:20 GMT
See <https://builds.apache.org/job/cayenne-31/cayenneTestConnection=derby,jdk=JDK%201.5%20(latest),label=Ubuntu/134/changes>

Changes:

[andrus] CAY-2084 ObjectIdQuery - no cache access polymorphism

[andrus] CAY-2084 ObjectIdQuery - no cache access polymorphism

[andrus] CAY-2084 ObjectIdQuery - no cache access polymorphism

------------------------------------------
[...truncated 10869 lines...]
890/1292 KB   
892/1292 KB   
896/1292 KB   
900/1292 KB   
904/1292 KB   
908/1292 KB   
912/1292 KB   
916/1292 KB   
916/1292 KB   
920/1292 KB   
924/1292 KB   
928/1292 KB   
932/1292 KB   
936/1292 KB   
940/1292 KB   
944/1292 KB   
948/1292 KB   
952/1292 KB   
956/1292 KB   
960/1292 KB   
964/1292 KB   
968/1292 KB   
972/1292 KB   
972/1292 KB   
974/1292 KB   
975/1292 KB   
977/1292 KB   
981/1292 KB   
984/1292 KB   
985/1292 KB   
989/1292 KB   
992/1292 KB   
994/1292 KB   
998/1292 KB   
998/1292 KB   
999/1292 KB   
1003/1292 KB   
1004/1292 KB   
1005/1292 KB   
1009/1292 KB   
1012/1292 KB   
1013/1292 KB   
1015/1292 KB   
1019/1292 KB   
1023/1292 KB   
1023/1292 KB   
1027/1292 KB   
1029/1292 KB   
1032/1292 KB   
1036/1292 KB   
1037/1292 KB   
1041/1292 KB   
1045/1292 KB   
1049/1292 KB   
1052/1292 KB   
1056/1292 KB   
1060/1292 KB   
1060/1292 KB   
1063/1292 KB   
1066/1292 KB   
1069/1292 KB   
1070/1292 KB   
1071/1292 KB   
1074/1292 KB   
1078/1292 KB   
1080/1292 KB   
1081/1292 KB   
1085/1292 KB   
1086/1292 KB   
1087/1292 KB   
1091/1292 KB   
1094/1292 KB   
1097/1292 KB   
1101/1292 KB   
1103/1292 KB   
1107/1292 KB   
1111/1292 KB   
1111/1292 KB   
1115/1292 KB   
1119/1292 KB   
1123/1292 KB   
1127/1292 KB   
1131/1292 KB   
1135/1292 KB   
1139/1292 KB   
1142/1292 KB   
1145/1292 KB   
1148/1292 KB   
1152/1292 KB   
1156/1292 KB   
1159/1292 KB   
1163/1292 KB   
1167/1292 KB   
1171/1292 KB   
1175/1292 KB   
1179/1292 KB   
1182/1292 KB   
1186/1292 KB   
1190/1292 KB   
1194/1292 KB   
1198/1292 KB   
1202/1292 KB   
1206/1292 KB   
1210/1292 KB   
1214/1292 KB   
1218/1292 KB   
1222/1292 KB   
1226/1292 KB   
1230/1292 KB   
1234/1292 KB   
1235/1292 KB   
1237/1292 KB   
1241/1292 KB   
1241/1292 KB   
1243/1292 KB   
1247/1292 KB   
1250/1292 KB   
1251/1292 KB   
1255/1292 KB   
1255/1292 KB   
1257/1292 KB   
1261/1292 KB   
1265/1292 KB   
1269/1292 KB   
1273/1292 KB   
1275/1292 KB   
1276/1292 KB   
1278/1292 KB   
1282/1292 KB   
1286/1292 KB   
1290/1292 KB   
1292/1292 KB   
               
Downloaded: http://maven.objectstyle.org/nexus/content/groups/cayenne-deps/org/apache/ant/ant/1.7.1/ant-1.7.1.jar
(1292 KB at 1050.4 KB/sec)
[INFO] Executing tasks
[INFO] Executed tasks
[INFO] 
[INFO] --- maven-resources-plugin:2.4.3:resources (default-resources) @ cayenne-jdk1.5-unpublished
---
[INFO] Using 'UTF-8' encoding to copy filtered resources.
[INFO] Copying 16 resources
[INFO] 
[INFO] --- maven-compiler-plugin:2.3.2:compile (default-compile) @ cayenne-jdk1.5-unpublished
---
[WARNING] File encoding has not been set, using platform encoding ISO-8859-1, i.e. build is
platform dependent!
[INFO] Compiling 942 source files to <https://builds.apache.org/job/cayenne-31/cayenneTestConnection=derby,jdk=JDK%201.5%20(latest),label=Ubuntu/ws/framework/cayenne-jdk1.5-unpublished/target/classes>
[INFO] 
[INFO] --- maven-resources-plugin:2.4.3:testResources (default-testResources) @ cayenne-jdk1.5-unpublished
---
[INFO] Using 'UTF-8' encoding to copy filtered resources.
[INFO] Copying 96 resources
[INFO] 
[INFO] --- maven-compiler-plugin:2.3.2:testCompile (default-testCompile) @ cayenne-jdk1.5-unpublished
---
[WARNING] File encoding has not been set, using platform encoding ISO-8859-1, i.e. build is
platform dependent!
[INFO] Compiling 959 source files to <https://builds.apache.org/job/cayenne-31/cayenneTestConnection=derby,jdk=JDK%201.5%20(latest),label=Ubuntu/ws/framework/cayenne-jdk1.5-unpublished/target/test-classes>
[INFO] -------------------------------------------------------------
[ERROR] COMPILATION ERROR : 
[INFO] -------------------------------------------------------------
[ERROR] <https://builds.apache.org/job/cayenne-31/cayenneTestConnection=derby,jdk=JDK%201.5%20(latest),label=Ubuntu/ws/framework/cayenne-jdk1.5-unpublished/src/test/java/org/apache/cayenne/access/DataContextObjectIdQuery_PolymorphicTest.java>:[55,25]
method does not override a method from its superclass
[ERROR] <https://builds.apache.org/job/cayenne-31/cayenneTestConnection=derby,jdk=JDK%201.5%20(latest),label=Ubuntu/ws/framework/cayenne-jdk1.5-unpublished/src/test/java/org/apache/cayenne/access/DataContextObjectIdQuery_PolymorphicTest.java>:[76,25]
method does not override a method from its superclass
[INFO] 2 errors 
[INFO] -------------------------------------------------------------
[INFO] ------------------------------------------------------------------------
[INFO] Reactor Summary:
[INFO] 
[INFO] Cayenne ........................................... SUCCESS [11.380s]
[INFO] Common Unit Test Utilities ........................ SUCCESS [35.641s]
[INFO] Cayenne Internal Build Plugin ..................... SUCCESS [48.464s]
[INFO] Cayenne Build Tools Parent ........................ SUCCESS [0.006s]
[INFO] Cayenne License and Notice Bundle ................. SUCCESS [8.226s]
[INFO] Cayenne Dependency Injection Container ............ SUCCESS [2.841s]
[INFO] Cayenne Java 1.5 Unpublished ...................... FAILURE [41.369s]
[INFO] Cayenne WebObjects Compatibility Library .......... SKIPPED
[INFO] Cayenne Aggregated Server Jar ..................... SKIPPED
[INFO] Cayenne Aggregated Client Jar ..................... SKIPPED
[INFO] Cayenne Project ................................... SKIPPED
[INFO] Cayenne Tools ..................................... SKIPPED
[INFO] Library: cayenne-lifecycle ........................ SKIPPED
[INFO] Cayenne Maven Plugin .............................. SKIPPED
[INFO] Cayenne Framework Aggregator Project .............. SKIPPED
[INFO] Cayenne Integration Tests Parent .................. SKIPPED
[INFO] Integration Tests - Cayenne Runtime ............... SKIPPED
[INFO] Integration Tests - Cayenne Tools ................. SKIPPED
[INFO] Cayenne Modeler ................................... SKIPPED
[INFO] Cayenne Modeler Maven Plugin ...................... SKIPPED
[INFO] Cayenne Modeler Generic and Windows Extensions .... SKIPPED
[INFO] Cayenne Modeler Generic ........................... SKIPPED
[INFO] Cayenne Modeler Mac OS X Extensions ............... SKIPPED
[INFO] Cayenne Modeler Mac OS X .......................... SKIPPED
[INFO] Cayenne Modeler Mac OS X - Old Apple Java ......... SKIPPED
[INFO] Cayenne Modeler Windows ........................... SKIPPED
[INFO] Cayenne Modeler Parent ............................ SKIPPED
[INFO] Cayenne Tutorial .................................. SKIPPED
[INFO] Cayenne ROP Server Tutorial ....................... SKIPPED
[INFO] Cayenne ROP Client Tutorial ....................... SKIPPED
[INFO] Cayenne Tutorials ................................. SKIPPED
[INFO] Cayenne Documentation ............................. SKIPPED
[INFO] Cayenne Documenation Parent ....................... SKIPPED
[INFO] Cayenne Docbook Documentation ..................... SKIPPED
[INFO] Docbook: Cayenne Stylesheets ...................... SKIPPED
[INFO] Docbook: Cayenne Guide ............................ SKIPPED
[INFO] Docbook: Getting Started with Cayenne ............. SKIPPED
[INFO] Docbook: Getting Started with Cayenne ROP ......... SKIPPED
[INFO] Docbook: Cayenne New Features and Upgrade Guide ... SKIPPED
[INFO] Cayenne Release Assembly .......................... SKIPPED
[INFO] ------------------------------------------------------------------------
[INFO] BUILD FAILURE
[INFO] ------------------------------------------------------------------------
[INFO] Total time: 2:34.722s
[INFO] Finished at: Thu May 19 11:15:24 UTC 2016
[INFO] Final Memory: 22M/110M
[INFO] ------------------------------------------------------------------------
[ERROR] Failed to execute goal org.apache.maven.plugins:maven-compiler-plugin:2.3.2:testCompile
(default-testCompile) on project cayenne-jdk1.5-unpublished: Compilation failure: Compilation
failure:
[ERROR] <https://builds.apache.org/job/cayenne-31/cayenneTestConnection=derby,jdk=JDK%201.5%20(latest),label=Ubuntu/ws/framework/cayenne-jdk1.5-unpublished/src/test/java/org/apache/cayenne/access/DataContextObjectIdQuery_PolymorphicTest.java>:[55,25]
method does not override a method from its superclass
[ERROR] <https://builds.apache.org/job/cayenne-31/cayenneTestConnection=derby,jdk=JDK%201.5%20(latest),label=Ubuntu/ws/framework/cayenne-jdk1.5-unpublished/src/test/java/org/apache/cayenne/access/DataContextObjectIdQuery_PolymorphicTest.java>:[76,25]
method does not override a method from its superclass
[ERROR] -> [Help 1]
org.apache.maven.lifecycle.LifecycleExecutionException: Failed to execute goal org.apache.maven.plugins:maven-compiler-plugin:2.3.2:testCompile
(default-testCompile) on project cayenne-jdk1.5-unpublished: Compilation failure
	at org.apache.maven.lifecycle.internal.MojoExecutor.execute(MojoExecutor.java:213)
	at org.apache.maven.lifecycle.internal.MojoExecutor.execute(MojoExecutor.java:153)
	at org.apache.maven.lifecycle.internal.MojoExecutor.execute(MojoExecutor.java:145)
	at org.apache.maven.lifecycle.internal.LifecycleModuleBuilder.buildProject(LifecycleModuleBuilder.java:84)
	at org.apache.maven.lifecycle.internal.LifecycleModuleBuilder.buildProject(LifecycleModuleBuilder.java:59)
	at org.apache.maven.lifecycle.internal.LifecycleStarter.singleThreadedBuild(LifecycleStarter.java:183)
	at org.apache.maven.lifecycle.internal.LifecycleStarter.execute(LifecycleStarter.java:161)
	at org.apache.maven.DefaultMaven.doExecute(DefaultMaven.java:320)
	at org.apache.maven.DefaultMaven.execute(DefaultMaven.java:156)
	at org.apache.maven.cli.MavenCli.execute(MavenCli.java:537)
	at org.apache.maven.cli.MavenCli.doMain(MavenCli.java:196)
	at org.apache.maven.cli.MavenCli.main(MavenCli.java:141)
	at sun.reflect.NativeMethodAccessorImpl.invoke0(Native Method)
	at sun.reflect.NativeMethodAccessorImpl.invoke(NativeMethodAccessorImpl.java:39)
	at sun.reflect.DelegatingMethodAccessorImpl.invoke(DelegatingMethodAccessorImpl.java:25)
	at java.lang.reflect.Method.invoke(Method.java:592)
	at org.codehaus.plexus.classworlds.launcher.Launcher.launchEnhanced(Launcher.java:290)
	at org.codehaus.plexus.classworlds.launcher.Launcher.launch(Launcher.java:230)
	at org.codehaus.plexus.classworlds.launcher.Launcher.mainWithExitCode(Launcher.java:409)
	at org.codehaus.plexus.classworlds.launcher.Launcher.main(Launcher.java:352)
Caused by: org.apache.maven.plugin.CompilationFailureException: Compilation failure
	at org.apache.maven.plugin.AbstractCompilerMojo.execute(AbstractCompilerMojo.java:656)
	at org.apache.maven.plugin.TestCompilerMojo.execute(TestCompilerMojo.java:161)
	at org.apache.maven.plugin.DefaultBuildPluginManager.executeMojo(DefaultBuildPluginManager.java:101)
	at org.apache.maven.lifecycle.internal.MojoExecutor.execute(MojoExecutor.java:209)
	... 19 more
[ERROR] 
[ERROR] Re-run Maven using the -X switch to enable full debug logging.
[ERROR] 
[ERROR] For more information about the errors and possible solutions, please read the following
articles:
[ERROR] [Help 1] http://cwiki.apache.org/confluence/display/MAVEN/MojoFailureException
[ERROR] 
[ERROR] After correcting the problems, you can resume the build with the command
[ERROR]   mvn <goals> -rf :cayenne-jdk1.5-unpublished
Build step 'Invoke top-level Maven targets' marked build as failure

Mime
View raw message