cayenne-commits mailing list archives

Site index · List index
Message view « Date » · « Thread »
Top « Date » · « Thread »
From Apache Jenkins Server <jenk...@builds.apache.org>
Subject Build failed in Jenkins: cayenne-master » derby,JDK 1.7 (latest),Ubuntu #382
Date Thu, 29 Sep 2016 21:33:34 GMT
See <https://builds.apache.org/job/cayenne-master/cayenneTestConnection=derby,jdk=JDK%201.7%20(latest),label=Ubuntu/382/changes>

Changes:

[andrus] CAY-2116 Split schema synchronization code in a separate module

------------------------------------------
[...truncated 71302 lines...]
WARNING: Line 1 of a paragraph overflows the available area by more than 50 points. (See position
1640:622)
Sep 29, 2016 9:32:48 PM org.apache.fop.events.LoggingEventListener processEvent
WARNING: Line 1 of a paragraph overflows the available area by 17371 millipoints. (See position
1919:622)
Sep 29, 2016 9:32:49 PM org.apache.fop.events.LoggingEventListener processEvent
WARNING: The following feature isn't implemented by Apache FOP, yet: table-layout="auto" (on
fo:table) (See position 2246:1058)
Sep 29, 2016 9:32:49 PM org.apache.fop.events.LoggingEventListener processEvent
WARNING: The following feature isn't implemented by Apache FOP, yet: table-layout="auto" (on
fo:table) (See position 2385:1054)
Sep 29, 2016 9:32:49 PM org.apache.fop.events.LoggingEventListener processEvent
WARNING: Line 1 of a paragraph overflows the available area by 5193 millipoints. (See position
2426:332)
Sep 29, 2016 9:32:49 PM org.apache.fop.events.LoggingEventListener processEvent
WARNING: Line 1 of a paragraph overflows the available area by 2945 millipoints. (See position
2432:248)
Sep 29, 2016 9:32:49 PM org.apache.fop.events.LoggingEventListener processEvent
WARNING: Line 11 of a paragraph overflows the available area by 42535 millipoints. (See position
2434:173)
Sep 29, 2016 9:32:49 PM org.apache.fop.events.LoggingEventListener processEvent
WARNING: Line 1 of a paragraph overflows the available area by 12571 millipoints. (See position
2442:611)
[INFO] <https://builds.apache.org/job/cayenne-master/cayenneTestConnection=derby,jdk=JDK%201.7%20(latest),label=Ubuntu/ws/docs/docbook/cayenne-guide/target/site/index.pdf>
has been generated.
[INFO] <https://builds.apache.org/job/cayenne-master/cayenneTestConnection=derby,jdk=JDK%201.7%20(latest),label=Ubuntu/ws/docs/docbook/cayenne-guide/target/site/index.fo>
has been generated.
[INFO] Executing tasks
   [delete] Deleting 1 files from <https://builds.apache.org/job/cayenne-master/cayenneTestConnection=derby,jdk=JDK%201.7%20(latest),label=Ubuntu/ws/docs/docbook/cayenne-guide/target/site>
     [move] Moving 1 file to <https://builds.apache.org/job/cayenne-master/cayenneTestConnection=derby,jdk=JDK%201.7%20(latest),label=Ubuntu/ws/docs/docbook/cayenne-guide/target/site>
[INFO] Executed tasks
[INFO] 
[INFO] --- docbkx-maven-plugin:2.0.14:generate-html (build-html) @ cayenne-guide ---
[INFO] Processing input file: index.xml
[INFO] Applying customization parameters
[INFO] Chunking output.
Loading Xslthl configuration from jar:file:/home/jenkins/.m2/repository/net/sf/docbook/docbook-xsl/1.76.1/docbook-xsl-1.76.1-ns-resources.zip!/docbook/highlighting/xslthl-config.xml...
[INFO] See <https://builds.apache.org/job/cayenne-master/cayenneTestConnection=derby,jdk=JDK%201.7%20(latest),label=Ubuntu/ws/docs/docbook/cayenne-guide/target/site/index>
for generated file(s)
[INFO] Executing tasks
     [copy] Copying 2 files to <https://builds.apache.org/job/cayenne-master/cayenneTestConnection=derby,jdk=JDK%201.7%20(latest),label=Ubuntu/ws/docs/docbook/cayenne-guide/target/site/index/css>
     [copy] Copying 2 files to <https://builds.apache.org/job/cayenne-master/cayenneTestConnection=derby,jdk=JDK%201.7%20(latest),label=Ubuntu/ws/docs/docbook/cayenne-guide/target/site/index/images>
[INFO] Executed tasks
[INFO] 
[INFO] --- maven-resources-plugin:2.4.3:resources (default-resources) @ cayenne-guide ---
[INFO] Using 'UTF-8' encoding to copy filtered resources.
[INFO] skip non existing resourceDirectory <https://builds.apache.org/job/cayenne-master/cayenneTestConnection=derby,jdk=JDK%201.7%20(latest),label=Ubuntu/ws/docs/docbook/cayenne-guide/src/main/resources>
[INFO] 
[INFO] --- maven-compiler-plugin:2.3.2:compile (default-compile) @ cayenne-guide ---
[INFO] No sources to compile
[INFO] 
[INFO] --- maven-resources-plugin:2.4.3:testResources (default-testResources) @ cayenne-guide
---
[INFO] Using 'UTF-8' encoding to copy filtered resources.
[INFO] skip non existing resourceDirectory <https://builds.apache.org/job/cayenne-master/cayenneTestConnection=derby,jdk=JDK%201.7%20(latest),label=Ubuntu/ws/docs/docbook/cayenne-guide/src/test/resources>
[INFO] 
[INFO] --- maven-compiler-plugin:2.3.2:testCompile (default-testCompile) @ cayenne-guide ---
[INFO] No sources to compile
[INFO] 
[INFO] --- maven-surefire-plugin:2.5:test (default-test) @ cayenne-guide ---
[INFO] No tests to run.
[INFO] 
[INFO] --- maven-jar-plugin:2.4:jar (default-jar) @ cayenne-guide ---
[WARNING] JAR will be empty - no content was marked for inclusion!
[INFO] Building jar: <https://builds.apache.org/job/cayenne-master/cayenneTestConnection=derby,jdk=JDK%201.7%20(latest),label=Ubuntu/ws/docs/docbook/cayenne-guide/target/cayenne-guide-4.0.M4-SNAPSHOT.jar>
[INFO] 
[INFO] >>> maven-source-plugin:2.1.2:jar (bundle-source-jar) > generate-sources
@ cayenne-guide >>>
[INFO] 
[INFO] <<< maven-source-plugin:2.1.2:jar (bundle-source-jar) < generate-sources
@ cayenne-guide <<<
[INFO] 
[INFO] --- maven-source-plugin:2.1.2:jar (bundle-source-jar) @ cayenne-guide ---
[INFO] No sources in project. Archive not created.
[INFO] 
[INFO] --- maven-failsafe-plugin:2.17:integration-test (integration-test) @ cayenne-guide
---
[INFO] No tests to run.
[INFO] 
[INFO] --- maven-failsafe-plugin:2.17:verify (integration-test) @ cayenne-guide ---
[INFO] No tests to run.
[INFO]                                                                         
[INFO] ------------------------------------------------------------------------
[INFO] Building Docbook: Getting Started with Cayenne 4.0.M4-SNAPSHOT
[INFO] ------------------------------------------------------------------------
[INFO] 
[INFO] --- maven-clean-plugin:2.5:clean (default-clean) @ getting-started ---
[INFO] 
[INFO] --- docbkx-maven-plugin:2.0.14:generate-pdf (build-pdf) @ getting-started ---
[INFO] Processing input file: index.xml
[INFO] Applying customization parameters
[INFO] targetFileExtension pdf
[INFO] type fo
Sep 29, 2016 9:32:53 PM org.apache.fop.events.LoggingEventListener processEvent
WARNING: Font "Symbol,normal,700" not found. Substituting with "Symbol,normal,400".
Sep 29, 2016 9:32:53 PM org.apache.fop.events.LoggingEventListener processEvent
WARNING: Font "ZapfDingbats,normal,700" not found. Substituting with "ZapfDingbats,normal,400".
Sep 29, 2016 9:32:54 PM org.apache.fop.events.LoggingEventListener processEvent
WARNING: Line 1 of a paragraph overflows the available area by 22171 millipoints. (See position
141:619)
Sep 29, 2016 9:32:54 PM org.apache.fop.events.LoggingEventListener processEvent
WARNING: Line 1 of a paragraph overflows the available area by 22171 millipoints. (See position
141:619)
Sep 29, 2016 9:32:54 PM org.apache.fop.events.LoggingEventListener processEvent
WARNING: Line 1 of a paragraph overflows the available area by 26971 millipoints. (See position
287:669)
Sep 29, 2016 9:32:54 PM org.apache.fop.events.LoggingEventListener processEvent
WARNING: Line 1 of a paragraph overflows the available area by 7771 millipoints. (See position
287:669)
Sep 29, 2016 9:32:55 PM org.apache.fop.events.LoggingEventListener processEvent
WARNING: Line 1 of a paragraph overflows the available area by 41371 millipoints. (See position
330:682)
Sep 29, 2016 9:32:55 PM org.apache.fop.events.LoggingEventListener processEvent
WARNING: Line 1 of a paragraph overflows the available area by more than 50 points. (See position
338:639)
Sep 29, 2016 9:32:55 PM org.apache.fop.events.LoggingEventListener processEvent
WARNING: Line 1 of a paragraph overflows the available area by 17371 millipoints. (See position
338:639)
Sep 29, 2016 9:32:55 PM org.apache.fop.events.LoggingEventListener processEvent
WARNING: Line 1 of a paragraph overflows the available area by 41371 millipoints. (See position
350:632)
Sep 29, 2016 9:32:55 PM org.apache.fop.events.LoggingEventListener processEvent
WARNING: Line 1 of a paragraph overflows the available area by 9171 millipoints. (See position
546:685)
Sep 29, 2016 9:32:55 PM org.apache.fop.events.LoggingEventListener processEvent
WARNING: Line 1 of a paragraph overflows the available area by 37971 millipoints. (See position
546:685)
Sep 29, 2016 9:32:55 PM org.apache.fop.events.LoggingEventListener processEvent
WARNING: Line 1 of a paragraph overflows the available area by 4371 millipoints. (See position
546:685)
[INFO] <https://builds.apache.org/job/cayenne-master/cayenneTestConnection=derby,jdk=JDK%201.7%20(latest),label=Ubuntu/ws/docs/docbook/getting-started/target/site/index.pdf>
has been generated.
[INFO] <https://builds.apache.org/job/cayenne-master/cayenneTestConnection=derby,jdk=JDK%201.7%20(latest),label=Ubuntu/ws/docs/docbook/getting-started/target/site/index.fo>
has been generated.
[INFO] Executing tasks
   [delete] Deleting 1 files from <https://builds.apache.org/job/cayenne-master/cayenneTestConnection=derby,jdk=JDK%201.7%20(latest),label=Ubuntu/ws/docs/docbook/getting-started/target/site>
     [move] Moving 1 file to <https://builds.apache.org/job/cayenne-master/cayenneTestConnection=derby,jdk=JDK%201.7%20(latest),label=Ubuntu/ws/docs/docbook/getting-started/target/site>
[INFO] Executed tasks
[INFO] 
[INFO] --- docbkx-maven-plugin:2.0.14:generate-html (build-html) @ getting-started ---
[INFO] Processing input file: index.xml
[INFO] Applying customization parameters
[INFO] Chunking output.
[INFO] See <https://builds.apache.org/job/cayenne-master/cayenneTestConnection=derby,jdk=JDK%201.7%20(latest),label=Ubuntu/ws/docs/docbook/getting-started/target/site/index>
for generated file(s)
[INFO] Executing tasks
     [copy] Copying 2 files to <https://builds.apache.org/job/cayenne-master/cayenneTestConnection=derby,jdk=JDK%201.7%20(latest),label=Ubuntu/ws/docs/docbook/getting-started/target/site/index/css>
     [copy] Copying 13 files to <https://builds.apache.org/job/cayenne-master/cayenneTestConnection=derby,jdk=JDK%201.7%20(latest),label=Ubuntu/ws/docs/docbook/getting-started/target/site/index/images>
[INFO] Executed tasks
[INFO] 
[INFO] --- maven-resources-plugin:2.4.3:resources (default-resources) @ getting-started ---
[INFO] Using 'UTF-8' encoding to copy filtered resources.
[INFO] Copying 30 resources
[INFO] 
[INFO] --- maven-compiler-plugin:2.3.2:compile (default-compile) @ getting-started ---
[INFO] No sources to compile
[INFO] 
[INFO] --- maven-resources-plugin:2.4.3:testResources (default-testResources) @ getting-started
---
[INFO] Using 'UTF-8' encoding to copy filtered resources.
[INFO] skip non existing resourceDirectory <https://builds.apache.org/job/cayenne-master/cayenneTestConnection=derby,jdk=JDK%201.7%20(latest),label=Ubuntu/ws/docs/docbook/getting-started/src/test/resources>
[INFO] 
[INFO] --- maven-compiler-plugin:2.3.2:testCompile (default-testCompile) @ getting-started
---
[INFO] No sources to compile
[INFO] 
[INFO] --- maven-surefire-plugin:2.5:test (default-test) @ getting-started ---
[INFO] No tests to run.
[INFO] 
[INFO] --- maven-jar-plugin:2.4:jar (default-jar) @ getting-started ---
[INFO] Building jar: <https://builds.apache.org/job/cayenne-master/cayenneTestConnection=derby,jdk=JDK%201.7%20(latest),label=Ubuntu/ws/docs/docbook/getting-started/target/getting-started-4.0.M4-SNAPSHOT.jar>
[INFO] ------------------------------------------------------------------------
[INFO] Reactor Summary:
[INFO] 
[INFO] Cayenne ............................................ SUCCESS [  0.869 s]
[INFO] Cayenne Build Tools Parent ......................... SUCCESS [  0.016 s]
[INFO] Cayenne License and Notice Bundle .................. SUCCESS [  1.137 s]
[INFO] Common Unit Test Utilities ......................... SUCCESS [  1.217 s]
[INFO] Cayenne Code Checkers .............................. SUCCESS [  0.082 s]
[INFO] Cayenne Dependency Injection Container ............. SUCCESS [  9.098 s]
[INFO] Cayenne Server ..................................... SUCCESS [01:58 min]
[INFO] Cayenne ROP Client ................................. SUCCESS [ 36.033 s]
[INFO] Cayenne Database Synchronization Tools ............. SUCCESS [ 32.000 s]
[INFO] Cayenne Project .................................... SUCCESS [  4.806 s]
[INFO] Cayenne Tools ...................................... SUCCESS [ 10.455 s]
[INFO] Cayenne Lifecycle Utilities ........................ SUCCESS [  9.319 s]
[INFO] Cayenne Maven Plugins .............................. SUCCESS [  0.378 s]
[INFO] Cayenne Maven Plugin ............................... SUCCESS [ 19.408 s]
[INFO] Cayenne Cryptography Extensions .................... SUCCESS [  7.176 s]
[INFO] Cayenne Joda Extensions ............................ SUCCESS [  4.328 s]
[INFO] Cayenne DBCP2 Extension ............................ SUCCESS [  2.088 s]
[INFO] Cayenne Integration Tests Parent ................... SUCCESS [  0.011 s]
[INFO] Integration Tests - Cayenne Tools .................. SUCCESS [  4.144 s]
[INFO] Cayenne Modeler Parent ............................. SUCCESS [  0.019 s]
[INFO] Cayenne WebObjects Compatibility Library ........... SUCCESS [  4.488 s]
[INFO] Cayenne Modeler .................................... SUCCESS [ 15.336 s]
[INFO] Cayenne Modeler Generic and Windows Extensions ..... SUCCESS [  1.816 s]
[INFO] Cayenne Modeler Generic ............................ SUCCESS [  0.636 s]
[INFO] Cayenne Modeler Mac OS X Extensions ................ SUCCESS [  1.930 s]
[INFO] Cayenne Modeler Mac OS X ........................... SUCCESS [  0.652 s]
[INFO] Cayenne Modeler Windows ............................ SUCCESS [  0.610 s]
[INFO] Cayenne Modeler Maven Plugin ....................... SUCCESS [  3.308 s]
[INFO] Cayenne Tutorials .................................. SUCCESS [  0.020 s]
[INFO] Cayenne Tutorial ................................... SUCCESS [  1.167 s]
[INFO] Cayenne ROP Server Tutorial ........................ SUCCESS [  1.992 s]
[INFO] Cayenne ROP Client Tutorial ........................ SUCCESS [  1.104 s]
[INFO] Cayenne Documenation Parent ........................ SUCCESS [  0.008 s]
[INFO] Cayenne Documentation .............................. SUCCESS [ 30.930 s]
[INFO] Cayenne Docbook Documentation ...................... SUCCESS [  0.354 s]
[INFO] Docbook: Cayenne Stylesheets ....................... SUCCESS [  0.078 s]
[INFO] Docbook: Cayenne Guide ............................. SUCCESS [ 11.643 s]
[INFO] Docbook: Getting Started with Cayenne .............. FAILURE [  3.996 s]
[INFO] Docbook: Getting Started with Cayenne ROP .......... SKIPPED
[INFO] Docbook: Cayenne New Features and Upgrade Guide .... SKIPPED
[INFO] ------------------------------------------------------------------------
[INFO] BUILD FAILURE
[INFO] ------------------------------------------------------------------------
[INFO] Total time: 05:42 min
[INFO] Finished at: 2016-09-29T21:32:56+00:00
[INFO] Final Memory: 127M/373M
[INFO] ------------------------------------------------------------------------
[ERROR] Failed to execute goal org.apache.maven.plugins:maven-jar-plugin:2.4:jar (default-jar)
on project getting-started: Error assembling JAR: IOException when zipping index/images/modeler-started.png:
No space left on device -> [Help 1]
org.apache.maven.lifecycle.LifecycleExecutionException: Failed to execute goal org.apache.maven.plugins:maven-jar-plugin:2.4:jar
(default-jar) on project getting-started: Error assembling JAR
	at org.apache.maven.lifecycle.internal.MojoExecutor.execute(MojoExecutor.java:212)
	at org.apache.maven.lifecycle.internal.MojoExecutor.execute(MojoExecutor.java:153)
	at org.apache.maven.lifecycle.internal.MojoExecutor.execute(MojoExecutor.java:145)
	at org.apache.maven.lifecycle.internal.LifecycleModuleBuilder.buildProject(LifecycleModuleBuilder.java:116)
	at org.apache.maven.lifecycle.internal.LifecycleModuleBuilder.buildProject(LifecycleModuleBuilder.java:80)
	at org.apache.maven.lifecycle.internal.builder.singlethreaded.SingleThreadedBuilder.build(SingleThreadedBuilder.java:51)
	at org.apache.maven.lifecycle.internal.LifecycleStarter.execute(LifecycleStarter.java:128)
	at org.apache.maven.DefaultMaven.doExecute(DefaultMaven.java:307)
	at org.apache.maven.DefaultMaven.doExecute(DefaultMaven.java:193)
	at org.apache.maven.DefaultMaven.execute(DefaultMaven.java:106)
	at org.apache.maven.cli.MavenCli.execute(MavenCli.java:863)
	at org.apache.maven.cli.MavenCli.doMain(MavenCli.java:288)
	at org.apache.maven.cli.MavenCli.main(MavenCli.java:199)
	at sun.reflect.NativeMethodAccessorImpl.invoke0(Native Method)
	at sun.reflect.NativeMethodAccessorImpl.invoke(NativeMethodAccessorImpl.java:57)
	at sun.reflect.DelegatingMethodAccessorImpl.invoke(DelegatingMethodAccessorImpl.java:43)
	at java.lang.reflect.Method.invoke(Method.java:606)
	at org.codehaus.plexus.classworlds.launcher.Launcher.launchEnhanced(Launcher.java:289)
	at org.codehaus.plexus.classworlds.launcher.Launcher.launch(Launcher.java:229)
	at org.codehaus.plexus.classworlds.launcher.Launcher.mainWithExitCode(Launcher.java:415)
	at org.codehaus.plexus.classworlds.launcher.Launcher.main(Launcher.java:356)
Caused by: org.apache.maven.plugin.MojoExecutionException: Error assembling JAR
	at org.apache.maven.plugin.jar.AbstractJarMojo.createArchive(AbstractJarMojo.java:237)
	at org.apache.maven.plugin.jar.AbstractJarMojo.execute(AbstractJarMojo.java:255)
	at org.apache.maven.plugin.DefaultBuildPluginManager.executeMojo(DefaultBuildPluginManager.java:134)
	at org.apache.maven.lifecycle.internal.MojoExecutor.execute(MojoExecutor.java:207)
	... 20 more
Caused by: org.codehaus.plexus.archiver.ArchiverException: IOException when zipping index/images/modeler-started.png:
No space left on device
	at org.codehaus.plexus.archiver.zip.AbstractZipArchiver.zipFile(AbstractZipArchiver.java:561)
	at org.codehaus.plexus.archiver.zip.AbstractZipArchiver.addResources(AbstractZipArchiver.java:387)
	at org.codehaus.plexus.archiver.zip.AbstractZipArchiver.createArchiveMain(AbstractZipArchiver.java:312)
	at org.codehaus.plexus.archiver.zip.AbstractZipArchiver.execute(AbstractZipArchiver.java:211)
	at org.codehaus.plexus.archiver.AbstractArchiver.createArchive(AbstractArchiver.java:897)
	at org.apache.maven.archiver.MavenArchiver.createArchive(MavenArchiver.java:582)
	at org.apache.maven.plugin.jar.AbstractJarMojo.createArchive(AbstractJarMojo.java:230)
	... 23 more
Caused by: java.io.IOException: No space left on device
	at java.io.RandomAccessFile.writeBytes0(Native Method)
	at java.io.RandomAccessFile.writeBytes(RandomAccessFile.java:520)
	at java.io.RandomAccessFile.write(RandomAccessFile.java:550)
	at org.codehaus.plexus.archiver.zip.ZipOutputStream.writeOut(ZipOutputStream.java:917)
	at org.codehaus.plexus.archiver.zip.ZipOutputStream.deflate(ZipOutputStream.java:605)
	at org.codehaus.plexus.archiver.zip.ZipOutputStream.write(ZipOutputStream.java:496)
	at org.codehaus.plexus.archiver.zip.AbstractZipArchiver.zipFile(AbstractZipArchiver.java:526)
	at org.codehaus.plexus.archiver.jar.JarArchiver.zipFile(JarArchiver.java:479)
	at org.codehaus.plexus.archiver.zip.AbstractZipArchiver.zipFile(AbstractZipArchiver.java:557)
	... 29 more
[ERROR] 
[ERROR] Re-run Maven using the -X switch to enable full debug logging.
[ERROR] 
[ERROR] For more information about the errors and possible solutions, please read the following
articles:
[ERROR] [Help 1] http://cwiki.apache.org/confluence/display/MAVEN/MojoExecutionException
[ERROR] 
[ERROR] After correcting the problems, you can resume the build with the command
[ERROR]   mvn <goals> -rf :getting-started
Build step 'Invoke top-level Maven targets' marked build as failure
Recording test results

Mime
View raw message