cayenne-commits mailing list archives

Site index · List index
Message view « Date » · « Thread »
Top « Date » · « Thread »
From Apache Jenkins Server <jenk...@builds.apache.org>
Subject Build failed in Jenkins: cayenne-master » h2,JDK 1.8 (latest),ubuntu #629
Date Thu, 20 Apr 2017 13:29:55 GMT
See <https://builds.apache.org/job/cayenne-master/cayenneTestConnection=h2,jdk=JDK%201.8%20(latest),slave=ubuntu/629/display/redirect?page=changes>

Changes:

[stariy95] Fixed NullPointerException in validator  + Cleanup

------------------------------------------
[...truncated 69.42 KB...]
Running org.apache.cayenne.exp.PropertyTest
Tests run: 47, Failures: 0, Errors: 0, Skipped: 0, Time elapsed: 0.018 sec
Running org.apache.cayenne.configuration.web.CayenneFilterTest
Tests run: 5, Failures: 0, Errors: 0, Skipped: 0, Time elapsed: 0.021 sec
Running org.apache.cayenne.access.jdbc.SQLStatementTest
Tests run: 2, Failures: 0, Errors: 0, Skipped: 0, Time elapsed: 0.002 sec
Running org.apache.cayenne.map.DbKeyGeneratorTest
Tests run: 2, Failures: 0, Errors: 0, Skipped: 0, Time elapsed: 0.002 sec
Running org.apache.cayenne.query.SelectQueryTest
Tests run: 13, Failures: 0, Errors: 0, Skipped: 0, Time elapsed: 0.007 sec
Running org.apache.cayenne.exp.Expression_ParamsLegacyTest
Tests run: 4, Failures: 0, Errors: 0, Skipped: 0, Time elapsed: 0.009 sec
Running org.apache.cayenne.exp.parser.ASTAndTest
Tests run: 1, Failures: 0, Errors: 0, Skipped: 0, Time elapsed: 0.002 sec
Running org.apache.cayenne.exp.parser.EvaluatorTest
Tests run: 9, Failures: 0, Errors: 0, Skipped: 0, Time elapsed: 0.011 sec
Running org.apache.cayenne.exp.parser.ASTFunctionCallTest
Tests run: 2, Failures: 0, Errors: 0, Skipped: 0, Time elapsed: 0.002 sec
Running org.apache.cayenne.access.types.BooleanTypeTest
Tests run: 2, Failures: 0, Errors: 0, Skipped: 0, Time elapsed: 0.002 sec
Running org.apache.cayenne.reflect.generic.DataObjectAttributePropertyTest
Tests run: 1, Failures: 0, Errors: 0, Skipped: 0, Time elapsed: 0.025 sec
Running org.apache.cayenne.validation.ValidationResultTest
Tests run: 3, Failures: 0, Errors: 0, Skipped: 0, Time elapsed: 0.007 sec
Running org.apache.cayenne.conn.DataSourceInfoTest
Tests run: 3, Failures: 0, Errors: 0, Skipped: 0, Time elapsed: 0.003 sec
Running org.apache.cayenne.exp.parser.ASTObjPathTest
Tests run: 6, Failures: 0, Errors: 0, Skipped: 0, Time elapsed: 0.003 sec
Running org.apache.cayenne.access.jdbc.ColumnDescriptorTest
Tests run: 5, Failures: 0, Errors: 0, Skipped: 0, Time elapsed: 0.002 sec
Running org.apache.cayenne.configuration.server.DefaultDataSourceFactoryLoaderTest
[main] INFO org.apache.cayenne.configuration.server.DelegatingDataSourceFactory - Found DataSourceFactory
system property overrides for URL and Driver of 'X.node1' node. Will ignore project DataSource
configuration.
[main] INFO org.apache.cayenne.configuration.server.DelegatingDataSourceFactory - Found DataSourceFactory
system property overrides for URL and Driver of 'X.node1' node. Will ignore project DataSource
configuration.
Tests run: 3, Failures: 0, Errors: 0, Skipped: 0, Time elapsed: 0.011 sec
Running org.apache.cayenne.exp.parser.ASTOrTest
Tests run: 1, Failures: 0, Errors: 0, Skipped: 0, Time elapsed: 0.001 sec
Running org.apache.cayenne.BaseContextTest
Tests run: 3, Failures: 0, Errors: 0, Skipped: 0, Time elapsed: 0.007 sec
Running org.apache.cayenne.remote.service.BaseRemoteServiceTest
[main] INFO org.apache.cayenne.remote.service.BaseRemoteServiceTest$4 - Exception processing
message org.apache.cayenne.remote.service.BaseRemoteServiceTest$5 of type Query
org.apache.cayenne.CayenneRuntimeException: [v.4.0.M6-SNAPSHOT Apr 20 2017 13:28:30] (no message)
	at org.apache.cayenne.remote.service.BaseRemoteServiceTest$5.getQuery(BaseRemoteServiceTest.java:118)
	at org.apache.cayenne.remote.service.DispatchHelper.dispatch(DispatchHelper.java:39)
	at org.apache.cayenne.remote.service.BaseRemoteService.processMessage(BaseRemoteService.java:139)
	at org.apache.cayenne.remote.service.BaseRemoteServiceTest.testProcessMessageExceptionSerializability(BaseRemoteServiceTest.java:113)
	at sun.reflect.NativeMethodAccessorImpl.invoke0(Native Method)
	at sun.reflect.NativeMethodAccessorImpl.invoke(NativeMethodAccessorImpl.java:62)
	at sun.reflect.DelegatingMethodAccessorImpl.invoke(DelegatingMethodAccessorImpl.java:43)
	at java.lang.reflect.Method.invoke(Method.java:498)
	at org.junit.runners.model.FrameworkMethod$1.runReflectiveCall(FrameworkMethod.java:47)
	at org.junit.internal.runners.model.ReflectiveCallable.run(ReflectiveCallable.java:12)
	at org.junit.runners.model.FrameworkMethod.invokeExplosively(FrameworkMethod.java:44)
	at org.junit.internal.runners.statements.InvokeMethod.evaluate(InvokeMethod.java:17)
	at org.junit.runners.ParentRunner.runLeaf(ParentRunner.java:271)
	at org.junit.runners.BlockJUnit4ClassRunner.runChild(BlockJUnit4ClassRunner.java:70)
	at org.junit.runners.BlockJUnit4ClassRunner.runChild(BlockJUnit4ClassRunner.java:50)
	at org.junit.runners.ParentRunner$3.run(ParentRunner.java:238)
	at org.junit.runners.ParentRunner$1.schedule(ParentRunner.java:63)
	at org.junit.runners.ParentRunner.runChildren(ParentRunner.java:236)
	at org.junit.runners.ParentRunner.access$000(ParentRunner.java:53)
	at org.junit.runners.ParentRunner$2.evaluate(ParentRunner.java:229)
	at org.junit.runners.ParentRunner.run(ParentRunner.java:309)
	at org.apache.maven.surefire.junit4.JUnit4TestSet.execute(JUnit4TestSet.java:59)
	at org.apache.maven.surefire.suite.AbstractDirectoryTestSuite.executeTestSet(AbstractDirectoryTestSuite.java:115)
	at org.apache.maven.surefire.suite.AbstractDirectoryTestSuite.execute(AbstractDirectoryTestSuite.java:102)
	at org.apache.maven.surefire.Surefire.run(Surefire.java:180)
	at sun.reflect.NativeMethodAccessorImpl.invoke0(Native Method)
	at sun.reflect.NativeMethodAccessorImpl.invoke(NativeMethodAccessorImpl.java:62)
	at sun.reflect.DelegatingMethodAccessorImpl.invoke(DelegatingMethodAccessorImpl.java:43)
	at java.lang.reflect.Method.invoke(Method.java:498)
	at org.apache.maven.surefire.booter.SurefireBooter.runSuitesInProcess(SurefireBooter.java:350)
	at org.apache.maven.surefire.booter.SurefireBooter.main(SurefireBooter.java:1021)
[main] INFO org.apache.cayenne.remote.service.BaseRemoteServiceTest$4 - Exception processing
message org.apache.cayenne.remote.service.BaseRemoteServiceTest$6 of type Query
org.apache.cayenne.remote.service.MockUnserializableException
	at org.apache.cayenne.remote.service.BaseRemoteServiceTest$6.getQuery(BaseRemoteServiceTest.java:133)
	at org.apache.cayenne.remote.service.DispatchHelper.dispatch(DispatchHelper.java:39)
	at org.apache.cayenne.remote.service.BaseRemoteService.processMessage(BaseRemoteService.java:139)
	at org.apache.cayenne.remote.service.BaseRemoteServiceTest.testProcessMessageExceptionSerializability(BaseRemoteServiceTest.java:128)
	at sun.reflect.NativeMethodAccessorImpl.invoke0(Native Method)
	at sun.reflect.NativeMethodAccessorImpl.invoke(NativeMethodAccessorImpl.java:62)
	at sun.reflect.DelegatingMethodAccessorImpl.invoke(DelegatingMethodAccessorImpl.java:43)
	at java.lang.reflect.Method.invoke(Method.java:498)
	at org.junit.runners.model.FrameworkMethod$1.runReflectiveCall(FrameworkMethod.java:47)
	at org.junit.internal.runners.model.ReflectiveCallable.run(ReflectiveCallable.java:12)
	at org.junit.runners.model.FrameworkMethod.invokeExplosively(FrameworkMethod.java:44)
	at org.junit.internal.runners.statements.InvokeMethod.evaluate(InvokeMethod.java:17)
	at org.junit.runners.ParentRunner.runLeaf(ParentRunner.java:271)
	at org.junit.runners.BlockJUnit4ClassRunner.runChild(BlockJUnit4ClassRunner.java:70)
	at org.junit.runners.BlockJUnit4ClassRunner.runChild(BlockJUnit4ClassRunner.java:50)
	at org.junit.runners.ParentRunner$3.run(ParentRunner.java:238)
	at org.junit.runners.ParentRunner$1.schedule(ParentRunner.java:63)
	at org.junit.runners.ParentRunner.runChildren(ParentRunner.java:236)
	at org.junit.runners.ParentRunner.access$000(ParentRunner.java:53)
	at org.junit.runners.ParentRunner$2.evaluate(ParentRunner.java:229)
	at org.junit.runners.ParentRunner.run(ParentRunner.java:309)
	at org.apache.maven.surefire.junit4.JUnit4TestSet.execute(JUnit4TestSet.java:59)
	at org.apache.maven.surefire.suite.AbstractDirectoryTestSuite.executeTestSet(AbstractDirectoryTestSuite.java:115)
	at org.apache.maven.surefire.suite.AbstractDirectoryTestSuite.execute(AbstractDirectoryTestSuite.java:102)
	at org.apache.maven.surefire.Surefire.run(Surefire.java:180)
	at sun.reflect.NativeMethodAccessorImpl.invoke0(Native Method)
	at sun.reflect.NativeMethodAccessorImpl.invoke(NativeMethodAccessorImpl.java:62)
	at sun.reflect.DelegatingMethodAccessorImpl.invoke(DelegatingMethodAccessorImpl.java:43)
	at java.lang.reflect.Method.invoke(Method.java:498)
	at org.apache.maven.surefire.booter.SurefireBooter.runSuitesInProcess(SurefireBooter.java:350)
	at org.apache.maven.surefire.booter.SurefireBooter.main(SurefireBooter.java:1021)
Tests run: 2, Failures: 0, Errors: 0, Skipped: 0, Time elapsed: 0.03 sec
Running org.apache.cayenne.query.NamedQueryTest
Tests run: 4, Failures: 0, Errors: 0, Skipped: 0, Time elapsed: 0.005 sec
Running org.apache.cayenne.access.jdbc.JDBCResultIteratorTest
Tests run: 2, Failures: 0, Errors: 0, Skipped: 0, Time elapsed: 0.012 sec
Running org.apache.cayenne.access.types.ExtendedTypeMapTest
[main] WARN org.apache.cayenne.access.types.SerializableTypeFactory - Haven't found suitable
ExtendedType for class 'java.lang.Object'. Most likely you need to define a custom ExtendedType.
[main] WARN org.apache.cayenne.access.types.SerializableTypeFactory - Haven't found suitable
ExtendedType for class 'java.lang.Object'. Most likely you need to define a custom ExtendedType.
[main] WARN org.apache.cayenne.access.types.SerializableTypeFactory - Haven't found suitable
ExtendedType for class 'java.util.List'. Most likely you need to define a custom ExtendedType.
[main] WARN org.apache.cayenne.access.types.SerializableTypeFactory - Haven't found suitable
ExtendedType for class 'byte[]'. Most likely you need to define a custom ExtendedType.
[main] WARN org.apache.cayenne.access.types.SerializableTypeFactory - SerializableType will
be used for type conversion.
Tests run: 4, Failures: 0, Errors: 0, Skipped: 0, Time elapsed: 0.004 sec
Running org.apache.cayenne.exp.parser.ASTCurrentTimestampTest
Tests run: 2, Failures: 0, Errors: 0, Skipped: 0, Time elapsed: 0.001 sec
Running org.apache.cayenne.util.UtilTest
Tests run: 32, Failures: 0, Errors: 0, Skipped: 0, Time elapsed: 0.014 sec
Running org.apache.cayenne.cache.MapQueryCacheTest
Tests run: 1, Failures: 0, Errors: 0, Skipped: 0, Time elapsed: 0.011 sec
Running org.apache.cayenne.reflect.PropertyUtilsTest
Tests run: 17, Failures: 0, Errors: 0, Skipped: 0, Time elapsed: 0.012 sec
Running org.apache.cayenne.access.types.DefaultValueObjectTypeRegistryTest
Tests run: 2, Failures: 0, Errors: 0, Skipped: 0, Time elapsed: 0.004 sec
Running org.apache.cayenne.map.DataMapTest
Tests run: 25, Failures: 0, Errors: 0, Skipped: 0, Time elapsed: 0.018 sec

Results :

Failed tests: 
  testRun_Manage(org.apache.cayenne.datasource.PoolDataSourceManagerTest)

Tests run: 963, Failures: 1, Errors: 0, Skipped: 0

[INFO] ------------------------------------------------------------------------
[INFO] Reactor Summary:
[INFO] 
[INFO] cayenne-parent: Top-level parent of Cayenne modules  SUCCESS [  0.791 s]
[INFO] build-tools-parent: Cayenne Build Tools Parent ..... SUCCESS [  0.041 s]
[INFO] cayenne-legal: Cayenne License and Notice Bundle ... SUCCESS [  2.451 s]
[INFO] cayenne-test-utilities: Common Unit Test Utilities . SUCCESS [  1.888 s]
[INFO] cayenne-checkers: Cayenne Code Checkers ............ SUCCESS [  0.189 s]
[INFO] cayenne-di: Cayenne Dependency Injection Container . SUCCESS [ 12.981 s]
[INFO] cayenne-server: Cayenne Server ..................... FAILURE [ 48.280 s]
[INFO] cayenne-client: Cayenne ROP Client ................. SKIPPED
[INFO] cayenne-project: Cayenne Project ................... SKIPPED
[INFO] cayenne-dbsync: Database Synchronization Tools ..... SKIPPED
[INFO] cayenne-cgen: Cayenne Class Generation Tools ....... SKIPPED
[INFO] cayenne-ant: Cayenne Ant Tasks ..................... SKIPPED
[INFO] cayenne-postcommit: Cayenne Postcommit Module ...... SKIPPED
[INFO] cayenne-lifecycle: Cayenne Lifecycle Utilities ..... SKIPPED
[INFO] cayenne-maven-plugins-parent: Maven Plugins parent . SKIPPED
[INFO] cayenne-maven-plugin: Cayenne Maven Plugin ......... SKIPPED
[INFO] cayenne-crypto: Cayenne Cryptography Extensions .... SKIPPED
[INFO] cayenne-joda: Cayenne Joda Extensions .............. SKIPPED
[INFO] cayenne-dbcp2: Cayenne DBCP2 Extension ............. SKIPPED
[INFO] cayenne-jcache: Cayenne JCache Integration ......... SKIPPED
[INFO] cayenne-cache-invalidation: Cayenne Cache Invalidation SKIPPED
[INFO] cayenne-itests-parent: Integration Tests Parent .... SKIPPED
[INFO] cayenne-tools-itest: Tools integration tests ....... SKIPPED
[INFO] cayenne-modeler-parent: Cayenne Modeler Parent ..... SKIPPED
[INFO] cayenne-wocompat: WebObjects Compatibility Library . SKIPPED
[INFO] cayenne-modeler: Cayenne Modeler Core .............. SKIPPED
[INFO] cayenne-modeler-generic-ext: Modeler Generic Extensions SKIPPED
[INFO] cayenne-modeler-generic: Modeler Generic Assembly .. SKIPPED
[INFO] cayenne-modeler-mac-ext: Modeler MacOS Extensions .. SKIPPED
[INFO] cayenne-modeler-mac: Modeler MacOS Assembly ........ SKIPPED
[INFO] cayenne-modeler-win-ext: Modeler Win Extensions .... SKIPPED
[INFO] cayenne-modeler-win: Modeler Windows Assembly ...... SKIPPED
[INFO] maven-cayenne-plugin: Deprecated Cayenne Maven Plugin SKIPPED
[INFO] cayenne-modeler-maven-plugin: Cayenne Modeler Maven Plugin SKIPPED
[INFO] cayenne-tutorials-parent: Cayenne Tutorials ........ SKIPPED
[INFO] tutorial: ayenne Tutorial .......................... SKIPPED
[INFO] tutorial-rop-server: Cayenne ROP Server Tutorial ... SKIPPED
[INFO] tutorial-rop-client: Cayenne ROP Client Tutorial ... SKIPPED
[INFO] cayenne-java8: Cayenne Java8 Extensions ............ SKIPPED
[INFO] cayenne-protostuff: Cayenne Protostuff Extension ... SKIPPED
[INFO] tutorial-rop-server-http2: Cayenne ROP HTTP/2 Server Tutorial SKIPPED
[INFO] cayenne-client-jetty: Cayenne ROP Client (Jetty) ... SKIPPED
[INFO] tutorial-rop-client-http2: Cayenne ROP HTTP/2 Client Tutorial SKIPPED
[INFO] cayenne-docs-parent: Cayenne Documenation Parent ... SKIPPED
[INFO] cayenne-doc: Cayenne Documentation ................. SKIPPED
[INFO] cayenne-docbook: Cayenne Docbook Documentation ..... SKIPPED
[INFO] docbook-stylesheets: Docbook - Cayenne Stylesheets . SKIPPED
[INFO] cayenne-guide: Docbook - Cayenne Guide ............. SKIPPED
[INFO] getting-started: Docbook - Getting Started with Cayenne SKIPPED
[INFO] getting-started-rop: Docbook - Getting Started with Cayenne ROP SKIPPED
[INFO] upgrade-guide: Docbook - Cayenne New Features and Upgrade Guide SKIPPED
[INFO] cayenne-eventbridges-parent: Event bridges implementations parent SKIPPED
[INFO] cayenne-jgroups: Cayenne JGroups Event bridge ...... SKIPPED
[INFO] cayenne-jms: Cayenne JMS Event bridge .............. SKIPPED
[INFO] cayenne-xmpp: Cayenne XMPP Event bridge ............ SKIPPED
[INFO] cayenne-assembly: Cayenne Release Assembly ......... SKIPPED
[INFO] ------------------------------------------------------------------------
[INFO] BUILD FAILURE
[INFO] ------------------------------------------------------------------------
[INFO] Total time: 01:08 min
[INFO] Finished at: 2017-04-20T13:29:39+00:00
[INFO] Final Memory: 89M/436M
[INFO] ------------------------------------------------------------------------
[ERROR] Failed to execute goal org.apache.maven.plugins:maven-surefire-plugin:2.5:test (default-test)
on project cayenne-server: There are test failures.
[ERROR] 
[ERROR] Please refer to <https://builds.apache.org/job/cayenne-master/cayenneTestConnection=h2,jdk=JDK%201.8%20(latest),slave=ubuntu/ws/cayenne-server/target/surefire-reports>
for the individual test results.
[ERROR] -> [Help 1]
org.apache.maven.lifecycle.LifecycleExecutionException: Failed to execute goal org.apache.maven.plugins:maven-surefire-plugin:2.5:test
(default-test) on project cayenne-server: There are test failures.

Please refer to <https://builds.apache.org/job/cayenne-master/cayenneTestConnection=h2,jdk=JDK%201.8%20(latest),slave=ubuntu/ws/cayenne-server/target/surefire-reports>
for the individual test results.
	at org.apache.maven.lifecycle.internal.MojoExecutor.execute(MojoExecutor.java:212)
	at org.apache.maven.lifecycle.internal.MojoExecutor.execute(MojoExecutor.java:153)
	at org.apache.maven.lifecycle.internal.MojoExecutor.execute(MojoExecutor.java:145)
	at org.apache.maven.lifecycle.internal.LifecycleModuleBuilder.buildProject(LifecycleModuleBuilder.java:116)
	at org.apache.maven.lifecycle.internal.LifecycleModuleBuilder.buildProject(LifecycleModuleBuilder.java:80)
	at org.apache.maven.lifecycle.internal.builder.singlethreaded.SingleThreadedBuilder.build(SingleThreadedBuilder.java:51)
	at org.apache.maven.lifecycle.internal.LifecycleStarter.execute(LifecycleStarter.java:128)
	at org.apache.maven.DefaultMaven.doExecute(DefaultMaven.java:307)
	at org.apache.maven.DefaultMaven.doExecute(DefaultMaven.java:193)
	at org.apache.maven.DefaultMaven.execute(DefaultMaven.java:106)
	at org.apache.maven.cli.MavenCli.execute(MavenCli.java:863)
	at org.apache.maven.cli.MavenCli.doMain(MavenCli.java:288)
	at org.apache.maven.cli.MavenCli.main(MavenCli.java:199)
	at sun.reflect.NativeMethodAccessorImpl.invoke0(Native Method)
	at sun.reflect.NativeMethodAccessorImpl.invoke(NativeMethodAccessorImpl.java:62)
	at sun.reflect.DelegatingMethodAccessorImpl.invoke(DelegatingMethodAccessorImpl.java:43)
	at java.lang.reflect.Method.invoke(Method.java:498)
	at org.codehaus.plexus.classworlds.launcher.Launcher.launchEnhanced(Launcher.java:289)
	at org.codehaus.plexus.classworlds.launcher.Launcher.launch(Launcher.java:229)
	at org.codehaus.plexus.classworlds.launcher.Launcher.mainWithExitCode(Launcher.java:415)
	at org.codehaus.plexus.classworlds.launcher.Launcher.main(Launcher.java:356)
Caused by: org.apache.maven.plugin.MojoFailureException: There are test failures.

Please refer to <https://builds.apache.org/job/cayenne-master/cayenneTestConnection=h2,jdk=JDK%201.8%20(latest),slave=ubuntu/ws/cayenne-server/target/surefire-reports>
for the individual test results.
	at org.apache.maven.plugin.surefire.SurefirePlugin.execute(SurefirePlugin.java:629)
	at org.apache.maven.plugin.DefaultBuildPluginManager.executeMojo(DefaultBuildPluginManager.java:134)
	at org.apache.maven.lifecycle.internal.MojoExecutor.execute(MojoExecutor.java:207)
	... 20 more
[ERROR] 
[ERROR] Re-run Maven using the -X switch to enable full debug logging.
[ERROR] 
[ERROR] For more information about the errors and possible solutions, please read the following
articles:
[ERROR] [Help 1] http://cwiki.apache.org/confluence/display/MAVEN/MojoFailureException
[ERROR] 
[ERROR] After correcting the problems, you can resume the build with the command
[ERROR]   mvn <goals> -rf :cayenne-server
Build step 'Invoke top-level Maven targets' marked build as failure
Recording test results
Not sending mail to unregistered user stariy95@gmail.com

Mime
View raw message