cayenne-commits mailing list archives

Site index · List index
Message view « Date » · « Thread »
Top « Date » · « Thread »
From Apache Jenkins Server <jenk...@builds.apache.org>
Subject Build failed in Jenkins: cayenne-master » derby,JDK 1.7 (latest),ubuntu #612
Date Wed, 05 Apr 2017 09:37:34 GMT
See <https://builds.apache.org/job/cayenne-master/cayenneTestConnection=derby,jdk=JDK%201.7%20(latest),slave=ubuntu/612/display/redirect?page=changes>

Changes:

[mpetrusevich] bug-fix: change action priority in performAction (change if-else

[mpetrusevich] CAY-2250 bug-fix: change action priority in performAction (change

[drekoas] CAY-2249 Remove: Extra question mark in the body of Confirm Remove

[stariy95] CAY-2276 PrePersist listener registered as PostPersist in

------------------------------------------
[...truncated 10.08 MB...]
	at java.net.URLClassLoader.defineClass(URLClassLoader.java:449)
	at java.net.URLClassLoader.access$100(URLClassLoader.java:71)
	at java.net.URLClassLoader$1.run(URLClassLoader.java:361)
	at java.net.URLClassLoader$1.run(URLClassLoader.java:355)
	at java.security.AccessController.doPrivileged(Native Method)
	at java.net.URLClassLoader.findClass(URLClassLoader.java:354)
	at org.codehaus.plexus.compiler.javac.IsolatedClassLoader.loadClass(IsolatedClassLoader.java:56)
	at com.sun.tools.javac.main.JavaCompiler.<init>(JavaCompiler.java:355)
	at com.sun.tools.javac.main.JavaCompiler.instance(JavaCompiler.java:88)
	at com.sun.tools.javac.main.Main.compile(Main.java:424)
	at com.sun.tools.javac.main.Main.compile(Main.java:353)
	at com.sun.tools.javac.main.Main.compile(Main.java:342)
	at com.sun.tools.javac.main.Main.compile(Main.java:333)
	at com.sun.tools.javac.Main.compile(Main.java:94)
	at sun.reflect.NativeMethodAccessorImpl.invoke0(Native Method)
	at sun.reflect.NativeMethodAccessorImpl.invoke(NativeMethodAccessorImpl.java:57)
	at sun.reflect.DelegatingMethodAccessorImpl.invoke(DelegatingMethodAccessorImpl.java:43)
	at java.lang.reflect.Method.invoke(Method.java:606)
	at org.codehaus.plexus.compiler.javac.JavacCompiler.compileInProcess(JavacCompiler.java:554)
	at org.codehaus.plexus.compiler.javac.JavacCompiler.compile(JavacCompiler.java:161)
	at org.apache.maven.plugin.AbstractCompilerMojo.execute(AbstractCompilerMojo.java:605)
	at org.apache.maven.plugin.TestCompilerMojo.execute(TestCompilerMojo.java:161)
	at org.apache.maven.plugin.DefaultBuildPluginManager.executeMojo(DefaultBuildPluginManager.java:134)
	at org.apache.maven.lifecycle.internal.MojoExecutor.execute(MojoExecutor.java:207)
	at org.apache.maven.lifecycle.internal.MojoExecutor.execute(MojoExecutor.java:153)
	at org.apache.maven.lifecycle.internal.MojoExecutor.execute(MojoExecutor.java:145)
	at org.apache.maven.lifecycle.internal.LifecycleModuleBuilder.buildProject(LifecycleModuleBuilder.java:116)
	at org.apache.maven.lifecycle.internal.LifecycleModuleBuilder.buildProject(LifecycleModuleBuilder.java:80)
	at org.apache.maven.lifecycle.internal.builder.singlethreaded.SingleThreadedBuilder.build(SingleThreadedBuilder.java:51)

[INFO] 1 error
[INFO] -------------------------------------------------------------
[INFO] ------------------------------------------------------------------------
[INFO] Reactor Summary:
[INFO] 
[INFO] cayenne-parent: Top-level parent of Cayenne modules  SUCCESS [  1.051 s]
[INFO] build-tools-parent: Cayenne Build Tools Parent ..... SUCCESS [  0.040 s]
[INFO] cayenne-legal: Cayenne License and Notice Bundle ... SUCCESS [  2.338 s]
[INFO] cayenne-test-utilities: Common Unit Test Utilities . SUCCESS [  1.182 s]
[INFO] cayenne-checkers: Cayenne Code Checkers ............ SUCCESS [  0.082 s]
[INFO] cayenne-di: Cayenne Dependency Injection Container . SUCCESS [ 14.996 s]
[INFO] cayenne-server: Cayenne Server ..................... SUCCESS [02:41 min]
[INFO] cayenne-client: Cayenne ROP Client ................. SUCCESS [ 54.862 s]
[INFO] cayenne-project: Cayenne Project ................... SUCCESS [ 10.583 s]
[INFO] cayenne-dbsync: Database Synchronization Tools ..... SUCCESS [ 48.101 s]
[INFO] cayenne-cgen: Cayenne Class Generation Tools ....... SUCCESS [  4.253 s]
[INFO] cayenne-ant: Cayenne Ant Tasks ..................... SUCCESS [ 10.969 s]
[INFO] cayenne-lifecycle: Cayenne Lifecycle Utilities ..... SUCCESS [ 16.064 s]
[INFO] cayenne-maven-plugins-parent: Maven Plugins parent . SUCCESS [  0.547 s]
[INFO] cayenne-maven-plugin: Cayenne Maven Plugin ......... SUCCESS [ 35.352 s]
[INFO] cayenne-crypto: Cayenne Cryptography Extensions .... SUCCESS [ 13.772 s]
[INFO] cayenne-joda: Cayenne Joda Extensions .............. SUCCESS [  5.921 s]
[INFO] cayenne-dbcp2: Cayenne DBCP2 Extension ............. SUCCESS [  4.218 s]
[INFO] cayenne-jcache: Cayenne JCache Integration ......... SUCCESS [ 14.635 s]
[INFO] cayenne-cache-invalidation: Cayenne Cache Invalidation SUCCESS [  4.998 s]
[INFO] cayenne-itests-parent: Integration Tests Parent .... SUCCESS [  0.008 s]
[INFO] cayenne-tools-itest: Tools integration tests ....... SUCCESS [  6.516 s]
[INFO] cayenne-modeler-parent: Cayenne Modeler Parent ..... SUCCESS [  0.025 s]
[INFO] cayenne-wocompat: WebObjects Compatibility Library . SUCCESS [  7.005 s]
[INFO] cayenne-modeler: Cayenne Modeler Core .............. SUCCESS [ 19.724 s]
[INFO] cayenne-modeler-generic-ext: Modeler Generic Extensions SUCCESS [  2.149 s]
[INFO] cayenne-modeler-generic: Modeler Generic Assembly .. SUCCESS [  0.774 s]
[INFO] cayenne-modeler-mac-ext: Modeler MacOS Extensions .. SUCCESS [  2.170 s]
[INFO] cayenne-modeler-mac: Modeler MacOS Assembly ........ SUCCESS [  0.708 s]
[INFO] cayenne-modeler-win-ext: Modeler Win Extensions .... SUCCESS [  2.021 s]
[INFO] cayenne-modeler-win: Modeler Windows Assembly ...... SUCCESS [  0.763 s]
[INFO] maven-cayenne-plugin: Deprecated Cayenne Maven Plugin SUCCESS [ 11.584 s]
[INFO] cayenne-modeler-maven-plugin: Cayenne Modeler Maven Plugin SUCCESS [  4.425 s]
[INFO] cayenne-tutorials-parent: Cayenne Tutorials ........ SUCCESS [  0.017 s]
[INFO] tutorial: ayenne Tutorial .......................... SUCCESS [  1.146 s]
[INFO] tutorial-rop-server: Cayenne ROP Server Tutorial ... SUCCESS [  2.324 s]
[INFO] tutorial-rop-client: Cayenne ROP Client Tutorial ... SUCCESS [  1.054 s]
[INFO] cayenne-docs-parent: Cayenne Documenation Parent ... SUCCESS [  0.034 s]
[INFO] cayenne-doc: Cayenne Documentation ................. SUCCESS [ 39.517 s]
[INFO] cayenne-docbook: Cayenne Docbook Documentation ..... SUCCESS [  1.083 s]
[INFO] docbook-stylesheets: Docbook - Cayenne Stylesheets . SUCCESS [  0.089 s]
[INFO] cayenne-guide: Docbook - Cayenne Guide ............. SUCCESS [ 17.941 s]
[INFO] getting-started: Docbook - Getting Started with Cayenne SUCCESS [  5.313 s]
[INFO] getting-started-rop: Docbook - Getting Started with Cayenne ROP SUCCESS [  3.161 s]
[INFO] upgrade-guide: Docbook - Cayenne New Features and Upgrade Guide SUCCESS [  2.442 s]
[INFO] cayenne-eventbridges-parent: Event bridges implementations parent SUCCESS [  0.089
s]
[INFO] cayenne-jgroups: Cayenne JGroups Event bridge ...... SUCCESS [  2.191 s]
[INFO] cayenne-jms: Cayenne JMS Event bridge .............. FAILURE [  5.136 s]
[INFO] cayenne-xmpp: Cayenne XMPP Event bridge ............ SKIPPED
[INFO] ------------------------------------------------------------------------
[INFO] BUILD FAILURE
[INFO] ------------------------------------------------------------------------
[INFO] Total time: 09:07 min
[INFO] Finished at: 2017-04-05T09:37:26+00:00
[INFO] Final Memory: 60M/381M
[INFO] ------------------------------------------------------------------------
[ERROR] Failed to execute goal org.apache.maven.plugins:maven-compiler-plugin:2.3.2:testCompile
(default-testCompile) on project cayenne-jms: Compilation failure
[ERROR] Failure executing javac, but could not parse the error:
[ERROR] 
[ERROR] 
[ERROR] The system is out of resources.
[ERROR] Consult the following stack trace for details.
[ERROR] java.lang.OutOfMemoryError: PermGen space
[ERROR] at java.lang.ClassLoader.defineClass1(Native Method)
[ERROR] at java.lang.ClassLoader.defineClass(ClassLoader.java:800)
[ERROR] at java.security.SecureClassLoader.defineClass(SecureClassLoader.java:142)
[ERROR] at java.net.URLClassLoader.defineClass(URLClassLoader.java:449)
[ERROR] at java.net.URLClassLoader.access$100(URLClassLoader.java:71)
[ERROR] at java.net.URLClassLoader$1.run(URLClassLoader.java:361)
[ERROR] at java.net.URLClassLoader$1.run(URLClassLoader.java:355)
[ERROR] at java.security.AccessController.doPrivileged(Native Method)
[ERROR] at java.net.URLClassLoader.findClass(URLClassLoader.java:354)
[ERROR] at org.codehaus.plexus.compiler.javac.IsolatedClassLoader.loadClass(IsolatedClassLoader.java:56)
[ERROR] at com.sun.tools.javac.main.JavaCompiler.<init>(JavaCompiler.java:355)
[ERROR] at com.sun.tools.javac.main.JavaCompiler.instance(JavaCompiler.java:88)
[ERROR] at com.sun.tools.javac.main.Main.compile(Main.java:424)
[ERROR] at com.sun.tools.javac.main.Main.compile(Main.java:353)
[ERROR] at com.sun.tools.javac.main.Main.compile(Main.java:342)
[ERROR] at com.sun.tools.javac.main.Main.compile(Main.java:333)
[ERROR] at com.sun.tools.javac.Main.compile(Main.java:94)
[ERROR] at sun.reflect.NativeMethodAccessorImpl.invoke0(Native Method)
[ERROR] at sun.reflect.NativeMethodAccessorImpl.invoke(NativeMethodAccessorImpl.java:57)
[ERROR] at sun.reflect.DelegatingMethodAccessorImpl.invoke(DelegatingMethodAccessorImpl.java:43)
[ERROR] at java.lang.reflect.Method.invoke(Method.java:606)
[ERROR] at org.codehaus.plexus.compiler.javac.JavacCompiler.compileInProcess(JavacCompiler.java:554)
[ERROR] at org.codehaus.plexus.compiler.javac.JavacCompiler.compile(JavacCompiler.java:161)
[ERROR] at org.apache.maven.plugin.AbstractCompilerMojo.execute(AbstractCompilerMojo.java:605)
[ERROR] at org.apache.maven.plugin.TestCompilerMojo.execute(TestCompilerMojo.java:161)
[ERROR] at org.apache.maven.plugin.DefaultBuildPluginManager.executeMojo(DefaultBuildPluginManager.java:134)
[ERROR] at org.apache.maven.lifecycle.internal.MojoExecutor.execute(MojoExecutor.java:207)
[ERROR] at org.apache.maven.lifecycle.internal.MojoExecutor.execute(MojoExecutor.java:153)
[ERROR] at org.apache.maven.lifecycle.internal.MojoExecutor.execute(MojoExecutor.java:145)
[ERROR] at org.apache.maven.lifecycle.internal.LifecycleModuleBuilder.buildProject(LifecycleModuleBuilder.java:116)
[ERROR] at org.apache.maven.lifecycle.internal.LifecycleModuleBuilder.buildProject(LifecycleModuleBuilder.java:80)
[ERROR] at org.apache.maven.lifecycle.internal.builder.singlethreaded.SingleThreadedBuilder.build(SingleThreadedBuilder.java:51)
[ERROR] -> [Help 1]
org.apache.maven.lifecycle.LifecycleExecutionException: Failed to execute goal org.apache.maven.plugins:maven-compiler-plugin:2.3.2:testCompile
(default-testCompile) on project cayenne-jms: Compilation failure
Failure executing javac, but could not parse the error:


The system is out of resources.
Consult the following stack trace for details.
java.lang.OutOfMemoryError: PermGen space
	at java.lang.ClassLoader.defineClass1(Native Method)
	at java.lang.ClassLoader.defineClass(ClassLoader.java:800)
	at java.security.SecureClassLoader.defineClass(SecureClassLoader.java:142)
	at java.net.URLClassLoader.defineClass(URLClassLoader.java:449)
	at java.net.URLClassLoader.access$100(URLClassLoader.java:71)
	at java.net.URLClassLoader$1.run(URLClassLoader.java:361)
	at java.net.URLClassLoader$1.run(URLClassLoader.java:355)
	at java.security.AccessController.doPrivileged(Native Method)
	at java.net.URLClassLoader.findClass(URLClassLoader.java:354)
	at org.codehaus.plexus.compiler.javac.IsolatedClassLoader.loadClass(IsolatedClassLoader.java:56)
	at com.sun.tools.javac.main.JavaCompiler.<init>(JavaCompiler.java:355)
	at com.sun.tools.javac.main.JavaCompiler.instance(JavaCompiler.java:88)
	at com.sun.tools.javac.main.Main.compile(Main.java:424)
	at com.sun.tools.javac.main.Main.compile(Main.java:353)
	at com.sun.tools.javac.main.Main.compile(Main.java:342)
	at com.sun.tools.javac.main.Main.compile(Main.java:333)
	at com.sun.tools.javac.Main.compile(Main.java:94)
	at sun.reflect.NativeMethodAccessorImpl.invoke0(Native Method)
	at sun.reflect.NativeMethodAccessorImpl.invoke(NativeMethodAccessorImpl.java:57)
	at sun.reflect.DelegatingMethodAccessorImpl.invoke(DelegatingMethodAccessorImpl.java:43)
	at java.lang.reflect.Method.invoke(Method.java:606)
	at org.codehaus.plexus.compiler.javac.JavacCompiler.compileInProcess(JavacCompiler.java:554)
	at org.codehaus.plexus.compiler.javac.JavacCompiler.compile(JavacCompiler.java:161)
	at org.apache.maven.plugin.AbstractCompilerMojo.execute(AbstractCompilerMojo.java:605)
	at org.apache.maven.plugin.TestCompilerMojo.execute(TestCompilerMojo.java:161)
	at org.apache.maven.plugin.DefaultBuildPluginManager.executeMojo(DefaultBuildPluginManager.java:134)
	at org.apache.maven.lifecycle.internal.MojoExecutor.execute(MojoExecutor.java:207)
	at org.apache.maven.lifecycle.internal.MojoExecutor.execute(MojoExecutor.java:153)
	at org.apache.maven.lifecycle.internal.MojoExecutor.execute(MojoExecutor.java:145)
	at org.apache.maven.lifecycle.internal.LifecycleModuleBuilder.buildProject(LifecycleModuleBuilder.java:116)
	at org.apache.maven.lifecycle.internal.LifecycleModuleBuilder.buildProject(LifecycleModuleBuilder.java:80)
	at org.apache.maven.lifecycle.internal.builder.singlethreaded.SingleThreadedBuilder.build(SingleThreadedBuilder.java:51)


	at org.apache.maven.lifecycle.internal.MojoExecutor.execute(MojoExecutor.java:212)
	at org.apache.maven.lifecycle.internal.MojoExecutor.execute(MojoExecutor.java:153)
	at org.apache.maven.lifecycle.internal.MojoExecutor.execute(MojoExecutor.java:145)
	at org.apache.maven.lifecycle.internal.LifecycleModuleBuilder.buildProject(LifecycleModuleBuilder.java:116)
	at org.apache.maven.lifecycle.internal.LifecycleModuleBuilder.buildProject(LifecycleModuleBuilder.java:80)
	at org.apache.maven.lifecycle.internal.builder.singlethreaded.SingleThreadedBuilder.build(SingleThreadedBuilder.java:51)
	at org.apache.maven.lifecycle.internal.LifecycleStarter.execute(LifecycleStarter.java:128)
	at org.apache.maven.DefaultMaven.doExecute(DefaultMaven.java:307)
	at org.apache.maven.DefaultMaven.doExecute(DefaultMaven.java:193)
	at org.apache.maven.DefaultMaven.execute(DefaultMaven.java:106)
	at org.apache.maven.cli.MavenCli.execute(MavenCli.java:863)
	at org.apache.maven.cli.MavenCli.doMain(MavenCli.java:288)
	at org.apache.maven.cli.MavenCli.main(MavenCli.java:199)
	at sun.reflect.NativeMethodAccessorImpl.invoke0(Native Method)
	at sun.reflect.NativeMethodAccessorImpl.invoke(NativeMethodAccessorImpl.java:57)
	at sun.reflect.DelegatingMethodAccessorImpl.invoke(DelegatingMethodAccessorImpl.java:43)
	at java.lang.reflect.Method.invoke(Method.java:606)
	at org.codehaus.plexus.classworlds.launcher.Launcher.launchEnhanced(Launcher.java:289)
	at org.codehaus.plexus.classworlds.launcher.Launcher.launch(Launcher.java:229)
	at org.codehaus.plexus.classworlds.launcher.Launcher.mainWithExitCode(Launcher.java:415)
	at org.codehaus.plexus.classworlds.launcher.Launcher.main(Launcher.java:356)
Caused by: org.apache.maven.plugin.CompilationFailureException: Compilation failure
Failure executing javac, but could not parse the error:


The system is out of resources.
Consult the following stack trace for details.
java.lang.OutOfMemoryError: PermGen space
	at java.lang.ClassLoader.defineClass1(Native Method)
	at java.lang.ClassLoader.defineClass(ClassLoader.java:800)
	at java.security.SecureClassLoader.defineClass(SecureClassLoader.java:142)
	at java.net.URLClassLoader.defineClass(URLClassLoader.java:449)
	at java.net.URLClassLoader.access$100(URLClassLoader.java:71)
	at java.net.URLClassLoader$1.run(URLClassLoader.java:361)
	at java.net.URLClassLoader$1.run(URLClassLoader.java:355)
	at java.security.AccessController.doPrivileged(Native Method)
	at java.net.URLClassLoader.findClass(URLClassLoader.java:354)
	at org.codehaus.plexus.compiler.javac.IsolatedClassLoader.loadClass(IsolatedClassLoader.java:56)
	at com.sun.tools.javac.main.JavaCompiler.<init>(JavaCompiler.java:355)
	at com.sun.tools.javac.main.JavaCompiler.instance(JavaCompiler.java:88)
	at com.sun.tools.javac.main.Main.compile(Main.java:424)
	at com.sun.tools.javac.main.Main.compile(Main.java:353)
	at com.sun.tools.javac.main.Main.compile(Main.java:342)
	at com.sun.tools.javac.main.Main.compile(Main.java:333)
	at com.sun.tools.javac.Main.compile(Main.java:94)
	at sun.reflect.NativeMethodAccessorImpl.invoke0(Native Method)
	at sun.reflect.NativeMethodAccessorImpl.invoke(NativeMethodAccessorImpl.java:57)
	at sun.reflect.DelegatingMethodAccessorImpl.invoke(DelegatingMethodAccessorImpl.java:43)
	at java.lang.reflect.Method.invoke(Method.java:606)
	at org.codehaus.plexus.compiler.javac.JavacCompiler.compileInProcess(JavacCompiler.java:554)
	at org.codehaus.plexus.compiler.javac.JavacCompiler.compile(JavacCompiler.java:161)
	at org.apache.maven.plugin.AbstractCompilerMojo.execute(AbstractCompilerMojo.java:605)
	at org.apache.maven.plugin.TestCompilerMojo.execute(TestCompilerMojo.java:161)
	at org.apache.maven.plugin.DefaultBuildPluginManager.executeMojo(DefaultBuildPluginManager.java:134)
	at org.apache.maven.lifecycle.internal.MojoExecutor.execute(MojoExecutor.java:207)
	at org.apache.maven.lifecycle.internal.MojoExecutor.execute(MojoExecutor.java:153)
	at org.apache.maven.lifecycle.internal.MojoExecutor.execute(MojoExecutor.java:145)
	at org.apache.maven.lifecycle.internal.LifecycleModuleBuilder.buildProject(LifecycleModuleBuilder.java:116)
	at org.apache.maven.lifecycle.internal.LifecycleModuleBuilder.buildProject(LifecycleModuleBuilder.java:80)
	at org.apache.maven.lifecycle.internal.builder.singlethreaded.SingleThreadedBuilder.build(SingleThreadedBuilder.java:51)


	at org.apache.maven.plugin.AbstractCompilerMojo.execute(AbstractCompilerMojo.java:656)
	at org.apache.maven.plugin.TestCompilerMojo.execute(TestCompilerMojo.java:161)
	at org.apache.maven.plugin.DefaultBuildPluginManager.executeMojo(DefaultBuildPluginManager.java:134)
	at org.apache.maven.lifecycle.internal.MojoExecutor.execute(MojoExecutor.java:207)
	... 20 more
[ERROR] 
[ERROR] Re-run Maven using the -X switch to enable full debug logging.
[ERROR] 
[ERROR] For more information about the errors and possible solutions, please read the following
articles:
[ERROR] [Help 1] http://cwiki.apache.org/confluence/display/MAVEN/MojoFailureException
[ERROR] 
[ERROR] After correcting the problems, you can resume the build with the command
[ERROR]   mvn <goals> -rf :cayenne-jms
Build step 'Invoke top-level Maven targets' marked build as failure
Recording test results

Mime
View raw message