cayenne-commits mailing list archives

Site index · List index
Message view « Date » · « Thread »
Top « Date » · « Thread »
From Apache Jenkins Server <jenk...@builds.apache.org>
Subject Build failed in Jenkins: cayenne-master » derby,JDK 1.7 (latest),ubuntu #671
Date Thu, 08 Jun 2017 09:38:19 GMT
See <https://builds.apache.org/job/cayenne-master/cayenneTestConnection=derby,jdk=JDK%201.7%20(latest),slave=ubuntu/671/display/redirect?page=changes>

Changes:

[drekoas] Save a cell change by mouse click in the table

[drekoas] CAY-2328 Update tutorial code

[stariy95] Change version of ognl as latest available is bogus.

[stariy95] Enaable tutorial compilation only on java 8

------------------------------------------
[...truncated 9.63 MB...]
[INFO] Failsafe report directory: <https://builds.apache.org/job/cayenne-master/cayenneTestConnection=derby,jdk=JDK%201.7%20(latest),slave=ubuntu/ws/modeler/cayenne-modeler-mac/target/failsafe-reports>
[INFO] 
[INFO] ------------------------------------------------------------------------
[INFO] Building cayenne-modeler-win-ext: Modeler Win Extensions 4.1.M1-SNAPSHOT
[INFO] ------------------------------------------------------------------------
[INFO] 
[INFO] --- maven-clean-plugin:2.5:clean (default-clean) @ cayenne-modeler-win-ext ---
[INFO] 
[INFO] --- maven-checkstyle-plugin:2.17:check (default) @ cayenne-modeler-win-ext ---
[INFO] 
[INFO] >>> maven-pmd-plugin:3.8:check (default) > :pmd @ cayenne-modeler-win-ext
>>>
[INFO] 
[INFO] --- maven-pmd-plugin:3.8:pmd (pmd) @ cayenne-modeler-win-ext ---
[INFO] 
[INFO] <<< maven-pmd-plugin:3.8:check (default) < :pmd @ cayenne-modeler-win-ext
<<<
[INFO] 
[INFO] 
[INFO] --- maven-pmd-plugin:3.8:check (default) @ cayenne-modeler-win-ext ---
[INFO] 
[INFO] --- maven-remote-resources-plugin:1.5:process (default) @ cayenne-modeler-win-ext ---
[INFO] 
[INFO] --- maven-resources-plugin:3.0.2:resources (default-resources) @ cayenne-modeler-win-ext
---
[INFO] Using 'UTF-8' encoding to copy filtered resources.
[INFO] skip non existing resourceDirectory <https://builds.apache.org/job/cayenne-master/cayenneTestConnection=derby,jdk=JDK%201.7%20(latest),slave=ubuntu/ws/modeler/cayenne-modeler-win-ext/src/main/resources>
[INFO] Copying 2 resources
[INFO] 
[INFO] --- maven-compiler-plugin:3.6.1:compile (default-compile) @ cayenne-modeler-win-ext
---
[INFO] Changes detected - recompiling the module!
[INFO] Compiling 4 source files to <https://builds.apache.org/job/cayenne-master/cayenneTestConnection=derby,jdk=JDK%201.7%20(latest),slave=ubuntu/ws/modeler/cayenne-modeler-win-ext/target/classes>
[INFO] 
[INFO] --- maven-resources-plugin:3.0.2:testResources (default-testResources) @ cayenne-modeler-win-ext
---
[INFO] Using 'UTF-8' encoding to copy filtered resources.
[INFO] skip non existing resourceDirectory <https://builds.apache.org/job/cayenne-master/cayenneTestConnection=derby,jdk=JDK%201.7%20(latest),slave=ubuntu/ws/modeler/cayenne-modeler-win-ext/src/test/resources>
[INFO] Copying 6 resources
[INFO] 
[INFO] --- maven-compiler-plugin:3.6.1:testCompile (default-testCompile) @ cayenne-modeler-win-ext
---
[INFO] No sources to compile
[INFO] 
[INFO] --- maven-surefire-plugin:2.20:test (default-test) @ cayenne-modeler-win-ext ---
[INFO] 
[INFO] --- maven-jar-plugin:3.0.2:jar (default-jar) @ cayenne-modeler-win-ext ---
[INFO] Building jar: <https://builds.apache.org/job/cayenne-master/cayenneTestConnection=derby,jdk=JDK%201.7%20(latest),slave=ubuntu/ws/modeler/cayenne-modeler-win-ext/target/cayenne-modeler-win-ext-4.1.M1-SNAPSHOT.jar>
[INFO] 
[INFO] >>> maven-source-plugin:3.0.1:jar (bundle-source-jar) > generate-sources
@ cayenne-modeler-win-ext >>>
[INFO] 
[INFO] <<< maven-source-plugin:3.0.1:jar (bundle-source-jar) < generate-sources
@ cayenne-modeler-win-ext <<<
[INFO] 
[INFO] 
[INFO] --- maven-source-plugin:3.0.1:jar (bundle-source-jar) @ cayenne-modeler-win-ext ---
[INFO] Building jar: <https://builds.apache.org/job/cayenne-master/cayenneTestConnection=derby,jdk=JDK%201.7%20(latest),slave=ubuntu/ws/modeler/cayenne-modeler-win-ext/target/cayenne-modeler-win-ext-4.1.M1-SNAPSHOT-sources.jar>
[INFO] 
[INFO] --- maven-failsafe-plugin:2.20:integration-test (integration-test) @ cayenne-modeler-win-ext
---
[INFO] 
[INFO] --- maven-failsafe-plugin:2.20:verify (integration-test) @ cayenne-modeler-win-ext
---
[INFO] Failsafe report directory: <https://builds.apache.org/job/cayenne-master/cayenneTestConnection=derby,jdk=JDK%201.7%20(latest),slave=ubuntu/ws/modeler/cayenne-modeler-win-ext/target/failsafe-reports>
[INFO] 
[INFO] ------------------------------------------------------------------------
[INFO] Building cayenne-modeler-win: Modeler Windows Assembly 4.1.M1-SNAPSHOT
[INFO] ------------------------------------------------------------------------
[INFO] 
[INFO] --- maven-clean-plugin:2.5:clean (default-clean) @ cayenne-modeler-win ---
[INFO] 
[INFO] --- maven-checkstyle-plugin:2.17:check (default) @ cayenne-modeler-win ---
[INFO] 
[INFO] >>> maven-pmd-plugin:3.8:check (default) > :pmd @ cayenne-modeler-win >>>
[INFO] 
[INFO] --- maven-pmd-plugin:3.8:pmd (pmd) @ cayenne-modeler-win ---
[INFO] 
[INFO] <<< maven-pmd-plugin:3.8:check (default) < :pmd @ cayenne-modeler-win <<<
[INFO] 
[INFO] 
[INFO] --- maven-pmd-plugin:3.8:check (default) @ cayenne-modeler-win ---
[INFO] 
[INFO] --- maven-remote-resources-plugin:1.5:process (default) @ cayenne-modeler-win ---
[INFO] 
[INFO] --- maven-resources-plugin:3.0.2:resources (default-resources) @ cayenne-modeler-win
---
[INFO] Using 'UTF-8' encoding to copy filtered resources.
[INFO] skip non existing resourceDirectory <https://builds.apache.org/job/cayenne-master/cayenneTestConnection=derby,jdk=JDK%201.7%20(latest),slave=ubuntu/ws/modeler/cayenne-modeler-win/target/modeler>
[INFO] Copying 2 resources
[INFO] 
[INFO] --- maven-compiler-plugin:3.6.1:compile (default-compile) @ cayenne-modeler-win ---
[INFO] No sources to compile
[INFO] 
[INFO] --- maven-resources-plugin:3.0.2:testResources (default-testResources) @ cayenne-modeler-win
---
[INFO] Using 'UTF-8' encoding to copy filtered resources.
[INFO] skip non existing resourceDirectory <https://builds.apache.org/job/cayenne-master/cayenneTestConnection=derby,jdk=JDK%201.7%20(latest),slave=ubuntu/ws/modeler/cayenne-modeler-win/src/test/resources>
[INFO] Copying 2 resources
[INFO] 
[INFO] --- maven-compiler-plugin:3.6.1:testCompile (default-testCompile) @ cayenne-modeler-win
---
[INFO] No sources to compile
[INFO] 
[INFO] --- maven-surefire-plugin:2.20:test (default-test) @ cayenne-modeler-win ---
[INFO] 
[INFO] --- maven-jar-plugin:3.0.2:jar (default-jar) @ cayenne-modeler-win ---
[INFO] Building jar: <https://builds.apache.org/job/cayenne-master/cayenneTestConnection=derby,jdk=JDK%201.7%20(latest),slave=ubuntu/ws/modeler/cayenne-modeler-win/target/cayenne-modeler-win-4.1.M1-SNAPSHOT.jar>
[INFO] 
[INFO] >>> maven-source-plugin:3.0.1:jar (bundle-source-jar) > generate-sources
@ cayenne-modeler-win >>>
[INFO] 
[INFO] <<< maven-source-plugin:3.0.1:jar (bundle-source-jar) < generate-sources
@ cayenne-modeler-win <<<
[INFO] 
[INFO] 
[INFO] --- maven-source-plugin:3.0.1:jar (bundle-source-jar) @ cayenne-modeler-win ---
[INFO] Building jar: <https://builds.apache.org/job/cayenne-master/cayenneTestConnection=derby,jdk=JDK%201.7%20(latest),slave=ubuntu/ws/modeler/cayenne-modeler-win/target/cayenne-modeler-win-4.1.M1-SNAPSHOT-sources.jar>
[INFO] 
[INFO] --- maven-failsafe-plugin:2.20:integration-test (integration-test) @ cayenne-modeler-win
---
[INFO] 
[INFO] --- maven-failsafe-plugin:2.20:verify (integration-test) @ cayenne-modeler-win ---
[INFO] Failsafe report directory: <https://builds.apache.org/job/cayenne-master/cayenneTestConnection=derby,jdk=JDK%201.7%20(latest),slave=ubuntu/ws/modeler/cayenne-modeler-win/target/failsafe-reports>
[INFO] 
[INFO] ------------------------------------------------------------------------
[INFO] Building cayenne-tutorials-parent: Cayenne Tutorials 4.1.M1-SNAPSHOT
[INFO] ------------------------------------------------------------------------
[INFO] 
[INFO] --- maven-clean-plugin:2.5:clean (default-clean) @ cayenne-tutorials-parent ---
[INFO] 
[INFO] --- maven-remote-resources-plugin:1.5:process (default) @ cayenne-tutorials-parent
---
[INFO] 
[INFO] >>> maven-source-plugin:3.0.1:jar (bundle-source-jar) > generate-sources
@ cayenne-tutorials-parent >>>
[INFO] 
[INFO] <<< maven-source-plugin:3.0.1:jar (bundle-source-jar) < generate-sources
@ cayenne-tutorials-parent <<<
[INFO] 
[INFO] 
[INFO] --- maven-source-plugin:3.0.1:jar (bundle-source-jar) @ cayenne-tutorials-parent ---
[INFO] 
[INFO] --- maven-failsafe-plugin:2.20:integration-test (integration-test) @ cayenne-tutorials-parent
---
[INFO] No tests to run.
[INFO] 
[INFO] --- maven-failsafe-plugin:2.20:verify (integration-test) @ cayenne-tutorials-parent
---
[INFO] Failsafe report directory: <https://builds.apache.org/job/cayenne-master/cayenneTestConnection=derby,jdk=JDK%201.7%20(latest),slave=ubuntu/ws/tutorials/target/failsafe-reports>
[INFO] 
[INFO] ------------------------------------------------------------------------
[INFO] Building tutorial: Cayenne Tutorial 4.1.M1-SNAPSHOT
[INFO] ------------------------------------------------------------------------
[WARNING] The POM for org.apache.cayenne:cayenne-java8:jar:4.1.M1-SNAPSHOT is missing, no
dependency information available
[INFO] ------------------------------------------------------------------------
[INFO] Reactor Summary:
[INFO] 
[INFO] cayenne-parent: Top-level parent of Cayenne modules  SUCCESS [  2.268 s]
[INFO] build-tools-parent: Cayenne Build Tools Parent ..... SUCCESS [  0.087 s]
[INFO] cayenne-legal: Cayenne License and Notice Bundle ... SUCCESS [  1.703 s]
[INFO] cayenne-test-utilities: Common Unit Test Utilities . SUCCESS [  4.583 s]
[INFO] cayenne-checkers: Cayenne Code Checkers ............ SUCCESS [  0.091 s]
[INFO] cayenne-di: Cayenne Dependency Injection Container . SUCCESS [  6.070 s]
[INFO] cayenne-server: Cayenne Server ..................... SUCCESS [02:29 min]
[INFO] cayenne-project: Cayenne Project ................... SUCCESS [  3.488 s]
[INFO] cayenne-dbsync: Database Synchronization Tools ..... SUCCESS [ 29.874 s]
[INFO] cayenne-cgen: Cayenne Class Generation Tools ....... SUCCESS [  2.052 s]
[INFO] cayenne-ant: Cayenne Ant Tasks ..................... SUCCESS [  9.001 s]
[INFO] cayenne-cache-invalidation: Cayenne Cache Invalidation SUCCESS [  4.489 s]
[INFO] cayenne-client: Cayenne ROP Client ................. SUCCESS [ 35.240 s]
[INFO] cayenne-commitlog: Cayenne Commit Log Module ....... SUCCESS [  4.380 s]
[INFO] cayenne-maven-plugins-parent: Maven Plugins parent . SUCCESS [  0.521 s]
[INFO] cayenne-maven-plugin: Cayenne Maven Plugin ......... SUCCESS [ 35.555 s]
[INFO] cayenne-crypto: Cayenne Cryptography Extensions .... SUCCESS [  7.539 s]
[INFO] cayenne-dbcp2: Cayenne DBCP2 Extension ............. SUCCESS [  2.338 s]
[INFO] cayenne-gradle-plugin: Cayenne Gradle Plugin ....... SUCCESS [01:15 min]
[INFO] cayenne-jcache: Cayenne JCache Integration ......... SUCCESS [  8.416 s]
[INFO] cayenne-joda: Cayenne Joda Extensions .............. SUCCESS [  3.439 s]
[INFO] cayenne-lifecycle: Cayenne Lifecycle Utilities ..... SUCCESS [  6.890 s]
[INFO] cayenne-eventbridges-parent: Event bridges implementations parent SUCCESS [  0.074
s]
[INFO] cayenne-jgroups: Cayenne JGroups Event bridge ...... SUCCESS [  1.071 s]
[INFO] cayenne-jms: Cayenne JMS Event bridge .............. SUCCESS [  1.048 s]
[INFO] cayenne-xmpp: Cayenne XMPP Event bridge ............ SUCCESS [  1.168 s]
[INFO] cayenne-itests-parent: Integration Tests Parent .... SUCCESS [  0.022 s]
[INFO] cayenne-tools-itest: Tools integration tests ....... SUCCESS [  2.074 s]
[INFO] maven-cayenne-plugin: Deprecated Cayenne Maven Plugin SUCCESS [  9.262 s]
[INFO] cayenne-modeler-parent: Cayenne Modeler Parent ..... SUCCESS [  0.021 s]
[INFO] cayenne-wocompat: WebObjects Compatibility Library . SUCCESS [  1.647 s]
[INFO] cayenne-modeler: Cayenne Modeler Core .............. SUCCESS [  5.713 s]
[INFO] cayenne-modeler-generic-ext: Modeler Generic Extensions SUCCESS [  0.438 s]
[INFO] cayenne-modeler-maven-plugin: Cayenne Modeler Maven Plugin SUCCESS [  2.910 s]
[INFO] cayenne-modeler-generic: Modeler Generic Assembly .. SUCCESS [  0.204 s]
[INFO] cayenne-modeler-mac-ext: Modeler MacOS Extensions .. SUCCESS [  0.669 s]
[INFO] cayenne-modeler-mac: Modeler MacOS Assembly ........ SUCCESS [  0.311 s]
[INFO] cayenne-modeler-win-ext: Modeler Win Extensions .... SUCCESS [  0.256 s]
[INFO] cayenne-modeler-win: Modeler Windows Assembly ...... SUCCESS [  0.263 s]
[INFO] cayenne-tutorials-parent: Cayenne Tutorials ........ SUCCESS [  0.028 s]
[INFO] tutorial: Cayenne Tutorial ......................... FAILURE [  0.034 s]
[INFO] tutorial-rop-server: Cayenne ROP Server Tutorial ... SKIPPED
[INFO] tutorial-rop-client: Cayenne ROP Client Tutorial ... SKIPPED
[INFO] cayenne-docs-parent: Cayenne Documenation Parent ... SKIPPED
[INFO] cayenne-doc: Cayenne Documentation ................. SKIPPED
[INFO] cayenne-docbook: Cayenne Docbook Documentation ..... SKIPPED
[INFO] docbook-stylesheets: Docbook - Cayenne Stylesheets . SKIPPED
[INFO] cayenne-guide: Docbook - Cayenne Guide ............. SKIPPED
[INFO] getting-started: Docbook - Getting Started with Cayenne SKIPPED
[INFO] getting-started-rop: Docbook - Getting Started with Cayenne ROP SKIPPED
[INFO] upgrade-guide: Docbook - Cayenne New Features and Upgrade Guide SKIPPED
[INFO] ------------------------------------------------------------------------
[INFO] BUILD FAILURE
[INFO] ------------------------------------------------------------------------
[INFO] Total time: 07:04 min
[INFO] Finished at: 2017-06-08T09:38:12Z
[INFO] Final Memory: 85M/397M
[INFO] ------------------------------------------------------------------------
[ERROR] Failed to execute goal on project tutorial: Could not resolve dependencies for project
org.apache.cayenne.tutorials:tutorial:jar:4.1.M1-SNAPSHOT: Could not find artifact org.apache.cayenne:cayenne-java8:jar:4.1.M1-SNAPSHOT
-> [Help 1]
org.apache.maven.lifecycle.LifecycleExecutionException: Failed to execute goal on project
tutorial: Could not resolve dependencies for project org.apache.cayenne.tutorials:tutorial:jar:4.1.M1-SNAPSHOT:
Could not find artifact org.apache.cayenne:cayenne-java8:jar:4.1.M1-SNAPSHOT
	at org.apache.maven.lifecycle.internal.LifecycleDependencyResolver.getDependencies(LifecycleDependencyResolver.java:221)
	at org.apache.maven.lifecycle.internal.LifecycleDependencyResolver.resolveProjectDependencies(LifecycleDependencyResolver.java:127)
	at org.apache.maven.lifecycle.internal.MojoExecutor.ensureDependenciesAreResolved(MojoExecutor.java:246)
	at org.apache.maven.lifecycle.internal.MojoExecutor.execute(MojoExecutor.java:200)
	at org.apache.maven.lifecycle.internal.MojoExecutor.execute(MojoExecutor.java:154)
	at org.apache.maven.lifecycle.internal.MojoExecutor.execute(MojoExecutor.java:146)
	at org.apache.maven.lifecycle.internal.LifecycleModuleBuilder.buildProject(LifecycleModuleBuilder.java:117)
	at org.apache.maven.lifecycle.internal.LifecycleModuleBuilder.buildProject(LifecycleModuleBuilder.java:81)
	at org.apache.maven.lifecycle.internal.builder.singlethreaded.SingleThreadedBuilder.build(SingleThreadedBuilder.java:51)
	at org.apache.maven.lifecycle.internal.LifecycleStarter.execute(LifecycleStarter.java:128)
	at org.apache.maven.DefaultMaven.doExecute(DefaultMaven.java:309)
	at org.apache.maven.DefaultMaven.doExecute(DefaultMaven.java:194)
	at org.apache.maven.DefaultMaven.execute(DefaultMaven.java:107)
	at org.apache.maven.cli.MavenCli.execute(MavenCli.java:993)
	at org.apache.maven.cli.MavenCli.doMain(MavenCli.java:345)
	at org.apache.maven.cli.MavenCli.main(MavenCli.java:191)
	at sun.reflect.NativeMethodAccessorImpl.invoke0(Native Method)
	at sun.reflect.NativeMethodAccessorImpl.invoke(NativeMethodAccessorImpl.java:57)
	at sun.reflect.DelegatingMethodAccessorImpl.invoke(DelegatingMethodAccessorImpl.java:43)
	at java.lang.reflect.Method.invoke(Method.java:606)
	at org.codehaus.plexus.classworlds.launcher.Launcher.launchEnhanced(Launcher.java:289)
	at org.codehaus.plexus.classworlds.launcher.Launcher.launch(Launcher.java:229)
	at org.codehaus.plexus.classworlds.launcher.Launcher.mainWithExitCode(Launcher.java:415)
	at org.codehaus.plexus.classworlds.launcher.Launcher.main(Launcher.java:356)
Caused by: org.apache.maven.project.DependencyResolutionException: Could not resolve dependencies
for project org.apache.cayenne.tutorials:tutorial:jar:4.1.M1-SNAPSHOT: Could not find artifact
org.apache.cayenne:cayenne-java8:jar:4.1.M1-SNAPSHOT
	at org.apache.maven.project.DefaultProjectDependenciesResolver.resolve(DefaultProjectDependenciesResolver.java:208)
	at org.apache.maven.lifecycle.internal.LifecycleDependencyResolver.getDependencies(LifecycleDependencyResolver.java:195)
	... 23 more
Caused by: org.eclipse.aether.resolution.DependencyResolutionException: Could not find artifact
org.apache.cayenne:cayenne-java8:jar:4.1.M1-SNAPSHOT
	at org.eclipse.aether.internal.impl.DefaultRepositorySystem.resolveDependencies(DefaultRepositorySystem.java:393)
	at org.apache.maven.project.DefaultProjectDependenciesResolver.resolve(DefaultProjectDependenciesResolver.java:202)
	... 24 more
Caused by: org.eclipse.aether.resolution.ArtifactResolutionException: Could not find artifact
org.apache.cayenne:cayenne-java8:jar:4.1.M1-SNAPSHOT
	at org.eclipse.aether.internal.impl.DefaultArtifactResolver.resolve(DefaultArtifactResolver.java:453)
	at org.eclipse.aether.internal.impl.DefaultArtifactResolver.resolveArtifacts(DefaultArtifactResolver.java:255)
	at org.eclipse.aether.internal.impl.DefaultRepositorySystem.resolveDependencies(DefaultRepositorySystem.java:376)
	... 25 more
Caused by: org.eclipse.aether.transfer.ArtifactNotFoundException: Could not find artifact
org.apache.cayenne:cayenne-java8:jar:4.1.M1-SNAPSHOT
	at org.eclipse.aether.internal.impl.DefaultArtifactResolver.resolve(DefaultArtifactResolver.java:443)
	... 27 more
[ERROR] 
[ERROR] Re-run Maven using the -X switch to enable full debug logging.
[ERROR] 
[ERROR] For more information about the errors and possible solutions, please read the following
articles:
[ERROR] [Help 1] http://cwiki.apache.org/confluence/display/MAVEN/DependencyResolutionException
[ERROR] 
[ERROR] After correcting the problems, you can resume the build with the command
[ERROR]   mvn <goals> -rf :tutorial
Build step 'Invoke top-level Maven targets' marked build as failure
Recording test results
Not sending mail to unregistered user stariy95@gmail.com
Not sending mail to unregistered user drekoas@gmail.com

Mime
View raw message