cayenne-commits mailing list archives

Site index · List index
Message view « Date » · « Thread »
Top « Date » · « Thread »
From Apache Jenkins Server <jenk...@builds.apache.org>
Subject Build failed in Jenkins: cayenne-master » derby,JDK 1.8 (latest),ubuntu #736
Date Mon, 25 Sep 2017 12:21:40 GMT
See <https://builds.apache.org/job/cayenne-master/cayenneTestConnection=derby,jdk=JDK%201.8%20(latest),slave=ubuntu/736/display/redirect?page=changes>

Changes:

[stariy95] Revert version to 4.1.M1-SNAPSHOT

[stariy95] Throw exception in case of wrong version or namespace in project XML

------------------------------------------
Started by upstream project "cayenne-master" build number 736
originally caused by:
 Started by an SCM change
[EnvInject] - Loading node environment variables.
Building remotely on ubuntu-1 (ubuntu trusty) in workspace <https://builds.apache.org/job/cayenne-master/cayenneTestConnection=derby,jdk=JDK%201.8%20(latest),slave=ubuntu/ws/>
Cloning the remote Git repository
Cloning repository git://git.apache.org/cayenne.git
 > git init <https://builds.apache.org/job/cayenne-master/cayenneTestConnection=derby,jdk=JDK%201.8%20(latest),slave=ubuntu/ws/>
# timeout=10
Fetching upstream changes from git://git.apache.org/cayenne.git
 > git --version # timeout=10
 > git fetch --tags --progress git://git.apache.org/cayenne.git +refs/heads/*:refs/remotes/origin/*
 > git config remote.origin.url git://git.apache.org/cayenne.git # timeout=10
 > git config --add remote.origin.fetch +refs/heads/*:refs/remotes/origin/* # timeout=10
 > git config remote.origin.url git://git.apache.org/cayenne.git # timeout=10
Fetching upstream changes from git://git.apache.org/cayenne.git
 > git fetch --tags --progress git://git.apache.org/cayenne.git +refs/heads/*:refs/remotes/origin/*
Checking out Revision f29c5ab1e853813e0f87dd27263da080c28f2783 (refs/remotes/origin/master)
Commit message: "Throw exception in case of wrong version or namespace in project XML"
 > git config core.sparsecheckout # timeout=10
 > git checkout -f f29c5ab1e853813e0f87dd27263da080c28f2783
 > git rev-list 3fc0943160e2e238e688719397b259be393854f3 # timeout=10
Cleaning workspace
 > git rev-parse --verify HEAD # timeout=10
Resetting working tree
 > git reset --hard # timeout=10
 > git clean -fdx # timeout=10
[ubuntu] $ /home/jenkins/tools/maven/latest3/bin/mvn "-Djdk=JDK 1.8 (latest)" -Dslave=ubuntu
-DcayenneTestConnection=derby -v
Apache Maven 3.5.0 (ff8f5e7444045639af65f6095c62210b5713f426; 2017-04-03T19:39:06Z)
Maven home: /home/jenkins/tools/maven/latest3
Java version: 1.8.0_144, vendor: Oracle Corporation
Java home: /usr/local/asfpackages/java/jdk1.8.0_144/jre
Default locale: en_US, platform encoding: ISO-8859-1
OS name: "linux", version: "3.13.0-123-generic", arch: "amd64", family: "unix"
[ubuntu] $ /home/jenkins/tools/maven/latest3/bin/mvn "-Djdk=JDK 1.8 (latest)" -Dslave=ubuntu
-DcayenneTestConnection=derby -e clean verify
Java HotSpot(TM) 64-Bit Server VM warning: ignoring option MaxPermSize=128m; support was removed
in 8.0
[INFO] Error stacktraces are turned on.
[INFO] Scanning for projects...
[ERROR] [ERROR] Some problems were encountered while processing the POMs:
[FATAL] Non-resolvable parent POM for org.apache.cayenne.plugins:cayenne-gradle-plugin:[unknown-version]:
Could not find artifact org.apache.cayenne:cayenne-parent:pom:4.1.M2-SNAPSHOT and 'parent.relativePath'
points at wrong local POM @ line 22, column 13
 @ 
[ERROR] The build could not read 1 project -> [Help 1]
org.apache.maven.project.ProjectBuildingException: Some problems were encountered while processing
the POMs:
[FATAL] Non-resolvable parent POM for org.apache.cayenne.plugins:cayenne-gradle-plugin:[unknown-version]:
Could not find artifact org.apache.cayenne:cayenne-parent:pom:4.1.M2-SNAPSHOT and 'parent.relativePath'
points at wrong local POM @ line 22, column 13

	at org.apache.maven.project.DefaultProjectBuilder.build(DefaultProjectBuilder.java:382)
	at org.apache.maven.graph.DefaultGraphBuilder.collectProjects(DefaultGraphBuilder.java:400)
	at org.apache.maven.graph.DefaultGraphBuilder.getProjectsForMavenReactor(DefaultGraphBuilder.java:391)
	at org.apache.maven.graph.DefaultGraphBuilder.build(DefaultGraphBuilder.java:78)
	at org.apache.maven.DefaultMaven.buildGraph(DefaultMaven.java:511)
	at org.apache.maven.DefaultMaven.doExecute(DefaultMaven.java:221)
	at org.apache.maven.DefaultMaven.doExecute(DefaultMaven.java:194)
	at org.apache.maven.DefaultMaven.execute(DefaultMaven.java:107)
	at org.apache.maven.cli.MavenCli.execute(MavenCli.java:993)
	at org.apache.maven.cli.MavenCli.doMain(MavenCli.java:345)
	at org.apache.maven.cli.MavenCli.main(MavenCli.java:191)
	at sun.reflect.NativeMethodAccessorImpl.invoke0(Native Method)
	at sun.reflect.NativeMethodAccessorImpl.invoke(NativeMethodAccessorImpl.java:62)
	at sun.reflect.DelegatingMethodAccessorImpl.invoke(DelegatingMethodAccessorImpl.java:43)
	at java.lang.reflect.Method.invoke(Method.java:498)
	at org.codehaus.plexus.classworlds.launcher.Launcher.launchEnhanced(Launcher.java:289)
	at org.codehaus.plexus.classworlds.launcher.Launcher.launch(Launcher.java:229)
	at org.codehaus.plexus.classworlds.launcher.Launcher.mainWithExitCode(Launcher.java:415)
	at org.codehaus.plexus.classworlds.launcher.Launcher.main(Launcher.java:356)
[ERROR]   
[ERROR]   The project org.apache.cayenne.plugins:cayenne-gradle-plugin:[unknown-version] (<https://builds.apache.org/job/cayenne-master/cayenneTestConnection=derby,jdk=JDK%201.8%20(latest),slave=ubuntu/ws/cayenne-gradle-plugin/pom.xml)>
has 1 error
[ERROR]     Non-resolvable parent POM for org.apache.cayenne.plugins:cayenne-gradle-plugin:[unknown-version]:
Could not find artifact org.apache.cayenne:cayenne-parent:pom:4.1.M2-SNAPSHOT and 'parent.relativePath'
points at wrong local POM @ line 22, column 13 -> [Help 2]
org.apache.maven.model.resolution.UnresolvableModelException: Could not find artifact org.apache.cayenne:cayenne-parent:pom:4.1.M2-SNAPSHOT
	at org.apache.maven.project.ProjectModelResolver.resolveModel(ProjectModelResolver.java:197)
	at org.apache.maven.project.ProjectModelResolver.resolveModel(ProjectModelResolver.java:243)
	at org.apache.maven.model.building.DefaultModelBuilder.readParentExternally(DefaultModelBuilder.java:1051)
	at org.apache.maven.model.building.DefaultModelBuilder.readParent(DefaultModelBuilder.java:829)
	at org.apache.maven.model.building.DefaultModelBuilder.build(DefaultModelBuilder.java:331)
	at org.apache.maven.project.DefaultProjectBuilder.build(DefaultProjectBuilder.java:429)
	at org.apache.maven.project.DefaultProjectBuilder.build(DefaultProjectBuilder.java:398)
	at org.apache.maven.project.DefaultProjectBuilder.build(DefaultProjectBuilder.java:515)
	at org.apache.maven.project.DefaultProjectBuilder.build(DefaultProjectBuilder.java:398)
	at org.apache.maven.project.DefaultProjectBuilder.build(DefaultProjectBuilder.java:361)
	at org.apache.maven.graph.DefaultGraphBuilder.collectProjects(DefaultGraphBuilder.java:400)
	at org.apache.maven.graph.DefaultGraphBuilder.getProjectsForMavenReactor(DefaultGraphBuilder.java:391)
	at org.apache.maven.graph.DefaultGraphBuilder.build(DefaultGraphBuilder.java:78)
	at org.apache.maven.DefaultMaven.buildGraph(DefaultMaven.java:511)
	at org.apache.maven.DefaultMaven.doExecute(DefaultMaven.java:221)
	at org.apache.maven.DefaultMaven.doExecute(DefaultMaven.java:194)
	at org.apache.maven.DefaultMaven.execute(DefaultMaven.java:107)
	at org.apache.maven.cli.MavenCli.execute(MavenCli.java:993)
	at org.apache.maven.cli.MavenCli.doMain(MavenCli.java:345)
	at org.apache.maven.cli.MavenCli.main(MavenCli.java:191)
	at sun.reflect.NativeMethodAccessorImpl.invoke0(Native Method)
	at sun.reflect.NativeMethodAccessorImpl.invoke(NativeMethodAccessorImpl.java:62)
	at sun.reflect.DelegatingMethodAccessorImpl.invoke(DelegatingMethodAccessorImpl.java:43)
	at java.lang.reflect.Method.invoke(Method.java:498)
	at org.codehaus.plexus.classworlds.launcher.Launcher.launchEnhanced(Launcher.java:289)
	at org.codehaus.plexus.classworlds.launcher.Launcher.launch(Launcher.java:229)
	at org.codehaus.plexus.classworlds.launcher.Launcher.mainWithExitCode(Launcher.java:415)
	at org.codehaus.plexus.classworlds.launcher.Launcher.main(Launcher.java:356)
Caused by: org.eclipse.aether.resolution.ArtifactResolutionException: Could not find artifact
org.apache.cayenne:cayenne-parent:pom:4.1.M2-SNAPSHOT
	at org.eclipse.aether.internal.impl.DefaultArtifactResolver.resolve(DefaultArtifactResolver.java:453)
	at org.eclipse.aether.internal.impl.DefaultArtifactResolver.resolveArtifacts(DefaultArtifactResolver.java:255)
	at org.eclipse.aether.internal.impl.DefaultArtifactResolver.resolveArtifact(DefaultArtifactResolver.java:232)
	at org.eclipse.aether.internal.impl.DefaultRepositorySystem.resolveArtifact(DefaultRepositorySystem.java:303)
	at org.apache.maven.project.ProjectModelResolver.resolveModel(ProjectModelResolver.java:193)
	... 27 more
Caused by: org.eclipse.aether.transfer.ArtifactNotFoundException: Could not find artifact
org.apache.cayenne:cayenne-parent:pom:4.1.M2-SNAPSHOT
	at org.eclipse.aether.internal.impl.DefaultArtifactResolver.resolve(DefaultArtifactResolver.java:443)
	... 31 more
[ERROR] 
[ERROR] Re-run Maven using the -X switch to enable full debug logging.
[ERROR] 
[ERROR] For more information about the errors and possible solutions, please read the following
articles:
[ERROR] [Help 1] http://cwiki.apache.org/confluence/display/MAVEN/ProjectBuildingException
[ERROR] [Help 2] http://cwiki.apache.org/confluence/display/MAVEN/UnresolvableModelException
Build step 'Invoke top-level Maven targets' marked build as failure
Recording test results
ERROR: Step ?Publish JUnit test result report? failed: No test report files were found. Configuration
error?
Not sending mail to unregistered user stariy95@gmail.com

Mime
View raw message