cayenne-commits mailing list archives

Site index · List index
Message view « Date » · « Thread »
Top « Date » · « Thread »
From Apache Jenkins Server <jenk...@builds.apache.org>
Subject Build failed in Jenkins: cayenne-31 » hsql,JDK 1.8 (latest),ubuntu #148
Date Fri, 05 Jan 2018 14:42:16 GMT
See <https://builds.apache.org/job/cayenne-31/cayenneTestConnection=hsql,jdk=JDK%201.8%20(latest),slave=ubuntu/148/display/redirect?page=changes>

Changes:

[stariy95] CAY-2371 Switch documentation from Docbook to Asciidoctor format

[stariy95] CAY-2371 Switch documentation from Docbook to Asciidoctor format   fix

------------------------------------------
[...truncated 2.46 KB...]
Java HotSpot(TM) 64-Bit Server VM warning: ignoring option MaxPermSize=128m; support was removed
in 8.0
[INFO] Error stacktraces are turned on.
[INFO] Scanning for projects...
Downloading: http://maven.objectstyle.org/nexus/content/groups/cayenne-deps/org/apache/maven/wagon/wagon-ssh/1.0-beta-7/wagon-ssh-1.0-beta-7.pom
3/3 KB            Downloaded: http://maven.objectstyle.org/nexus/content/groups/cayenne-deps/org/apache/maven/wagon/wagon-ssh/1.0-beta-7/wagon-ssh-1.0-beta-7.pom
(3 KB at 4.8 KB/sec)
Downloading: http://maven.objectstyle.org/nexus/content/groups/cayenne-deps/org/apache/maven/wagon/wagon-providers/1.0-beta-7/wagon-providers-1.0-beta-7.pom
3/3 KB            Downloaded: http://maven.objectstyle.org/nexus/content/groups/cayenne-deps/org/apache/maven/wagon/wagon-providers/1.0-beta-7/wagon-providers-1.0-beta-7.pom
(3 KB at 7.7 KB/sec)
Downloading: http://maven.objectstyle.org/nexus/content/groups/cayenne-deps/org/apache/maven/wagon/wagon/1.0-beta-7/wagon-1.0-beta-7.pom
4/12 KB   8/12 KB   12/12 KB              Downloaded: http://maven.objectstyle.org/nexus/content/groups/cayenne-deps/org/apache/maven/wagon/wagon/1.0-beta-7/wagon-1.0-beta-7.pom
(12 KB at 40.3 KB/sec)
Downloading: http://maven.objectstyle.org/nexus/content/groups/cayenne-deps/org/apache/maven/maven-parent/16/maven-parent-16.pom
4/23 KB    8/23 KB   12/23 KB   14/23 KB   18/23 KB   22/23 KB   23/23 KB              Downloaded:
http://maven.objectstyle.org/nexus/content/groups/cayenne-deps/org/apache/maven/maven-parent/16/maven-parent-16.pom
(23 KB at 64.9 KB/sec)
Downloading: http://maven.objectstyle.org/nexus/content/groups/cayenne-deps/org/apache/apache/7/apache-7.pom
4/15 KB    8/15 KB   12/15 KB   15/15 KB              Downloaded: http://maven.objectstyle.org/nexus/content/groups/cayenne-deps/org/apache/apache/7/apache-7.pom
(15 KB at 50.9 KB/sec)
Downloading: http://maven.objectstyle.org/nexus/content/groups/cayenne-deps/com/jcraft/jsch/0.1.38/jsch-0.1.38.pom
967/967 B               Downloaded: http://maven.objectstyle.org/nexus/content/groups/cayenne-deps/com/jcraft/jsch/0.1.38/jsch-0.1.38.pom
(967 B at 3.4 KB/sec)
Downloading: http://maven.objectstyle.org/nexus/content/groups/cayenne-deps/org/codehaus/plexus/plexus-utils/1.4.2/plexus-utils-1.4.2.pom
2/2 KB               Downloaded: http://maven.objectstyle.org/nexus/content/groups/cayenne-deps/org/codehaus/plexus/plexus-utils/1.4.2/plexus-utils-1.4.2.pom
(2 KB at 6.8 KB/sec)
Downloading: http://maven.objectstyle.org/nexus/content/groups/cayenne-deps/org/codehaus/plexus/plexus/1.0.11/plexus-1.0.11.pom
4/9 KB   8/9 KB   9/9 KB            Downloaded: http://maven.objectstyle.org/nexus/content/groups/cayenne-deps/org/codehaus/plexus/plexus/1.0.11/plexus-1.0.11.pom
(9 KB at 32.6 KB/sec)
Downloading: http://maven.objectstyle.org/nexus/content/groups/cayenne-deps/org/apache/maven/wagon/wagon-ssh-common/1.0-beta-7/wagon-ssh-common-1.0-beta-7.pom
2/2 KB            Downloaded: http://maven.objectstyle.org/nexus/content/groups/cayenne-deps/org/apache/maven/wagon/wagon-ssh-common/1.0-beta-7/wagon-ssh-common-1.0-beta-7.pom
(2 KB at 6.7 KB/sec)
Downloading: http://maven.objectstyle.org/nexus/content/groups/cayenne-deps/org/codehaus/plexus/plexus-interactivity-api/1.0-alpha-6/plexus-interactivity-api-1.0-alpha-6.pom
726/726 B               Downloaded: http://maven.objectstyle.org/nexus/content/groups/cayenne-deps/org/codehaus/plexus/plexus-interactivity-api/1.0-alpha-6/plexus-interactivity-api-1.0-alpha-6.pom
(726 B at 2.7 KB/sec)
Downloading: http://maven.objectstyle.org/nexus/content/groups/cayenne-deps/org/codehaus/plexus/plexus-interactivity/1.0-alpha-6/plexus-interactivity-1.0-alpha-6.pom
2/2 KB               Downloaded: http://maven.objectstyle.org/nexus/content/groups/cayenne-deps/org/codehaus/plexus/plexus-interactivity/1.0-alpha-6/plexus-interactivity-1.0-alpha-6.pom
(2 KB at 3.8 KB/sec)
Downloading: http://maven.objectstyle.org/nexus/content/groups/cayenne-deps/org/codehaus/plexus/plexus-components/1.1.9/plexus-components-1.1.9.pom
3/3 KB            Downloaded: http://maven.objectstyle.org/nexus/content/groups/cayenne-deps/org/codehaus/plexus/plexus-components/1.1.9/plexus-components-1.1.9.pom
(3 KB at 8.6 KB/sec)
Downloading: http://maven.objectstyle.org/nexus/content/groups/cayenne-deps/org/codehaus/plexus/plexus/1.0.10/plexus-1.0.10.pom
4/9 KB   8/9 KB   9/9 KB            Downloaded: http://maven.objectstyle.org/nexus/content/groups/cayenne-deps/org/codehaus/plexus/plexus/1.0.10/plexus-1.0.10.pom
(9 KB at 28.8 KB/sec)
Downloading: http://maven.objectstyle.org/nexus/content/groups/cayenne-deps/org/apache/maven/wagon/wagon-provider-api/1.0-beta-7/wagon-provider-api-1.0-beta-7.pom
2/2 KB            Downloaded: http://maven.objectstyle.org/nexus/content/groups/cayenne-deps/org/apache/maven/wagon/wagon-provider-api/1.0-beta-7/wagon-provider-api-1.0-beta-7.pom
(2 KB at 6.2 KB/sec)
Downloading: http://maven.objectstyle.org/nexus/content/groups/cayenne-deps/org/apache/maven/wagon/wagon-ssh/1.0-beta-7/wagon-ssh-1.0-beta-7.jar
Downloading: http://maven.objectstyle.org/nexus/content/groups/cayenne-deps/com/jcraft/jsch/0.1.38/jsch-0.1.38.jar
Downloading: http://maven.objectstyle.org/nexus/content/groups/cayenne-deps/org/codehaus/plexus/plexus-utils/1.4.2/plexus-utils-1.4.2.jar
Downloading: http://maven.objectstyle.org/nexus/content/groups/cayenne-deps/org/apache/maven/wagon/wagon-ssh-common/1.0-beta-7/wagon-ssh-common-1.0-beta-7.jar
Downloading: http://maven.objectstyle.org/nexus/content/groups/cayenne-deps/org/codehaus/plexus/plexus-interactivity-api/1.0-alpha-6/plexus-interactivity-api-1.0-alpha-6.jar
4/28 KB   8/28 KB   12/28 KB   14/28 KB   14/28 KB   4/12 KB   14/28 KB   8/12 KB   14/28
KB   12/12 KB   14/28 KB   12/12 KB   4/27 KB   14/28 KB   12/12 KB   8/27 KB   14/28 KB 
 12/12 KB   12/27 KB   14/28 KB   12/12 KB   14/27 KB   14/28 KB   12/12 KB   14/27 KB   4/186
KB   14/28 KB   12/12 KB   14/27 KB   8/186 KB   14/28 KB   12/12 KB   14/27 KB   12/186 KB
  14/28 KB   12/12 KB   14/27 KB   14/186 KB   14/28 KB   12/12 KB   4/174 KB   14/27 KB 
 14/186 KB   14/28 KB   12/12 KB   8/174 KB   14/27 KB   14/186 KB   14/28 KB   12/12 KB 
 12/174 KB   14/27 KB   14/186 KB   14/28 KB   12/12 KB   14/174 KB   14/27 KB   14/186 KB
  18/28 KB   12/12 KB   14/174 KB   14/27 KB   14/186 KB   22/28 KB   12/12 KB   14/174 KB
  14/27 KB   14/186 KB   26/28 KB   12/12 KB   14/174 KB   14/27 KB   14/186 KB   28/28 KB
  12/12 KB   14/174 KB   14/27 KB   14/186 KB   28/28 KB   12/12 KB   14/174 KB   14/27 KB
  16/186 KB   28/28 KB   12/12 KB   14/174 KB   18/27 KB   16/186 KB   28/28 KB   12/12 KB
  14/174 KB   18/27 KB   20/186 KB   28/28 KB   12/12 KB   14/174 KB   22/27 KB   20/186 KB
  28/28 KB   12/12 KB   14/174 KB   22/27 KB   24/186 KB   28/28 KB   12/12 KB   14/174 KB
  26/27 KB   24/186 KB   28/28 KB   12/12 KB   14/174 KB   26/27 KB   28/186 KB   28/28 KB
  12/12 KB   14/174 KB   27/27 KB   28/186 KB   28/28 KB   12/12 KB   16/174 KB   27/27 KB
  28/186 KB   28/28 KB   12/12 KB   20/174 KB   27/27 KB   28/186 KB   28/28 KB   12/12 KB
  24/174 KB   27/27 KB   28/186 KB   28/28 KB   12/12 KB   28/174 KB   27/27 KB   28/186 KB
  28/28 KB   12/12 KB   28/174 KB   27/27 KB   31/186 KB   28/28 KB   12/12 KB   28/174 KB
  27/27 KB   35/186 KB   28/28 KB   12/12 KB   28/174 KB   27/27 KB   39/186 KB   28/28 KB
  12/12 KB   28/174 KB   27/27 KB   43/186 KB   28/28 KB   12/12 KB   28/174 KB   27/27 KB
  47/186 KB   28/28 KB   12/12 KB   28/174 KB   27/27 KB   48/186 KB                     
                                      Downloaded: http://maven.objectstyle.org/nexus/content/groups/cayenne-deps/org/codehaus/plexus/plexus-interactivity-api/1.0-alpha-6/plexus-interactivity-api-1.0-alpha-6.jar
(12 KB at 42.2 KB/sec)
28/28 KB   32/174 KB   27/27 KB   48/186 KB              28/28 KB   36/174 KB   27/27 KB 
 48/186 KB   28/28 KB   40/174 KB   27/27 KB   48/186 KB   28/28 KB   44/174 KB   27/27 KB
  48/186 KB   28/28 KB   48/174 KB   27/27 KB   48/186 KB                                
                Downloaded: http://maven.objectstyle.org/nexus/content/groups/cayenne-deps/org/apache/maven/wagon/wagon-ssh/1.0-beta-7/wagon-ssh-1.0-beta-7.jar
(28 KB at 84.4 KB/sec)
                                              Downloaded: http://maven.objectstyle.org/nexus/content/groups/cayenne-deps/org/apache/maven/wagon/wagon-ssh-common/1.0-beta-7/wagon-ssh-common-1.0-beta-7.jar
(27 KB at 76.9 KB/sec)
48/174 KB   52/186 KB                         48/174 KB   56/186 KB   48/174 KB   60/186 KB
  48/174 KB   64/186 KB   48/174 KB   68/186 KB   48/174 KB   72/186 KB   48/174 KB   73/186
KB   52/174 KB   73/186 KB   56/174 KB   73/186 KB   60/174 KB   73/186 KB   64/174 KB   73/186
KB   68/174 KB   73/186 KB   72/174 KB   73/186 KB   73/174 KB   73/186 KB   73/174 KB   77/186
KB   73/174 KB   81/186 KB   73/174 KB   85/186 KB   73/174 KB   89/186 KB   73/174 KB   93/186
KB   73/174 KB   97/186 KB   73/174 KB   101/186 KB   73/174 KB   105/186 KB   77/174 KB 
 105/186 KB   81/174 KB   105/186 KB   85/174 KB   105/186 KB   89/174 KB   105/186 KB   93/174
KB   105/186 KB   97/174 KB   105/186 KB   101/174 KB   105/186 KB   105/174 KB   105/186
KB   105/174 KB   109/186 KB   105/174 KB   113/186 KB   105/174 KB   117/186 KB   105/174
KB   121/186 KB   105/174 KB   125/186 KB   105/174 KB   129/186 KB   105/174 KB   133/186
KB   105/174 KB   137/186 KB   105/174 KB   141/186 KB   105/174 KB   145/186 KB   105/174
KB   146/186 KB   109/174 KB   146/186 KB   113/174 KB   146/186 KB   117/174 KB   146/186
KB   121/174 KB   146/186 KB   125/174 KB   146/186 KB   129/174 KB   146/186 KB   133/174
KB   146/186 KB   137/174 KB   146/186 KB   141/174 KB   146/186 KB   145/174 KB   146/186
KB   146/174 KB   146/186 KB   146/174 KB   150/186 KB   146/174 KB   154/186 KB   146/174
KB   158/186 KB   146/174 KB   162/186 KB   146/174 KB   166/186 KB   146/174 KB   170/186
KB   146/174 KB   174/186 KB   146/174 KB   178/186 KB   146/174 KB   182/186 KB   146/174
KB   186/186 KB   146/174 KB   186/186 KB   150/174 KB   186/186 KB   154/174 KB   186/186
KB   158/174 KB   186/186 KB   162/174 KB   186/186 KB   166/174 KB   186/186 KB   170/174
KB   186/186 KB   174/174 KB   186/186 KB                             Downloaded: http://maven.objectstyle.org/nexus/content/groups/cayenne-deps/org/codehaus/plexus/plexus-utils/1.4.2/plexus-utils-1.4.2.jar
(186 KB at 279.1 KB/sec)
                          Downloaded: http://maven.objectstyle.org/nexus/content/groups/cayenne-deps/com/jcraft/jsch/0.1.38/jsch-0.1.38.jar
(174 KB at 256.8 KB/sec)
[ERROR] The build could not read 4 projects -> [Help 1]
org.apache.maven.project.ProjectBuildingException: Some problems were encountered while processing
the POMs:
[WARNING] 'parent.relativePath' points at org.apache.cayenne.docs:cayenne-asciidoc-parent
instead of org.apache.cayenne.parents:cayenne-asciidoc-parent, please verify your project
structure @ line 24, column 13
[FATAL] Non-resolvable parent POM: Could not find artifact org.apache.cayenne.parents:cayenne-asciidoc-parent:pom:3.1.3-SNAPSHOT
and 'parent.relativePath' points at wrong local POM @ line 24, column 13
[WARNING] 'parent.relativePath' points at org.apache.cayenne.docs:cayenne-asciidoc-parent
instead of org.apache.cayenne.parents:cayenne-asciidoc-parent, please verify your project
structure @ line 5, column 13
[FATAL] Non-resolvable parent POM: Could not find artifact org.apache.cayenne.parents:cayenne-asciidoc-parent:pom:3.1.3-SNAPSHOT
and 'parent.relativePath' points at wrong local POM @ line 5, column 13
[WARNING] 'parent.relativePath' points at org.apache.cayenne.docs:cayenne-asciidoc-parent
instead of org.apache.cayenne.parents:cayenne-asciidoc-parent, please verify your project
structure @ line 5, column 13
[FATAL] Non-resolvable parent POM: Could not find artifact org.apache.cayenne.parents:cayenne-asciidoc-parent:pom:3.1.3-SNAPSHOT
and 'parent.relativePath' points at wrong local POM @ line 5, column 13
[WARNING] 'parent.relativePath' points at org.apache.cayenne.docs:cayenne-asciidoc-parent
instead of org.apache.cayenne.parents:cayenne-asciidoc-parent, please verify your project
structure @ line 5, column 13
[FATAL] Non-resolvable parent POM: Could not find artifact org.apache.cayenne.parents:cayenne-asciidoc-parent:pom:3.1.3-SNAPSHOT
and 'parent.relativePath' points at wrong local POM @ line 5, column 13
[WARNING] 'dependencies.dependency.(groupId:artifactId:type:classifier)' must be unique: org.apache.cayenne.build-tools:cayenne-test-utilities:jar
-> duplicate declaration of version ${project.version} @ line 46, column 15

	at org.apache.maven.project.DefaultProjectBuilder.build(DefaultProjectBuilder.java:363)
	at org.apache.maven.DefaultMaven.collectProjects(DefaultMaven.java:636)
	at org.apache.maven.DefaultMaven.getProjectsForMavenReactor(DefaultMaven.java:585)
	at org.apache.maven.DefaultMaven.doExecute(DefaultMaven.java:234)
	at org.apache.maven.DefaultMaven.execute(DefaultMaven.java:156)
	at org.apache.maven.cli.MavenCli.execute(MavenCli.java:537)
	at org.apache.maven.cli.MavenCli.doMain(MavenCli.java:196)
	at org.apache.maven.cli.MavenCli.main(MavenCli.java:141)
	at sun.reflect.NativeMethodAccessorImpl.invoke0(Native Method)
	at sun.reflect.NativeMethodAccessorImpl.invoke(NativeMethodAccessorImpl.java:62)
	at sun.reflect.DelegatingMethodAccessorImpl.invoke(DelegatingMethodAccessorImpl.java:43)
	at java.lang.reflect.Method.invoke(Method.java:498)
	at org.codehaus.plexus.classworlds.launcher.Launcher.launchEnhanced(Launcher.java:290)
	at org.codehaus.plexus.classworlds.launcher.Launcher.launch(Launcher.java:230)
	at org.codehaus.plexus.classworlds.launcher.Launcher.mainWithExitCode(Launcher.java:409)
	at org.codehaus.plexus.classworlds.launcher.Launcher.main(Launcher.java:352)
[ERROR]   
[ERROR]   The project org.apache.cayenne.parents:getting-started-guide:3.1.3-SNAPSHOT (<https://builds.apache.org/job/cayenne-31/cayenneTestConnection=hsql,jdk=JDK%201.8%20(latest),slave=ubuntu/ws/docs/asciidoc/getting-started-guide/pom.xml)>
has 1 error
[ERROR]     Non-resolvable parent POM: Could not find artifact org.apache.cayenne.parents:cayenne-asciidoc-parent:pom:3.1.3-SNAPSHOT
and 'parent.relativePath' points at wrong local POM @ line 24, column 13 -> [Help 2]
org.apache.maven.model.resolution.UnresolvableModelException: Could not find artifact org.apache.cayenne.parents:cayenne-asciidoc-parent:pom:3.1.3-SNAPSHOT
	at org.apache.maven.project.ProjectModelResolver.resolveModel(ProjectModelResolver.java:159)
	at org.apache.maven.model.building.DefaultModelBuilder.readParentExternally(DefaultModelBuilder.java:813)
	at org.apache.maven.model.building.DefaultModelBuilder.readParent(DefaultModelBuilder.java:664)
	at org.apache.maven.model.building.DefaultModelBuilder.build(DefaultModelBuilder.java:310)
	at org.apache.maven.model.building.DefaultModelBuilder.build(DefaultModelBuilder.java:232)
	at org.apache.maven.project.DefaultProjectBuilder.build(DefaultProjectBuilder.java:410)
	at org.apache.maven.project.DefaultProjectBuilder.build(DefaultProjectBuilder.java:379)
	at org.apache.maven.project.DefaultProjectBuilder.build(DefaultProjectBuilder.java:495)
	at org.apache.maven.project.DefaultProjectBuilder.build(DefaultProjectBuilder.java:379)
	at org.apache.maven.project.DefaultProjectBuilder.build(DefaultProjectBuilder.java:495)
	at org.apache.maven.project.DefaultProjectBuilder.build(DefaultProjectBuilder.java:379)
	at org.apache.maven.project.DefaultProjectBuilder.build(DefaultProjectBuilder.java:495)
	at org.apache.maven.project.DefaultProjectBuilder.build(DefaultProjectBuilder.java:379)
	at org.apache.maven.project.DefaultProjectBuilder.build(DefaultProjectBuilder.java:343)
	at org.apache.maven.DefaultMaven.collectProjects(DefaultMaven.java:636)
	at org.apache.maven.DefaultMaven.getProjectsForMavenReactor(DefaultMaven.java:585)
	at org.apache.maven.DefaultMaven.doExecute(DefaultMaven.java:234)
	at org.apache.maven.DefaultMaven.execute(DefaultMaven.java:156)
	at org.apache.maven.cli.MavenCli.execute(MavenCli.java:537)
	at org.apache.maven.cli.MavenCli.doMain(MavenCli.java:196)
	at org.apache.maven.cli.MavenCli.main(MavenCli.java:141)
	at sun.reflect.NativeMethodAccessorImpl.invoke0(Native Method)
	at sun.reflect.NativeMethodAccessorImpl.invoke(NativeMethodAccessorImpl.java:62)
	at sun.reflect.DelegatingMethodAccessorImpl.invoke(DelegatingMethodAccessorImpl.java:43)
	at java.lang.reflect.Method.invoke(Method.java:498)
	at org.codehaus.plexus.classworlds.launcher.Launcher.launchEnhanced(Launcher.java:290)
	at org.codehaus.plexus.classworlds.launcher.Launcher.launch(Launcher.java:230)
	at org.codehaus.plexus.classworlds.launcher.Launcher.mainWithExitCode(Launcher.java:409)
	at org.codehaus.plexus.classworlds.launcher.Launcher.main(Launcher.java:352)
Caused by: org.sonatype.aether.resolution.ArtifactResolutionException: Could not find artifact
org.apache.cayenne.parents:cayenne-asciidoc-parent:pom:3.1.3-SNAPSHOT
	at org.sonatype.aether.impl.internal.DefaultArtifactResolver.resolve(DefaultArtifactResolver.java:538)
	at org.sonatype.aether.impl.internal.DefaultArtifactResolver.resolveArtifacts(DefaultArtifactResolver.java:216)
	at org.sonatype.aether.impl.internal.DefaultArtifactResolver.resolveArtifact(DefaultArtifactResolver.java:193)
	at org.sonatype.aether.impl.internal.DefaultRepositorySystem.resolveArtifact(DefaultRepositorySystem.java:286)
	at org.apache.maven.project.ProjectModelResolver.resolveModel(ProjectModelResolver.java:155)
	... 28 more
Caused by: org.sonatype.aether.transfer.ArtifactNotFoundException: Could not find artifact
org.apache.cayenne.parents:cayenne-asciidoc-parent:pom:3.1.3-SNAPSHOT
	at org.sonatype.aether.impl.internal.DefaultArtifactResolver.resolve(DefaultArtifactResolver.java:528)
	... 32 more
[ERROR]   
[ERROR]   The project org.apache.cayenne.parents:cayenne-guide:3.1.3-SNAPSHOT (<https://builds.apache.org/job/cayenne-31/cayenneTestConnection=hsql,jdk=JDK%201.8%20(latest),slave=ubuntu/ws/docs/asciidoc/cayenne-guide/pom.xml)>
has 1 error
[ERROR]     Non-resolvable parent POM: Could not find artifact org.apache.cayenne.parents:cayenne-asciidoc-parent:pom:3.1.3-SNAPSHOT
and 'parent.relativePath' points at wrong local POM @ line 5, column 13 -> [Help 2]
org.apache.maven.model.resolution.UnresolvableModelException: Could not find artifact org.apache.cayenne.parents:cayenne-asciidoc-parent:pom:3.1.3-SNAPSHOT
	at org.apache.maven.project.ProjectModelResolver.resolveModel(ProjectModelResolver.java:159)
	at org.apache.maven.model.building.DefaultModelBuilder.readParentExternally(DefaultModelBuilder.java:813)
	at org.apache.maven.model.building.DefaultModelBuilder.readParent(DefaultModelBuilder.java:664)
	at org.apache.maven.model.building.DefaultModelBuilder.build(DefaultModelBuilder.java:310)
	at org.apache.maven.model.building.DefaultModelBuilder.build(DefaultModelBuilder.java:232)
	at org.apache.maven.project.DefaultProjectBuilder.build(DefaultProjectBuilder.java:410)
	at org.apache.maven.project.DefaultProjectBuilder.build(DefaultProjectBuilder.java:379)
	at org.apache.maven.project.DefaultProjectBuilder.build(DefaultProjectBuilder.java:495)
	at org.apache.maven.project.DefaultProjectBuilder.build(DefaultProjectBuilder.java:379)
	at org.apache.maven.project.DefaultProjectBuilder.build(DefaultProjectBuilder.java:495)
	at org.apache.maven.project.DefaultProjectBuilder.build(DefaultProjectBuilder.java:379)
	at org.apache.maven.project.DefaultProjectBuilder.build(DefaultProjectBuilder.java:495)
	at org.apache.maven.project.DefaultProjectBuilder.build(DefaultProjectBuilder.java:379)
	at org.apache.maven.project.DefaultProjectBuilder.build(DefaultProjectBuilder.java:343)
	at org.apache.maven.DefaultMaven.collectProjects(DefaultMaven.java:636)
	at org.apache.maven.DefaultMaven.getProjectsForMavenReactor(DefaultMaven.java:585)
	at org.apache.maven.DefaultMaven.doExecute(DefaultMaven.java:234)
	at org.apache.maven.DefaultMaven.execute(DefaultMaven.java:156)
	at org.apache.maven.cli.MavenCli.execute(MavenCli.java:537)
	at org.apache.maven.cli.MavenCli.doMain(MavenCli.java:196)
	at org.apache.maven.cli.MavenCli.main(MavenCli.java:141)
	at sun.reflect.NativeMethodAccessorImpl.invoke0(Native Method)
	at sun.reflect.NativeMethodAccessorImpl.invoke(NativeMethodAccessorImpl.java:62)
	at sun.reflect.DelegatingMethodAccessorImpl.invoke(DelegatingMethodAccessorImpl.java:43)
	at java.lang.reflect.Method.invoke(Method.java:498)
	at org.codehaus.plexus.classworlds.launcher.Launcher.launchEnhanced(Launcher.java:290)
	at org.codehaus.plexus.classworlds.launcher.Launcher.launch(Launcher.java:230)
	at org.codehaus.plexus.classworlds.launcher.Launcher.mainWithExitCode(Launcher.java:409)
	at org.codehaus.plexus.classworlds.launcher.Launcher.main(Launcher.java:352)
Caused by: org.sonatype.aether.resolution.ArtifactResolutionException: Could not find artifact
org.apache.cayenne.parents:cayenne-asciidoc-parent:pom:3.1.3-SNAPSHOT
	at org.sonatype.aether.impl.internal.DefaultArtifactResolver.resolve(DefaultArtifactResolver.java:538)
	at org.sonatype.aether.impl.internal.DefaultArtifactResolver.resolveArtifacts(DefaultArtifactResolver.java:216)
	at org.sonatype.aether.impl.internal.DefaultArtifactResolver.resolveArtifact(DefaultArtifactResolver.java:193)
	at org.sonatype.aether.impl.internal.DefaultRepositorySystem.resolveArtifact(DefaultRepositorySystem.java:286)
	at org.apache.maven.project.ProjectModelResolver.resolveModel(ProjectModelResolver.java:155)
	... 28 more
Caused by: org.sonatype.aether.transfer.ArtifactNotFoundException: Could not find artifact
org.apache.cayenne.parents:cayenne-asciidoc-parent:pom:3.1.3-SNAPSHOT
	at org.sonatype.aether.impl.internal.DefaultArtifactResolver.resolve(DefaultArtifactResolver.java:528)
	... 32 more
[ERROR]   
[ERROR]   The project org.apache.cayenne.parents:getting-started-rop:3.1.3-SNAPSHOT (<https://builds.apache.org/job/cayenne-31/cayenneTestConnection=hsql,jdk=JDK%201.8%20(latest),slave=ubuntu/ws/docs/asciidoc/getting-started-rop/pom.xml)>
has 1 error
[ERROR]     Non-resolvable parent POM: Could not find artifact org.apache.cayenne.parents:cayenne-asciidoc-parent:pom:3.1.3-SNAPSHOT
and 'parent.relativePath' points at wrong local POM @ line 5, column 13 -> [Help 2]
org.apache.maven.model.resolution.UnresolvableModelException: Could not find artifact org.apache.cayenne.parents:cayenne-asciidoc-parent:pom:3.1.3-SNAPSHOT
	at org.apache.maven.project.ProjectModelResolver.resolveModel(ProjectModelResolver.java:159)
	at org.apache.maven.model.building.DefaultModelBuilder.readParentExternally(DefaultModelBuilder.java:813)
	at org.apache.maven.model.building.DefaultModelBuilder.readParent(DefaultModelBuilder.java:664)
	at org.apache.maven.model.building.DefaultModelBuilder.build(DefaultModelBuilder.java:310)
	at org.apache.maven.model.building.DefaultModelBuilder.build(DefaultModelBuilder.java:232)
	at org.apache.maven.project.DefaultProjectBuilder.build(DefaultProjectBuilder.java:410)
	at org.apache.maven.project.DefaultProjectBuilder.build(DefaultProjectBuilder.java:379)
	at org.apache.maven.project.DefaultProjectBuilder.build(DefaultProjectBuilder.java:495)
	at org.apache.maven.project.DefaultProjectBuilder.build(DefaultProjectBuilder.java:379)
	at org.apache.maven.project.DefaultProjectBuilder.build(DefaultProjectBuilder.java:495)
	at org.apache.maven.project.DefaultProjectBuilder.build(DefaultProjectBuilder.java:379)
	at org.apache.maven.project.DefaultProjectBuilder.build(DefaultProjectBuilder.java:495)
	at org.apache.maven.project.DefaultProjectBuilder.build(DefaultProjectBuilder.java:379)
	at org.apache.maven.project.DefaultProjectBuilder.build(DefaultProjectBuilder.java:343)
	at org.apache.maven.DefaultMaven.collectProjects(DefaultMaven.java:636)
	at org.apache.maven.DefaultMaven.getProjectsForMavenReactor(DefaultMaven.java:585)
	at org.apache.maven.DefaultMaven.doExecute(DefaultMaven.java:234)
	at org.apache.maven.DefaultMaven.execute(DefaultMaven.java:156)
	at org.apache.maven.cli.MavenCli.execute(MavenCli.java:537)
	at org.apache.maven.cli.MavenCli.doMain(MavenCli.java:196)
	at org.apache.maven.cli.MavenCli.main(MavenCli.java:141)
	at sun.reflect.NativeMethodAccessorImpl.invoke0(Native Method)
	at sun.reflect.NativeMethodAccessorImpl.invoke(NativeMethodAccessorImpl.java:62)
	at sun.reflect.DelegatingMethodAccessorImpl.invoke(DelegatingMethodAccessorImpl.java:43)
	at java.lang.reflect.Method.invoke(Method.java:498)
	at org.codehaus.plexus.classworlds.launcher.Launcher.launchEnhanced(Launcher.java:290)
	at org.codehaus.plexus.classworlds.launcher.Launcher.launch(Launcher.java:230)
	at org.codehaus.plexus.classworlds.launcher.Launcher.mainWithExitCode(Launcher.java:409)
	at org.codehaus.plexus.classworlds.launcher.Launcher.main(Launcher.java:352)
Caused by: org.sonatype.aether.resolution.ArtifactResolutionException: Could not find artifact
org.apache.cayenne.parents:cayenne-asciidoc-parent:pom:3.1.3-SNAPSHOT
	at org.sonatype.aether.impl.internal.DefaultArtifactResolver.resolve(DefaultArtifactResolver.java:538)
	at org.sonatype.aether.impl.internal.DefaultArtifactResolver.resolveArtifacts(DefaultArtifactResolver.java:216)
	at org.sonatype.aether.impl.internal.DefaultArtifactResolver.resolveArtifact(DefaultArtifactResolver.java:193)
	at org.sonatype.aether.impl.internal.DefaultRepositorySystem.resolveArtifact(DefaultRepositorySystem.java:286)
	at org.apache.maven.project.ProjectModelResolver.resolveModel(ProjectModelResolver.java:155)
	... 28 more
Caused by: org.sonatype.aether.transfer.ArtifactNotFoundException: Could not find artifact
org.apache.cayenne.parents:cayenne-asciidoc-parent:pom:3.1.3-SNAPSHOT
	at org.sonatype.aether.impl.internal.DefaultArtifactResolver.resolve(DefaultArtifactResolver.java:528)
	... 32 more
[ERROR]   
[ERROR]   The project org.apache.cayenne.parents:upgrade-guide:3.1.3-SNAPSHOT (<https://builds.apache.org/job/cayenne-31/cayenneTestConnection=hsql,jdk=JDK%201.8%20(latest),slave=ubuntu/ws/docs/asciidoc/upgrade-guide/pom.xml)>
has 1 error
[ERROR]     Non-resolvable parent POM: Could not find artifact org.apache.cayenne.parents:cayenne-asciidoc-parent:pom:3.1.3-SNAPSHOT
and 'parent.relativePath' points at wrong local POM @ line 5, column 13 -> [Help 2]
org.apache.maven.model.resolution.UnresolvableModelException: Could not find artifact org.apache.cayenne.parents:cayenne-asciidoc-parent:pom:3.1.3-SNAPSHOT
	at org.apache.maven.project.ProjectModelResolver.resolveModel(ProjectModelResolver.java:159)
	at org.apache.maven.model.building.DefaultModelBuilder.readParentExternally(DefaultModelBuilder.java:813)
	at org.apache.maven.model.building.DefaultModelBuilder.readParent(DefaultModelBuilder.java:664)
	at org.apache.maven.model.building.DefaultModelBuilder.build(DefaultModelBuilder.java:310)
	at org.apache.maven.model.building.DefaultModelBuilder.build(DefaultModelBuilder.java:232)
	at org.apache.maven.project.DefaultProjectBuilder.build(DefaultProjectBuilder.java:410)
	at org.apache.maven.project.DefaultProjectBuilder.build(DefaultProjectBuilder.java:379)
	at org.apache.maven.project.DefaultProjectBuilder.build(DefaultProjectBuilder.java:495)
	at org.apache.maven.project.DefaultProjectBuilder.build(DefaultProjectBuilder.java:379)
	at org.apache.maven.project.DefaultProjectBuilder.build(DefaultProjectBuilder.java:495)
	at org.apache.maven.project.DefaultProjectBuilder.build(DefaultProjectBuilder.java:379)
	at org.apache.maven.project.DefaultProjectBuilder.build(DefaultProjectBuilder.java:495)
	at org.apache.maven.project.DefaultProjectBuilder.build(DefaultProjectBuilder.java:379)
	at org.apache.maven.project.DefaultProjectBuilder.build(DefaultProjectBuilder.java:343)
	at org.apache.maven.DefaultMaven.collectProjects(DefaultMaven.java:636)
	at org.apache.maven.DefaultMaven.getProjectsForMavenReactor(DefaultMaven.java:585)
	at org.apache.maven.DefaultMaven.doExecute(DefaultMaven.java:234)
	at org.apache.maven.DefaultMaven.execute(DefaultMaven.java:156)
	at org.apache.maven.cli.MavenCli.execute(MavenCli.java:537)
	at org.apache.maven.cli.MavenCli.doMain(MavenCli.java:196)
	at org.apache.maven.cli.MavenCli.main(MavenCli.java:141)
	at sun.reflect.NativeMethodAccessorImpl.invoke0(Native Method)
	at sun.reflect.NativeMethodAccessorImpl.invoke(NativeMethodAccessorImpl.java:62)
	at sun.reflect.DelegatingMethodAccessorImpl.invoke(DelegatingMethodAccessorImpl.java:43)
	at java.lang.reflect.Method.invoke(Method.java:498)
	at org.codehaus.plexus.classworlds.launcher.Launcher.launchEnhanced(Launcher.java:290)
	at org.codehaus.plexus.classworlds.launcher.Launcher.launch(Launcher.java:230)
	at org.codehaus.plexus.classworlds.launcher.Launcher.mainWithExitCode(Launcher.java:409)
	at org.codehaus.plexus.classworlds.launcher.Launcher.main(Launcher.java:352)
Caused by: org.sonatype.aether.resolution.ArtifactResolutionException: Could not find artifact
org.apache.cayenne.parents:cayenne-asciidoc-parent:pom:3.1.3-SNAPSHOT
	at org.sonatype.aether.impl.internal.DefaultArtifactResolver.resolve(DefaultArtifactResolver.java:538)
	at org.sonatype.aether.impl.internal.DefaultArtifactResolver.resolveArtifacts(DefaultArtifactResolver.java:216)
	at org.sonatype.aether.impl.internal.DefaultArtifactResolver.resolveArtifact(DefaultArtifactResolver.java:193)
	at org.sonatype.aether.impl.internal.DefaultRepositorySystem.resolveArtifact(DefaultRepositorySystem.java:286)
	at org.apache.maven.project.ProjectModelResolver.resolveModel(ProjectModelResolver.java:155)
	... 28 more
Caused by: org.sonatype.aether.transfer.ArtifactNotFoundException: Could not find artifact
org.apache.cayenne.parents:cayenne-asciidoc-parent:pom:3.1.3-SNAPSHOT
	at org.sonatype.aether.impl.internal.DefaultArtifactResolver.resolve(DefaultArtifactResolver.java:528)
	... 32 more
[ERROR] 
[ERROR] Re-run Maven using the -X switch to enable full debug logging.
[ERROR] 
[ERROR] For more information about the errors and possible solutions, please read the following
articles:
[ERROR] [Help 1] http://cwiki.apache.org/confluence/display/MAVEN/ProjectBuildingException
[ERROR] [Help 2] http://cwiki.apache.org/confluence/display/MAVEN/UnresolvableModelException
Build step 'Invoke top-level Maven targets' marked build as failure
Not sending mail to unregistered user stariy95@gmail.com

Mime
View raw message