cayenne-commits mailing list archives

Site index · List index
Message view « Date » · « Thread »
Top « Date » · « Thread »
From Apache Jenkins Server <jenk...@builds.apache.org>
Subject Build failed in Jenkins: cayenne-31 » hsql,JDK 1.7 (latest),ubuntu #148
Date Fri, 05 Jan 2018 14:42:11 GMT
See <https://builds.apache.org/job/cayenne-31/cayenneTestConnection=hsql,jdk=JDK%201.7%20(latest),slave=ubuntu/148/display/redirect?page=changes>

Changes:

[stariy95] CAY-2371 Switch documentation from Docbook to Asciidoctor format

[stariy95] CAY-2371 Switch documentation from Docbook to Asciidoctor format   fix

------------------------------------------
[...truncated 2.39 KB...]
[ubuntu] $ /home/jenkins/tools/maven/apache-maven-3.0.5/bin/mvn "-Djdk=JDK 1.7 (latest)" -Dslave=ubuntu
-DcayenneTestConnection=hsql "-Dmaven.repo.local=<https://builds.apache.org/job/cayenne-31/cayenneTestConnection=hsql,jdk=JDK%201.7%20(latest),slave=ubuntu/ws/.repository">
-e clean install
[INFO] Error stacktraces are turned on.
[INFO] Scanning for projects...
Downloading: http://maven.objectstyle.org/nexus/content/groups/cayenne-deps/org/apache/maven/wagon/wagon-ssh/1.0-beta-7/wagon-ssh-1.0-beta-7.pom
3/3 KB            Downloaded: http://maven.objectstyle.org/nexus/content/groups/cayenne-deps/org/apache/maven/wagon/wagon-ssh/1.0-beta-7/wagon-ssh-1.0-beta-7.pom
(3 KB at 5.1 KB/sec)
Downloading: http://maven.objectstyle.org/nexus/content/groups/cayenne-deps/org/apache/maven/wagon/wagon-providers/1.0-beta-7/wagon-providers-1.0-beta-7.pom
3/3 KB            Downloaded: http://maven.objectstyle.org/nexus/content/groups/cayenne-deps/org/apache/maven/wagon/wagon-providers/1.0-beta-7/wagon-providers-1.0-beta-7.pom
(3 KB at 7.5 KB/sec)
Downloading: http://maven.objectstyle.org/nexus/content/groups/cayenne-deps/org/apache/maven/wagon/wagon/1.0-beta-7/wagon-1.0-beta-7.pom
4/12 KB   8/12 KB   12/12 KB              Downloaded: http://maven.objectstyle.org/nexus/content/groups/cayenne-deps/org/apache/maven/wagon/wagon/1.0-beta-7/wagon-1.0-beta-7.pom
(12 KB at 40.8 KB/sec)
Downloading: http://maven.objectstyle.org/nexus/content/groups/cayenne-deps/org/apache/maven/maven-parent/16/maven-parent-16.pom
4/23 KB    8/23 KB   12/23 KB   14/23 KB   18/23 KB   22/23 KB   23/23 KB              Downloaded:
http://maven.objectstyle.org/nexus/content/groups/cayenne-deps/org/apache/maven/maven-parent/16/maven-parent-16.pom
(23 KB at 65.7 KB/sec)
Downloading: http://maven.objectstyle.org/nexus/content/groups/cayenne-deps/org/apache/apache/7/apache-7.pom
4/15 KB    7/15 KB   11/15 KB   15/15 KB              Downloaded: http://maven.objectstyle.org/nexus/content/groups/cayenne-deps/org/apache/apache/7/apache-7.pom
(15 KB at 48.4 KB/sec)
Downloading: http://maven.objectstyle.org/nexus/content/groups/cayenne-deps/com/jcraft/jsch/0.1.38/jsch-0.1.38.pom
967/967 B               Downloaded: http://maven.objectstyle.org/nexus/content/groups/cayenne-deps/com/jcraft/jsch/0.1.38/jsch-0.1.38.pom
(967 B at 3.5 KB/sec)
Downloading: http://maven.objectstyle.org/nexus/content/groups/cayenne-deps/org/codehaus/plexus/plexus-utils/1.4.2/plexus-utils-1.4.2.pom
2/2 KB               Downloaded: http://maven.objectstyle.org/nexus/content/groups/cayenne-deps/org/codehaus/plexus/plexus-utils/1.4.2/plexus-utils-1.4.2.pom
(2 KB at 7.1 KB/sec)
Downloading: http://maven.objectstyle.org/nexus/content/groups/cayenne-deps/org/codehaus/plexus/plexus/1.0.11/plexus-1.0.11.pom
4/9 KB   8/9 KB   9/9 KB            Downloaded: http://maven.objectstyle.org/nexus/content/groups/cayenne-deps/org/codehaus/plexus/plexus/1.0.11/plexus-1.0.11.pom
(9 KB at 30.8 KB/sec)
Downloading: http://maven.objectstyle.org/nexus/content/groups/cayenne-deps/org/apache/maven/wagon/wagon-ssh-common/1.0-beta-7/wagon-ssh-common-1.0-beta-7.pom
2/2 KB            Downloaded: http://maven.objectstyle.org/nexus/content/groups/cayenne-deps/org/apache/maven/wagon/wagon-ssh-common/1.0-beta-7/wagon-ssh-common-1.0-beta-7.pom
(2 KB at 6.7 KB/sec)
Downloading: http://maven.objectstyle.org/nexus/content/groups/cayenne-deps/org/codehaus/plexus/plexus-interactivity-api/1.0-alpha-6/plexus-interactivity-api-1.0-alpha-6.pom
726/726 B               Downloaded: http://maven.objectstyle.org/nexus/content/groups/cayenne-deps/org/codehaus/plexus/plexus-interactivity-api/1.0-alpha-6/plexus-interactivity-api-1.0-alpha-6.pom
(726 B at 2.7 KB/sec)
Downloading: http://maven.objectstyle.org/nexus/content/groups/cayenne-deps/org/codehaus/plexus/plexus-interactivity/1.0-alpha-6/plexus-interactivity-1.0-alpha-6.pom
2/2 KB               Downloaded: http://maven.objectstyle.org/nexus/content/groups/cayenne-deps/org/codehaus/plexus/plexus-interactivity/1.0-alpha-6/plexus-interactivity-1.0-alpha-6.pom
(2 KB at 3.8 KB/sec)
Downloading: http://maven.objectstyle.org/nexus/content/groups/cayenne-deps/org/codehaus/plexus/plexus-components/1.1.9/plexus-components-1.1.9.pom
3/3 KB            Downloaded: http://maven.objectstyle.org/nexus/content/groups/cayenne-deps/org/codehaus/plexus/plexus-components/1.1.9/plexus-components-1.1.9.pom
(3 KB at 8.5 KB/sec)
Downloading: http://maven.objectstyle.org/nexus/content/groups/cayenne-deps/org/codehaus/plexus/plexus/1.0.10/plexus-1.0.10.pom
4/9 KB   8/9 KB   9/9 KB            Downloaded: http://maven.objectstyle.org/nexus/content/groups/cayenne-deps/org/codehaus/plexus/plexus/1.0.10/plexus-1.0.10.pom
(9 KB at 29.7 KB/sec)
Downloading: http://maven.objectstyle.org/nexus/content/groups/cayenne-deps/org/apache/maven/wagon/wagon-provider-api/1.0-beta-7/wagon-provider-api-1.0-beta-7.pom
2/2 KB            Downloaded: http://maven.objectstyle.org/nexus/content/groups/cayenne-deps/org/apache/maven/wagon/wagon-provider-api/1.0-beta-7/wagon-provider-api-1.0-beta-7.pom
(2 KB at 6.4 KB/sec)
Downloading: http://maven.objectstyle.org/nexus/content/groups/cayenne-deps/org/apache/maven/wagon/wagon-ssh/1.0-beta-7/wagon-ssh-1.0-beta-7.jar
Downloading: http://maven.objectstyle.org/nexus/content/groups/cayenne-deps/com/jcraft/jsch/0.1.38/jsch-0.1.38.jar
Downloading: http://maven.objectstyle.org/nexus/content/groups/cayenne-deps/org/codehaus/plexus/plexus-utils/1.4.2/plexus-utils-1.4.2.jar
Downloading: http://maven.objectstyle.org/nexus/content/groups/cayenne-deps/org/apache/maven/wagon/wagon-ssh-common/1.0-beta-7/wagon-ssh-common-1.0-beta-7.jar
Downloading: http://maven.objectstyle.org/nexus/content/groups/cayenne-deps/org/codehaus/plexus/plexus-interactivity-api/1.0-alpha-6/plexus-interactivity-api-1.0-alpha-6.jar
4/28 KB   8/28 KB   12/28 KB   14/28 KB   4/27 KB   14/28 KB   4/27 KB   14/28 KB   4/12 KB
  8/27 KB   14/28 KB   7/12 KB   8/27 KB   14/28 KB   7/12 KB   8/27 KB   14/28 KB   11/12
KB   12/27 KB   14/28 KB   11/12 KB   12/27 KB   14/28 KB   12/12 KB   14/27 KB   14/28 KB
  12/12 KB   14/27 KB   14/28 KB   4/174 KB   12/12 KB   14/27 KB   2/186 KB   14/28 KB  
4/174 KB   12/12 KB   14/27 KB   6/186 KB   14/28 KB   4/174 KB   12/12 KB   14/27 KB   6/186
KB   14/28 KB   8/174 KB   12/12 KB   14/27 KB   10/186 KB   14/28 KB   8/174 KB   12/12 KB
  14/27 KB   10/186 KB   14/28 KB   12/174 KB   12/12 KB   14/27 KB   14/186 KB   14/28 KB
  12/174 KB   12/12 KB   14/27 KB   14/186 KB   14/28 KB   14/174 KB   12/12 KB   14/27 KB
  14/186 KB   14/28 KB   14/174 KB   12/12 KB   14/27 KB   14/186 KB   18/28 KB   14/174 KB
  12/12 KB   14/27 KB   14/186 KB   22/28 KB   14/174 KB   12/12 KB   14/27 KB   14/186 KB
  26/28 KB   14/174 KB   12/12 KB   14/27 KB   14/186 KB   28/28 KB   14/174 KB   12/12 KB
  16/27 KB   14/186 KB   28/28 KB   14/174 KB   12/12 KB   20/27 KB   14/186 KB   28/28 KB
  14/174 KB   12/12 KB   24/27 KB   14/186 KB   28/28 KB   14/174 KB   12/12 KB   24/27 KB
  15/186 KB   28/28 KB   14/174 KB   12/12 KB   24/27 KB   19/186 KB   28/28 KB   14/174 KB
  12/12 KB   27/27 KB   19/186 KB   28/28 KB   14/174 KB   12/12 KB   27/27 KB   23/186 KB
  28/28 KB   14/174 KB   12/12 KB   27/27 KB   27/186 KB   28/28 KB   14/174 KB   12/12 KB
  27/27 KB   27/186 KB   28/28 KB   16/174 KB   12/12 KB   27/27 KB   27/186 KB   28/28 KB
  20/174 KB   12/12 KB   27/27 KB   29/186 KB   28/28 KB   20/174 KB   12/12 KB   27/27 KB
  29/186 KB   28/28 KB   24/174 KB   12/12 KB   27/27 KB   29/186 KB   28/28 KB   28/174 KB
  12/12 KB   27/27 KB   29/186 KB   28/28 KB   32/174 KB   12/12 KB   27/27 KB   33/186 KB
  28/28 KB   32/174 KB   12/12 KB   27/27 KB   37/186 KB   28/28 KB   32/174 KB   12/12 KB
  27/27 KB   41/186 KB   28/28 KB   32/174 KB   12/12 KB   27/27 KB   45/186 KB   28/28 KB
  32/174 KB   12/12 KB   27/27 KB   49/186 KB   28/28 KB   32/174 KB   12/12 KB          
                                                 Downloaded: http://maven.objectstyle.org/nexus/content/groups/cayenne-deps/org/codehaus/plexus/plexus-interactivity-api/1.0-alpha-6/plexus-interactivity-api-1.0-alpha-6.jar
(12 KB at 40.3 KB/sec)
27/27 KB   52/186 KB   28/28 KB   32/174 KB              27/27 KB   52/186 KB   28/28 KB 
 36/174 KB   27/27 KB   52/186 KB   28/28 KB   40/174 KB   27/27 KB   52/186 KB   28/28 KB
  44/174 KB   27/27 KB   52/186 KB   28/28 KB   48/174 KB   27/27 KB   52/186 KB   28/28 KB
  52/174 KB   27/27 KB   52/186 KB   28/28 KB   56/174 KB   27/27 KB   52/186 KB   28/28 KB
  58/174 KB                                                 Downloaded: http://maven.objectstyle.org/nexus/content/groups/cayenne-deps/org/apache/maven/wagon/wagon-ssh/1.0-beta-7/wagon-ssh-1.0-beta-7.jar
(28 KB at 82.2 KB/sec)
27/27 KB   56/186 KB   58/174 KB              27/27 KB   60/186 KB   58/174 KB   27/27 KB
  64/186 KB   58/174 KB   27/27 KB   68/186 KB   58/174 KB   27/27 KB   72/186 KB   58/174
KB   27/27 KB   76/186 KB   58/174 KB   27/27 KB   80/186 KB   58/174 KB   27/27 KB   83/186
KB   58/174 KB   27/27 KB   83/186 KB   62/174 KB   27/27 KB   83/186 KB   66/174 KB   27/27
KB   83/186 KB   70/174 KB   27/27 KB   83/186 KB   74/174 KB   27/27 KB   83/186 KB   78/174
KB                                      Downloaded: http://maven.objectstyle.org/nexus/content/groups/cayenne-deps/org/apache/maven/wagon/wagon-ssh-common/1.0-beta-7/wagon-ssh-common-1.0-beta-7.jar
(27 KB at 72.2 KB/sec)
83/186 KB   82/174 KB              83/186 KB   86/174 KB   83/186 KB   90/174 KB   83/186
KB   91/174 KB   87/186 KB   91/174 KB   91/186 KB   91/174 KB   95/186 KB   91/174 KB   99/186
KB   91/174 KB   103/186 KB   91/174 KB   107/186 KB   91/174 KB   111/186 KB   91/174 KB
  115/186 KB   91/174 KB   119/186 KB   91/174 KB   120/186 KB   91/174 KB   120/186 KB  
95/174 KB   120/186 KB   99/174 KB   120/186 KB   103/174 KB   120/186 KB   107/174 KB   120/186
KB   111/174 KB   120/186 KB   115/174 KB   120/186 KB   119/174 KB   120/186 KB   123/174
KB   120/186 KB   127/174 KB   120/186 KB   131/174 KB   120/186 KB   135/174 KB   120/186
KB   137/174 KB   124/186 KB   137/174 KB   128/186 KB   137/174 KB   132/186 KB   137/174
KB   136/186 KB   137/174 KB   140/186 KB   137/174 KB   144/186 KB   137/174 KB   148/186
KB   137/174 KB   152/186 KB   137/174 KB   156/186 KB   137/174 KB   160/186 KB   137/174
KB   162/186 KB   137/174 KB   162/186 KB   141/174 KB   162/186 KB   145/174 KB   162/186
KB   149/174 KB   162/186 KB   153/174 KB   162/186 KB   157/174 KB   162/186 KB   161/174
KB   162/186 KB   165/174 KB   162/186 KB   169/174 KB   162/186 KB   173/174 KB   162/186
KB   174/174 KB   166/186 KB   174/174 KB   170/186 KB   174/174 KB   174/186 KB   174/174
KB   178/186 KB   174/174 KB   182/186 KB   174/174 KB   186/186 KB   174/174 KB   186/186
KB   174/174 KB                             Downloaded: http://maven.objectstyle.org/nexus/content/groups/cayenne-deps/com/jcraft/jsch/0.1.38/jsch-0.1.38.jar
(174 KB at 268.7 KB/sec)
                          Downloaded: http://maven.objectstyle.org/nexus/content/groups/cayenne-deps/org/codehaus/plexus/plexus-utils/1.4.2/plexus-utils-1.4.2.jar
(186 KB at 270.1 KB/sec)
[ERROR] The build could not read 4 projects -> [Help 1]
org.apache.maven.project.ProjectBuildingException: Some problems were encountered while processing
the POMs:
[WARNING] 'parent.relativePath' points at org.apache.cayenne.docs:cayenne-asciidoc-parent
instead of org.apache.cayenne.parents:cayenne-asciidoc-parent, please verify your project
structure @ line 24, column 13
[FATAL] Non-resolvable parent POM: Could not find artifact org.apache.cayenne.parents:cayenne-asciidoc-parent:pom:3.1.3-SNAPSHOT
and 'parent.relativePath' points at wrong local POM @ line 24, column 13
[WARNING] 'parent.relativePath' points at org.apache.cayenne.docs:cayenne-asciidoc-parent
instead of org.apache.cayenne.parents:cayenne-asciidoc-parent, please verify your project
structure @ line 5, column 13
[FATAL] Non-resolvable parent POM: Could not find artifact org.apache.cayenne.parents:cayenne-asciidoc-parent:pom:3.1.3-SNAPSHOT
and 'parent.relativePath' points at wrong local POM @ line 5, column 13
[WARNING] 'parent.relativePath' points at org.apache.cayenne.docs:cayenne-asciidoc-parent
instead of org.apache.cayenne.parents:cayenne-asciidoc-parent, please verify your project
structure @ line 5, column 13
[FATAL] Non-resolvable parent POM: Could not find artifact org.apache.cayenne.parents:cayenne-asciidoc-parent:pom:3.1.3-SNAPSHOT
and 'parent.relativePath' points at wrong local POM @ line 5, column 13
[WARNING] 'parent.relativePath' points at org.apache.cayenne.docs:cayenne-asciidoc-parent
instead of org.apache.cayenne.parents:cayenne-asciidoc-parent, please verify your project
structure @ line 5, column 13
[FATAL] Non-resolvable parent POM: Could not find artifact org.apache.cayenne.parents:cayenne-asciidoc-parent:pom:3.1.3-SNAPSHOT
and 'parent.relativePath' points at wrong local POM @ line 5, column 13
[WARNING] 'dependencies.dependency.(groupId:artifactId:type:classifier)' must be unique: org.apache.cayenne.build-tools:cayenne-test-utilities:jar
-> duplicate declaration of version ${project.version} @ line 46, column 15

	at org.apache.maven.project.DefaultProjectBuilder.build(DefaultProjectBuilder.java:363)
	at org.apache.maven.DefaultMaven.collectProjects(DefaultMaven.java:636)
	at org.apache.maven.DefaultMaven.getProjectsForMavenReactor(DefaultMaven.java:585)
	at org.apache.maven.DefaultMaven.doExecute(DefaultMaven.java:234)
	at org.apache.maven.DefaultMaven.execute(DefaultMaven.java:156)
	at org.apache.maven.cli.MavenCli.execute(MavenCli.java:537)
	at org.apache.maven.cli.MavenCli.doMain(MavenCli.java:196)
	at org.apache.maven.cli.MavenCli.main(MavenCli.java:141)
	at sun.reflect.NativeMethodAccessorImpl.invoke0(Native Method)
	at sun.reflect.NativeMethodAccessorImpl.invoke(NativeMethodAccessorImpl.java:57)
	at sun.reflect.DelegatingMethodAccessorImpl.invoke(DelegatingMethodAccessorImpl.java:43)
	at java.lang.reflect.Method.invoke(Method.java:606)
	at org.codehaus.plexus.classworlds.launcher.Launcher.launchEnhanced(Launcher.java:290)
	at org.codehaus.plexus.classworlds.launcher.Launcher.launch(Launcher.java:230)
	at org.codehaus.plexus.classworlds.launcher.Launcher.mainWithExitCode(Launcher.java:409)
	at org.codehaus.plexus.classworlds.launcher.Launcher.main(Launcher.java:352)
[ERROR]   
[ERROR]   The project org.apache.cayenne.parents:getting-started-guide:3.1.3-SNAPSHOT (<https://builds.apache.org/job/cayenne-31/cayenneTestConnection=hsql,jdk=JDK%201.7%20(latest),slave=ubuntu/ws/docs/asciidoc/getting-started-guide/pom.xml)>
has 1 error
[ERROR]     Non-resolvable parent POM: Could not find artifact org.apache.cayenne.parents:cayenne-asciidoc-parent:pom:3.1.3-SNAPSHOT
and 'parent.relativePath' points at wrong local POM @ line 24, column 13 -> [Help 2]
org.apache.maven.model.resolution.UnresolvableModelException: Could not find artifact org.apache.cayenne.parents:cayenne-asciidoc-parent:pom:3.1.3-SNAPSHOT
	at org.apache.maven.project.ProjectModelResolver.resolveModel(ProjectModelResolver.java:159)
	at org.apache.maven.model.building.DefaultModelBuilder.readParentExternally(DefaultModelBuilder.java:813)
	at org.apache.maven.model.building.DefaultModelBuilder.readParent(DefaultModelBuilder.java:664)
	at org.apache.maven.model.building.DefaultModelBuilder.build(DefaultModelBuilder.java:310)
	at org.apache.maven.model.building.DefaultModelBuilder.build(DefaultModelBuilder.java:232)
	at org.apache.maven.project.DefaultProjectBuilder.build(DefaultProjectBuilder.java:410)
	at org.apache.maven.project.DefaultProjectBuilder.build(DefaultProjectBuilder.java:379)
	at org.apache.maven.project.DefaultProjectBuilder.build(DefaultProjectBuilder.java:495)
	at org.apache.maven.project.DefaultProjectBuilder.build(DefaultProjectBuilder.java:379)
	at org.apache.maven.project.DefaultProjectBuilder.build(DefaultProjectBuilder.java:495)
	at org.apache.maven.project.DefaultProjectBuilder.build(DefaultProjectBuilder.java:379)
	at org.apache.maven.project.DefaultProjectBuilder.build(DefaultProjectBuilder.java:495)
	at org.apache.maven.project.DefaultProjectBuilder.build(DefaultProjectBuilder.java:379)
	at org.apache.maven.project.DefaultProjectBuilder.build(DefaultProjectBuilder.java:343)
	at org.apache.maven.DefaultMaven.collectProjects(DefaultMaven.java:636)
	at org.apache.maven.DefaultMaven.getProjectsForMavenReactor(DefaultMaven.java:585)
	at org.apache.maven.DefaultMaven.doExecute(DefaultMaven.java:234)
	at org.apache.maven.DefaultMaven.execute(DefaultMaven.java:156)
	at org.apache.maven.cli.MavenCli.execute(MavenCli.java:537)
	at org.apache.maven.cli.MavenCli.doMain(MavenCli.java:196)
	at org.apache.maven.cli.MavenCli.main(MavenCli.java:141)
	at sun.reflect.NativeMethodAccessorImpl.invoke0(Native Method)
	at sun.reflect.NativeMethodAccessorImpl.invoke(NativeMethodAccessorImpl.java:57)
	at sun.reflect.DelegatingMethodAccessorImpl.invoke(DelegatingMethodAccessorImpl.java:43)
	at java.lang.reflect.Method.invoke(Method.java:606)
	at org.codehaus.plexus.classworlds.launcher.Launcher.launchEnhanced(Launcher.java:290)
	at org.codehaus.plexus.classworlds.launcher.Launcher.launch(Launcher.java:230)
	at org.codehaus.plexus.classworlds.launcher.Launcher.mainWithExitCode(Launcher.java:409)
	at org.codehaus.plexus.classworlds.launcher.Launcher.main(Launcher.java:352)
Caused by: org.sonatype.aether.resolution.ArtifactResolutionException: Could not find artifact
org.apache.cayenne.parents:cayenne-asciidoc-parent:pom:3.1.3-SNAPSHOT
	at org.sonatype.aether.impl.internal.DefaultArtifactResolver.resolve(DefaultArtifactResolver.java:538)
	at org.sonatype.aether.impl.internal.DefaultArtifactResolver.resolveArtifacts(DefaultArtifactResolver.java:216)
	at org.sonatype.aether.impl.internal.DefaultArtifactResolver.resolveArtifact(DefaultArtifactResolver.java:193)
	at org.sonatype.aether.impl.internal.DefaultRepositorySystem.resolveArtifact(DefaultRepositorySystem.java:286)
	at org.apache.maven.project.ProjectModelResolver.resolveModel(ProjectModelResolver.java:155)
	... 28 more
Caused by: org.sonatype.aether.transfer.ArtifactNotFoundException: Could not find artifact
org.apache.cayenne.parents:cayenne-asciidoc-parent:pom:3.1.3-SNAPSHOT
	at org.sonatype.aether.impl.internal.DefaultArtifactResolver.resolve(DefaultArtifactResolver.java:528)
	... 32 more
[ERROR]   
[ERROR]   The project org.apache.cayenne.parents:cayenne-guide:3.1.3-SNAPSHOT (<https://builds.apache.org/job/cayenne-31/cayenneTestConnection=hsql,jdk=JDK%201.7%20(latest),slave=ubuntu/ws/docs/asciidoc/cayenne-guide/pom.xml)>
has 1 error
[ERROR]     Non-resolvable parent POM: Could not find artifact org.apache.cayenne.parents:cayenne-asciidoc-parent:pom:3.1.3-SNAPSHOT
and 'parent.relativePath' points at wrong local POM @ line 5, column 13 -> [Help 2]
org.apache.maven.model.resolution.UnresolvableModelException: Could not find artifact org.apache.cayenne.parents:cayenne-asciidoc-parent:pom:3.1.3-SNAPSHOT
	at org.apache.maven.project.ProjectModelResolver.resolveModel(ProjectModelResolver.java:159)
	at org.apache.maven.model.building.DefaultModelBuilder.readParentExternally(DefaultModelBuilder.java:813)
	at org.apache.maven.model.building.DefaultModelBuilder.readParent(DefaultModelBuilder.java:664)
	at org.apache.maven.model.building.DefaultModelBuilder.build(DefaultModelBuilder.java:310)
	at org.apache.maven.model.building.DefaultModelBuilder.build(DefaultModelBuilder.java:232)
	at org.apache.maven.project.DefaultProjectBuilder.build(DefaultProjectBuilder.java:410)
	at org.apache.maven.project.DefaultProjectBuilder.build(DefaultProjectBuilder.java:379)
	at org.apache.maven.project.DefaultProjectBuilder.build(DefaultProjectBuilder.java:495)
	at org.apache.maven.project.DefaultProjectBuilder.build(DefaultProjectBuilder.java:379)
	at org.apache.maven.project.DefaultProjectBuilder.build(DefaultProjectBuilder.java:495)
	at org.apache.maven.project.DefaultProjectBuilder.build(DefaultProjectBuilder.java:379)
	at org.apache.maven.project.DefaultProjectBuilder.build(DefaultProjectBuilder.java:495)
	at org.apache.maven.project.DefaultProjectBuilder.build(DefaultProjectBuilder.java:379)
	at org.apache.maven.project.DefaultProjectBuilder.build(DefaultProjectBuilder.java:343)
	at org.apache.maven.DefaultMaven.collectProjects(DefaultMaven.java:636)
	at org.apache.maven.DefaultMaven.getProjectsForMavenReactor(DefaultMaven.java:585)
	at org.apache.maven.DefaultMaven.doExecute(DefaultMaven.java:234)
	at org.apache.maven.DefaultMaven.execute(DefaultMaven.java:156)
	at org.apache.maven.cli.MavenCli.execute(MavenCli.java:537)
	at org.apache.maven.cli.MavenCli.doMain(MavenCli.java:196)
	at org.apache.maven.cli.MavenCli.main(MavenCli.java:141)
	at sun.reflect.NativeMethodAccessorImpl.invoke0(Native Method)
	at sun.reflect.NativeMethodAccessorImpl.invoke(NativeMethodAccessorImpl.java:57)
	at sun.reflect.DelegatingMethodAccessorImpl.invoke(DelegatingMethodAccessorImpl.java:43)
	at java.lang.reflect.Method.invoke(Method.java:606)
	at org.codehaus.plexus.classworlds.launcher.Launcher.launchEnhanced(Launcher.java:290)
	at org.codehaus.plexus.classworlds.launcher.Launcher.launch(Launcher.java:230)
	at org.codehaus.plexus.classworlds.launcher.Launcher.mainWithExitCode(Launcher.java:409)
	at org.codehaus.plexus.classworlds.launcher.Launcher.main(Launcher.java:352)
Caused by: org.sonatype.aether.resolution.ArtifactResolutionException: Could not find artifact
org.apache.cayenne.parents:cayenne-asciidoc-parent:pom:3.1.3-SNAPSHOT
	at org.sonatype.aether.impl.internal.DefaultArtifactResolver.resolve(DefaultArtifactResolver.java:538)
	at org.sonatype.aether.impl.internal.DefaultArtifactResolver.resolveArtifacts(DefaultArtifactResolver.java:216)
	at org.sonatype.aether.impl.internal.DefaultArtifactResolver.resolveArtifact(DefaultArtifactResolver.java:193)
	at org.sonatype.aether.impl.internal.DefaultRepositorySystem.resolveArtifact(DefaultRepositorySystem.java:286)
	at org.apache.maven.project.ProjectModelResolver.resolveModel(ProjectModelResolver.java:155)
	... 28 more
Caused by: org.sonatype.aether.transfer.ArtifactNotFoundException: Could not find artifact
org.apache.cayenne.parents:cayenne-asciidoc-parent:pom:3.1.3-SNAPSHOT
	at org.sonatype.aether.impl.internal.DefaultArtifactResolver.resolve(DefaultArtifactResolver.java:528)
	... 32 more
[ERROR]   
[ERROR]   The project org.apache.cayenne.parents:getting-started-rop:3.1.3-SNAPSHOT (<https://builds.apache.org/job/cayenne-31/cayenneTestConnection=hsql,jdk=JDK%201.7%20(latest),slave=ubuntu/ws/docs/asciidoc/getting-started-rop/pom.xml)>
has 1 error
[ERROR]     Non-resolvable parent POM: Could not find artifact org.apache.cayenne.parents:cayenne-asciidoc-parent:pom:3.1.3-SNAPSHOT
and 'parent.relativePath' points at wrong local POM @ line 5, column 13 -> [Help 2]
org.apache.maven.model.resolution.UnresolvableModelException: Could not find artifact org.apache.cayenne.parents:cayenne-asciidoc-parent:pom:3.1.3-SNAPSHOT
	at org.apache.maven.project.ProjectModelResolver.resolveModel(ProjectModelResolver.java:159)
	at org.apache.maven.model.building.DefaultModelBuilder.readParentExternally(DefaultModelBuilder.java:813)
	at org.apache.maven.model.building.DefaultModelBuilder.readParent(DefaultModelBuilder.java:664)
	at org.apache.maven.model.building.DefaultModelBuilder.build(DefaultModelBuilder.java:310)
	at org.apache.maven.model.building.DefaultModelBuilder.build(DefaultModelBuilder.java:232)
	at org.apache.maven.project.DefaultProjectBuilder.build(DefaultProjectBuilder.java:410)
	at org.apache.maven.project.DefaultProjectBuilder.build(DefaultProjectBuilder.java:379)
	at org.apache.maven.project.DefaultProjectBuilder.build(DefaultProjectBuilder.java:495)
	at org.apache.maven.project.DefaultProjectBuilder.build(DefaultProjectBuilder.java:379)
	at org.apache.maven.project.DefaultProjectBuilder.build(DefaultProjectBuilder.java:495)
	at org.apache.maven.project.DefaultProjectBuilder.build(DefaultProjectBuilder.java:379)
	at org.apache.maven.project.DefaultProjectBuilder.build(DefaultProjectBuilder.java:495)
	at org.apache.maven.project.DefaultProjectBuilder.build(DefaultProjectBuilder.java:379)
	at org.apache.maven.project.DefaultProjectBuilder.build(DefaultProjectBuilder.java:343)
	at org.apache.maven.DefaultMaven.collectProjects(DefaultMaven.java:636)
	at org.apache.maven.DefaultMaven.getProjectsForMavenReactor(DefaultMaven.java:585)
	at org.apache.maven.DefaultMaven.doExecute(DefaultMaven.java:234)
	at org.apache.maven.DefaultMaven.execute(DefaultMaven.java:156)
	at org.apache.maven.cli.MavenCli.execute(MavenCli.java:537)
	at org.apache.maven.cli.MavenCli.doMain(MavenCli.java:196)
	at org.apache.maven.cli.MavenCli.main(MavenCli.java:141)
	at sun.reflect.NativeMethodAccessorImpl.invoke0(Native Method)
	at sun.reflect.NativeMethodAccessorImpl.invoke(NativeMethodAccessorImpl.java:57)
	at sun.reflect.DelegatingMethodAccessorImpl.invoke(DelegatingMethodAccessorImpl.java:43)
	at java.lang.reflect.Method.invoke(Method.java:606)
	at org.codehaus.plexus.classworlds.launcher.Launcher.launchEnhanced(Launcher.java:290)
	at org.codehaus.plexus.classworlds.launcher.Launcher.launch(Launcher.java:230)
	at org.codehaus.plexus.classworlds.launcher.Launcher.mainWithExitCode(Launcher.java:409)
	at org.codehaus.plexus.classworlds.launcher.Launcher.main(Launcher.java:352)
Caused by: org.sonatype.aether.resolution.ArtifactResolutionException: Could not find artifact
org.apache.cayenne.parents:cayenne-asciidoc-parent:pom:3.1.3-SNAPSHOT
	at org.sonatype.aether.impl.internal.DefaultArtifactResolver.resolve(DefaultArtifactResolver.java:538)
	at org.sonatype.aether.impl.internal.DefaultArtifactResolver.resolveArtifacts(DefaultArtifactResolver.java:216)
	at org.sonatype.aether.impl.internal.DefaultArtifactResolver.resolveArtifact(DefaultArtifactResolver.java:193)
	at org.sonatype.aether.impl.internal.DefaultRepositorySystem.resolveArtifact(DefaultRepositorySystem.java:286)
	at org.apache.maven.project.ProjectModelResolver.resolveModel(ProjectModelResolver.java:155)
	... 28 more
Caused by: org.sonatype.aether.transfer.ArtifactNotFoundException: Could not find artifact
org.apache.cayenne.parents:cayenne-asciidoc-parent:pom:3.1.3-SNAPSHOT
	at org.sonatype.aether.impl.internal.DefaultArtifactResolver.resolve(DefaultArtifactResolver.java:528)
	... 32 more
[ERROR]   
[ERROR]   The project org.apache.cayenne.parents:upgrade-guide:3.1.3-SNAPSHOT (<https://builds.apache.org/job/cayenne-31/cayenneTestConnection=hsql,jdk=JDK%201.7%20(latest),slave=ubuntu/ws/docs/asciidoc/upgrade-guide/pom.xml)>
has 1 error
[ERROR]     Non-resolvable parent POM: Could not find artifact org.apache.cayenne.parents:cayenne-asciidoc-parent:pom:3.1.3-SNAPSHOT
and 'parent.relativePath' points at wrong local POM @ line 5, column 13 -> [Help 2]
org.apache.maven.model.resolution.UnresolvableModelException: Could not find artifact org.apache.cayenne.parents:cayenne-asciidoc-parent:pom:3.1.3-SNAPSHOT
	at org.apache.maven.project.ProjectModelResolver.resolveModel(ProjectModelResolver.java:159)
	at org.apache.maven.model.building.DefaultModelBuilder.readParentExternally(DefaultModelBuilder.java:813)
	at org.apache.maven.model.building.DefaultModelBuilder.readParent(DefaultModelBuilder.java:664)
	at org.apache.maven.model.building.DefaultModelBuilder.build(DefaultModelBuilder.java:310)
	at org.apache.maven.model.building.DefaultModelBuilder.build(DefaultModelBuilder.java:232)
	at org.apache.maven.project.DefaultProjectBuilder.build(DefaultProjectBuilder.java:410)
	at org.apache.maven.project.DefaultProjectBuilder.build(DefaultProjectBuilder.java:379)
	at org.apache.maven.project.DefaultProjectBuilder.build(DefaultProjectBuilder.java:495)
	at org.apache.maven.project.DefaultProjectBuilder.build(DefaultProjectBuilder.java:379)
	at org.apache.maven.project.DefaultProjectBuilder.build(DefaultProjectBuilder.java:495)
	at org.apache.maven.project.DefaultProjectBuilder.build(DefaultProjectBuilder.java:379)
	at org.apache.maven.project.DefaultProjectBuilder.build(DefaultProjectBuilder.java:495)
	at org.apache.maven.project.DefaultProjectBuilder.build(DefaultProjectBuilder.java:379)
	at org.apache.maven.project.DefaultProjectBuilder.build(DefaultProjectBuilder.java:343)
	at org.apache.maven.DefaultMaven.collectProjects(DefaultMaven.java:636)
	at org.apache.maven.DefaultMaven.getProjectsForMavenReactor(DefaultMaven.java:585)
	at org.apache.maven.DefaultMaven.doExecute(DefaultMaven.java:234)
	at org.apache.maven.DefaultMaven.execute(DefaultMaven.java:156)
	at org.apache.maven.cli.MavenCli.execute(MavenCli.java:537)
	at org.apache.maven.cli.MavenCli.doMain(MavenCli.java:196)
	at org.apache.maven.cli.MavenCli.main(MavenCli.java:141)
	at sun.reflect.NativeMethodAccessorImpl.invoke0(Native Method)
	at sun.reflect.NativeMethodAccessorImpl.invoke(NativeMethodAccessorImpl.java:57)
	at sun.reflect.DelegatingMethodAccessorImpl.invoke(DelegatingMethodAccessorImpl.java:43)
	at java.lang.reflect.Method.invoke(Method.java:606)
	at org.codehaus.plexus.classworlds.launcher.Launcher.launchEnhanced(Launcher.java:290)
	at org.codehaus.plexus.classworlds.launcher.Launcher.launch(Launcher.java:230)
	at org.codehaus.plexus.classworlds.launcher.Launcher.mainWithExitCode(Launcher.java:409)
	at org.codehaus.plexus.classworlds.launcher.Launcher.main(Launcher.java:352)
Caused by: org.sonatype.aether.resolution.ArtifactResolutionException: Could not find artifact
org.apache.cayenne.parents:cayenne-asciidoc-parent:pom:3.1.3-SNAPSHOT
	at org.sonatype.aether.impl.internal.DefaultArtifactResolver.resolve(DefaultArtifactResolver.java:538)
	at org.sonatype.aether.impl.internal.DefaultArtifactResolver.resolveArtifacts(DefaultArtifactResolver.java:216)
	at org.sonatype.aether.impl.internal.DefaultArtifactResolver.resolveArtifact(DefaultArtifactResolver.java:193)
	at org.sonatype.aether.impl.internal.DefaultRepositorySystem.resolveArtifact(DefaultRepositorySystem.java:286)
	at org.apache.maven.project.ProjectModelResolver.resolveModel(ProjectModelResolver.java:155)
	... 28 more
Caused by: org.sonatype.aether.transfer.ArtifactNotFoundException: Could not find artifact
org.apache.cayenne.parents:cayenne-asciidoc-parent:pom:3.1.3-SNAPSHOT
	at org.sonatype.aether.impl.internal.DefaultArtifactResolver.resolve(DefaultArtifactResolver.java:528)
	... 32 more
[ERROR] 
[ERROR] Re-run Maven using the -X switch to enable full debug logging.
[ERROR] 
[ERROR] For more information about the errors and possible solutions, please read the following
articles:
[ERROR] [Help 1] http://cwiki.apache.org/confluence/display/MAVEN/ProjectBuildingException
[ERROR] [Help 2] http://cwiki.apache.org/confluence/display/MAVEN/UnresolvableModelException
Build step 'Invoke top-level Maven targets' marked build as failure
Not sending mail to unregistered user stariy95@gmail.com

Mime
View raw message