cayenne-commits mailing list archives

Site index · List index
Message view « Date » · « Thread »
Top « Date » · « Thread »
From Apache Jenkins Server <jenk...@builds.apache.org>
Subject Build failed in Jenkins: cayenne-master » derby,JDK 1.8 (latest),ubuntu #808
Date Tue, 06 Mar 2018 15:27:51 GMT
See <https://builds.apache.org/job/cayenne-master/cayenneTestConnection=derby,jdk=JDK%201.8%20(latest),slave=ubuntu/808/display/redirect?page=changes>

Changes:

[stariy95] CAY-2412 test case + warning about limit with joint prefetch

------------------------------------------
[...truncated 7.59 MB...]
[main] INFO org.apache.cayenne.configuration.xml.XMLDataChannelDescriptorLoader - Loading
XML configuration resource from <https://builds.apache.org/job/cayenne-master/cayenneTestConnection=derby,jdk=JDK%201.8%20(latest),slave=ubuntu/ws/cayenne-server/target/test-classes/cayenne-relationships-collection-to-many.xml>
[main] INFO org.apache.cayenne.configuration.xml.XMLDataChannelDescriptorLoader - Loading
XML DataMap resource from <https://builds.apache.org/job/cayenne-master/cayenneTestConnection=derby,jdk=JDK%201.8%20(latest),slave=ubuntu/ws/cayenne-server/target/test-classes/relationships-collection-to-many.map.xml>
[main] INFO org.apache.cayenne.configuration.xml.XMLDataChannelDescriptorLoader - Loading
XML configuration resource from <https://builds.apache.org/job/cayenne-master/cayenneTestConnection=derby,jdk=JDK%201.8%20(latest),slave=ubuntu/ws/cayenne-server/target/test-classes/cayenne-relationships-collection-to-many.xml>
[main] INFO org.apache.cayenne.configuration.xml.XMLDataChannelDescriptorLoader - Loading
XML DataMap resource from <https://builds.apache.org/job/cayenne-master/cayenneTestConnection=derby,jdk=JDK%201.8%20(latest),slave=ubuntu/ws/cayenne-server/target/test-classes/relationships-collection-to-many.map.xml>
[main] INFO org.apache.cayenne.test.jdbc.UtilityLogger - delete from COLLECTION_TO_MANY_TARGET
[main] INFO org.apache.cayenne.test.jdbc.UtilityLogger - delete from COLLECTION_TO_MANY
[main] INFO org.apache.cayenne.test.jdbc.UtilityLogger - INSERT INTO COLLECTION_TO_MANY (ID)
VALUES (?)
[main] INFO org.apache.cayenne.test.jdbc.UtilityLogger - INSERT INTO COLLECTION_TO_MANY (ID)
VALUES (?)
[main] INFO org.apache.cayenne.test.jdbc.UtilityLogger - INSERT INTO COLLECTION_TO_MANY_TARGET
(ID, COLLECTION_TO_MANY_ID) VALUES (?, ?)
[main] INFO org.apache.cayenne.test.jdbc.UtilityLogger - INSERT INTO COLLECTION_TO_MANY_TARGET
(ID, COLLECTION_TO_MANY_ID) VALUES (?, ?)
[main] INFO org.apache.cayenne.test.jdbc.UtilityLogger - INSERT INTO COLLECTION_TO_MANY_TARGET
(ID, COLLECTION_TO_MANY_ID) VALUES (?, ?)
[main] INFO org.apache.cayenne.test.jdbc.UtilityLogger - INSERT INTO COLLECTION_TO_MANY_TARGET
(ID, COLLECTION_TO_MANY_ID) VALUES (?, ?)
[main] INFO org.apache.cayenne.log.JdbcEventLogger - --- transaction started.
[main] INFO org.apache.cayenne.log.JdbcEventLogger - SELECT t0.ID FROM COLLECTION_TO_MANY
t0 WHERE t0.ID = ? [bind: 1->ID:1]
[main] INFO org.apache.cayenne.log.JdbcEventLogger - === returned 1 row. - took 1 ms.
[main] INFO org.apache.cayenne.log.JdbcEventLogger - +++ transaction committed.
[main] INFO org.apache.cayenne.log.JdbcEventLogger - --- transaction started.
[main] INFO org.apache.cayenne.log.JdbcEventLogger - SELECT t0.COLLECTION_TO_MANY_ID, t0.ID
FROM COLLECTION_TO_MANY_TARGET t0 WHERE t0.COLLECTION_TO_MANY_ID = ? [bind: 1->COLLECTION_TO_MANY_ID:1]
[main] INFO org.apache.cayenne.log.JdbcEventLogger - === returned 3 rows. - took 0 ms.
[main] INFO org.apache.cayenne.log.JdbcEventLogger - +++ transaction committed.
[main] INFO org.apache.cayenne.log.JdbcEventLogger - --- transaction started.
[main] INFO org.apache.cayenne.log.JdbcEventLogger - UPDATE COLLECTION_TO_MANY_TARGET SET
COLLECTION_TO_MANY_ID = ? WHERE ID = ?
[main] INFO org.apache.cayenne.log.JdbcEventLogger - [batch bind: 1->COLLECTION_TO_MANY_ID:NULL,
2->ID:2]
[main] INFO org.apache.cayenne.log.JdbcEventLogger - === updated 1 row.
[main] INFO org.apache.cayenne.log.JdbcEventLogger - +++ transaction committed.
[main] INFO org.apache.cayenne.log.JdbcEventLogger - --- transaction started.
[main] INFO org.apache.cayenne.log.JdbcEventLogger - SELECT t0.ID FROM COLLECTION_TO_MANY
t0 WHERE t0.ID = ? [bind: 1->ID:1]
[main] INFO org.apache.cayenne.log.JdbcEventLogger - === returned 1 row. - took 0 ms.
[main] INFO org.apache.cayenne.log.JdbcEventLogger - +++ transaction committed.
[main] INFO org.apache.cayenne.log.JdbcEventLogger - --- transaction started.
[main] INFO org.apache.cayenne.log.JdbcEventLogger - SELECT t0.COLLECTION_TO_MANY_ID, t0.ID
FROM COLLECTION_TO_MANY_TARGET t0 WHERE t0.COLLECTION_TO_MANY_ID = ? [bind: 1->COLLECTION_TO_MANY_ID:1]
[main] INFO org.apache.cayenne.log.JdbcEventLogger - === returned 2 rows. - took 0 ms.
[main] INFO org.apache.cayenne.log.JdbcEventLogger - +++ transaction committed.
[main] INFO org.apache.cayenne.configuration.xml.XMLDataChannelDescriptorLoader - Loading
XML configuration resource from <https://builds.apache.org/job/cayenne-master/cayenneTestConnection=derby,jdk=JDK%201.8%20(latest),slave=ubuntu/ws/cayenne-server/target/test-classes/cayenne-relationships-collection-to-many.xml>
[main] INFO org.apache.cayenne.configuration.xml.XMLDataChannelDescriptorLoader - Loading
XML DataMap resource from <https://builds.apache.org/job/cayenne-master/cayenneTestConnection=derby,jdk=JDK%201.8%20(latest),slave=ubuntu/ws/cayenne-server/target/test-classes/relationships-collection-to-many.map.xml>
[main] INFO org.apache.cayenne.configuration.xml.XMLDataChannelDescriptorLoader - Loading
XML configuration resource from <https://builds.apache.org/job/cayenne-master/cayenneTestConnection=derby,jdk=JDK%201.8%20(latest),slave=ubuntu/ws/cayenne-server/target/test-classes/cayenne-relationships-collection-to-many.xml>
[main] INFO org.apache.cayenne.configuration.xml.XMLDataChannelDescriptorLoader - Loading
XML DataMap resource from <https://builds.apache.org/job/cayenne-master/cayenneTestConnection=derby,jdk=JDK%201.8%20(latest),slave=ubuntu/ws/cayenne-server/target/test-classes/relationships-collection-to-many.map.xml>
[main] INFO org.apache.cayenne.test.jdbc.UtilityLogger - delete from COLLECTION_TO_MANY_TARGET
[main] INFO org.apache.cayenne.test.jdbc.UtilityLogger - delete from COLLECTION_TO_MANY
[main] INFO org.apache.cayenne.test.jdbc.UtilityLogger - INSERT INTO COLLECTION_TO_MANY (ID)
VALUES (?)
[main] INFO org.apache.cayenne.test.jdbc.UtilityLogger - INSERT INTO COLLECTION_TO_MANY (ID)
VALUES (?)
[main] INFO org.apache.cayenne.test.jdbc.UtilityLogger - INSERT INTO COLLECTION_TO_MANY_TARGET
(ID, COLLECTION_TO_MANY_ID) VALUES (?, ?)
[main] INFO org.apache.cayenne.test.jdbc.UtilityLogger - INSERT INTO COLLECTION_TO_MANY_TARGET
(ID, COLLECTION_TO_MANY_ID) VALUES (?, ?)
[main] INFO org.apache.cayenne.test.jdbc.UtilityLogger - INSERT INTO COLLECTION_TO_MANY_TARGET
(ID, COLLECTION_TO_MANY_ID) VALUES (?, ?)
[main] INFO org.apache.cayenne.test.jdbc.UtilityLogger - INSERT INTO COLLECTION_TO_MANY_TARGET
(ID, COLLECTION_TO_MANY_ID) VALUES (?, ?)
[main] INFO org.apache.cayenne.log.JdbcEventLogger - --- transaction started.
[main] INFO org.apache.cayenne.log.JdbcEventLogger - SELECT t0.ID FROM COLLECTION_TO_MANY
t0 WHERE t0.ID = ? [bind: 1->ID:1]
[main] INFO org.apache.cayenne.log.JdbcEventLogger - === returned 1 row. - took 0 ms.
[main] INFO org.apache.cayenne.log.JdbcEventLogger - +++ transaction committed.
[main] INFO org.apache.cayenne.log.JdbcEventLogger - --- transaction started.
[main] INFO org.apache.cayenne.log.JdbcEventLogger - SELECT t0.COLLECTION_TO_MANY_ID, t0.ID
FROM COLLECTION_TO_MANY_TARGET t0 WHERE t0.COLLECTION_TO_MANY_ID = ? [bind: 1->COLLECTION_TO_MANY_ID:1]
[main] INFO org.apache.cayenne.log.JdbcEventLogger - === returned 3 rows. - took 1 ms.
[main] INFO org.apache.cayenne.log.JdbcEventLogger - +++ transaction committed.
[main] INFO org.apache.cayenne.log.JdbcEventLogger - --- transaction started.
[main] INFO org.apache.cayenne.log.JdbcEventLogger - INSERT INTO COLLECTION_TO_MANY_TARGET
(COLLECTION_TO_MANY_ID, ID) VALUES (?, ?)
[main] INFO org.apache.cayenne.log.JdbcEventLogger - [batch bind: 1->COLLECTION_TO_MANY_ID:1,
2->ID:201]
[main] INFO org.apache.cayenne.log.JdbcEventLogger - === updated 1 row.
[main] INFO org.apache.cayenne.log.JdbcEventLogger - +++ transaction committed.
[main] INFO org.apache.cayenne.log.JdbcEventLogger - --- transaction started.
[main] INFO org.apache.cayenne.log.JdbcEventLogger - SELECT t0.ID FROM COLLECTION_TO_MANY
t0 WHERE t0.ID = ? [bind: 1->ID:1]
[main] INFO org.apache.cayenne.log.JdbcEventLogger - === returned 1 row. - took 0 ms.
[main] INFO org.apache.cayenne.log.JdbcEventLogger - +++ transaction committed.
[main] INFO org.apache.cayenne.log.JdbcEventLogger - --- transaction started.
[main] INFO org.apache.cayenne.log.JdbcEventLogger - SELECT t0.COLLECTION_TO_MANY_ID, t0.ID
FROM COLLECTION_TO_MANY_TARGET t0 WHERE t0.COLLECTION_TO_MANY_ID = ? [bind: 1->COLLECTION_TO_MANY_ID:1]
[main] INFO org.apache.cayenne.log.JdbcEventLogger - === returned 4 rows. - took 0 ms.
[main] INFO org.apache.cayenne.log.JdbcEventLogger - +++ transaction committed.
[INFO] Tests run: 5, Failures: 0, Errors: 0, Skipped: 0, Time elapsed: 0.508 s - in org.apache.cayenne.CDOCollectionRelationshipIT
[INFO] 
[INFO] Results:
[INFO] 
[ERROR] Errors: 
[ERROR]   FlattenedRelationshipsIT.testFlattenedComplexToOneRelationship:309 » CayenneRuntime
[ERROR]   VerticalInheritanceIT.testInsertWithMultipleAttributeAndMultipleRelationship:647
» CayenneRuntime
[ERROR]   SelectActionIT.testFetchLimit_DistinctResultIterator:59 » CayenneRuntime [v.4....
[ERROR]   ColumnSelectIT.testHavingWithoutAggregate:217 » CayenneRuntime [v.4.1.M2-SNAPS...
[ERROR]   ColumnSelectIT.testObjPropertyInWhere:948 » CayenneRuntime [v.4.1.M2-SNAPSHOT ...
[ERROR]   ColumnSelectIT.testSelectFirst_MultiColumns:409 » CayenneRuntime [v.4.1.M2-SNA...
[ERROR]   ColumnSelectIT.testSelectFirst_RelColumn:461 » CayenneRuntime [v.4.1.M2-SNAPSH...
[ERROR]   ColumnSelectIT.testSelectFirst_RelColumnWithFunction:477 » CayenneRuntime [v.4...
[ERROR]   ColumnSelectIT.testSelectFirst_RelColumns:448 » CayenneRuntime [v.4.1.M2-SNAPS...
[ERROR]   ColumnSelectIT.testSelectFirst_SingleValueInColumns:421 » CayenneRuntime [v.4....
[ERROR]   ColumnSelectIT.testSelectFirst_SubstringName:433 » CayenneRuntime [v.4.1.M2-SN...
[ERROR]   ColumnSelectIT.testSelectGroupBy:115 » CayenneRuntime [v.4.1.M2-SNAPSHOT Mar 0...
[ERROR]   ColumnSelectIT.testSelectGroupByWithQuoting:324 » CayenneRuntime [v.4.1.M2-SNA...
[ERROR]   ColumnSelectIT.testSelectRelationshipCount:149 » CayenneRuntime [v.4.1.M2-SNAP...
[ERROR]   ObjectSelect_PrimitiveColumnsIT.test_SelectBooleanColumn:104 » CayenneRuntime ...
[ERROR]   ObjectSelect_PrimitiveColumnsIT.test_SelectBooleanExpColumn:130 » CayenneRuntime
[ERROR]   ObjectSelect_PrimitiveColumnsIT.test_SelectIntegerColumn:73 » CayenneRuntime [...
[ERROR]   ObjectSelect_PrimitiveColumnsIT.test_SelectIntegerExpColumn:95 » CayenneRuntime
[ERROR]   ObjectSelect_RunIT.test_SelectFirst:162 » CayenneRuntime [v.4.1.M2-SNAPSHOT Ma...
[ERROR]   ObjectSelect_RunIT.test_SelectFirst_MoreThanOneMatch:184 » CayenneRuntime [v.4...
[ERROR]   ObjectSelect_RunIT.test_SelectFirst_NoMatch:177 » CayenneRuntime [v.4.1.M2-SNA...
[ERROR]   ObjectSelect_RunIT.test_SelectFirst_SubstringInWhere:204 » CayenneRuntime [v.4...
[ERROR]   ObjectSelect_RunIT.test_SelectFirst_TrimInWhere:194 » CayenneRuntime [v.4.1.M2...
[ERROR]   SelectQueryClobIT.testSelectFetchLimit_Offset_DistinctClob:90 » CayenneRuntime
[ERROR]   SelectQueryFetchLimitOrderingIT.testOrdering:73 » CayenneRuntime [v.4.1.M2-SNA...
[ERROR]   SelectQueryIT.testCacheOffsetAndLimit:860 » CayenneRuntime [v.4.1.M2-SNAPSHOT ...
[ERROR]   SelectQueryIT.testFetchLimit:120 » CayenneRuntime [v.4.1.M2-SNAPSHOT Mar 06 20...
[ERROR]   SelectQueryIT.testFetchLimitWithOffset:161 » CayenneRuntime [v.4.1.M2-SNAPSHOT...
[ERROR]   SelectQueryIT.testFetchLimitWithQualifier:190 » CayenneRuntime [v.4.1.M2-SNAPS...
[ERROR]   SelectQueryIT.testFetchOffset:135 » CayenneRuntime [v.4.1.M2-SNAPSHOT Mar 06 2...
[ERROR]   SelectQueryIT.testFetchOffsetWithQualifier:174 » CayenneRuntime [v.4.1.M2-SNAP...
[ERROR]   SelectQueryIT.testSelectFirst:519 » CayenneRuntime [v.4.1.M2-SNAPSHOT Mar 06 2...
[INFO] 
[ERROR] Tests run: 1716, Failures: 0, Errors: 32, Skipped: 8
[INFO] 
[INFO] 
[INFO] --- maven-failsafe-plugin:2.20.1:verify (integration-test) @ cayenne-server ---
[INFO] Failsafe report directory: <https://builds.apache.org/job/cayenne-master/cayenneTestConnection=derby,jdk=JDK%201.8%20(latest),slave=ubuntu/ws/cayenne-server/target/failsafe-reports>
[INFO] ------------------------------------------------------------------------
[INFO] Reactor Summary:
[INFO] 
[INFO] cayenne-parent: Top-level parent of Cayenne modules  SUCCESS [  1.620 s]
[INFO] build-tools-parent: Cayenne Build Tools Parent ..... SUCCESS [  0.223 s]
[INFO] cayenne-legal: Cayenne License and Notice Bundle ... SUCCESS [  2.318 s]
[INFO] cayenne-test-utilities: Common Unit Test Utilities . SUCCESS [  1.793 s]
[INFO] cayenne-checkers: Cayenne Code Checkers ............ SUCCESS [  1.196 s]
[INFO] cayenne-di: Cayenne Dependency Injection Container . SUCCESS [  5.392 s]
[INFO] cayenne-server: Cayenne Server ..................... FAILURE [05:30 min]
[INFO] cayenne-project: Cayenne Project ................... SKIPPED
[INFO] cayenne-dbsync: Database Synchronization Tools ..... SKIPPED
[INFO] cayenne-cgen: Cayenne Class Generation Tools ....... SKIPPED
[INFO] cayenne-ant: Cayenne Ant Tasks ..................... SKIPPED
[INFO] cayenne-cache-invalidation: Cayenne Cache Invalidation SKIPPED
[INFO] cayenne-web: Cayenne Web Extensions ................ SKIPPED
[INFO] cayenne-rop-server ................................. SKIPPED
[INFO] cayenne-client: Cayenne ROP Client ................. SKIPPED
[INFO] cayenne-client-jetty: Cayenne ROP Client (Jetty) ... SKIPPED
[INFO] cayenne-commitlog: Cayenne Commit Log Module ....... SKIPPED
[INFO] cayenne-maven-plugins-parent: Maven Plugins parent . SKIPPED
[INFO] cayenne-maven-plugin: Cayenne Maven Plugin ......... SKIPPED
[INFO] cayenne-crypto: Cayenne Cryptography Extensions .... SKIPPED
[INFO] cayenne-dbcp2: Cayenne DBCP2 Extension ............. SKIPPED
[INFO] cayenne-gradle-plugin: Cayenne Gradle Plugin ....... SKIPPED
[INFO] cayenne-jcache: Cayenne JCache Integration ......... SKIPPED
[INFO] cayenne-joda: Cayenne Joda Extensions .............. SKIPPED
[INFO] cayenne-lifecycle: Cayenne Lifecycle Utilities ..... SKIPPED
[INFO] cayenne-project-compatibility ...................... SKIPPED
[INFO] cayenne-protostuff: Cayenne Protostuff Extension ... SKIPPED
[INFO] cayenne-velocity: Cayenne Velocity template processor SKIPPED
[INFO] cayenne-osgi ....................................... SKIPPED
[INFO] cayenne-jgroups: Cayenne JGroups Event bridge ...... SKIPPED
[INFO] cayenne-jms: Cayenne JMS Event bridge .............. SKIPPED
[INFO] cayenne-xmpp: Cayenne XMPP Event bridge ............ SKIPPED
[INFO] maven-cayenne-plugin: Deprecated Cayenne Maven Plugin SKIPPED
[INFO] cayenne-modeler-parent: Cayenne Modeler Parent ..... SKIPPED
[INFO] cayenne-wocompat: WebObjects Compatibility Library . SKIPPED
[INFO] cayenne-modeler: Cayenne Modeler Core .............. SKIPPED
[INFO] cayenne-modeler-generic-ext: Modeler Generic Extensions SKIPPED
[INFO] cayenne-modeler-maven-plugin: Cayenne Modeler Maven Plugin SKIPPED
[INFO] cayenne-tools-itest: Tools integration tests ....... SKIPPED
[INFO] cayenne-modeler-generic: Modeler Generic Assembly .. SKIPPED
[INFO] cayenne-modeler-mac-ext: Modeler MacOS Extensions .. SKIPPED
[INFO] cayenne-modeler-mac: Modeler MacOS Assembly ........ SKIPPED
[INFO] cayenne-modeler-win-ext: Modeler Win Extensions .... SKIPPED
[INFO] cayenne-modeler-win: Modeler Windows Assembly ...... SKIPPED
[INFO] cayenne-tutorials-parent: Cayenne Tutorials ........ SKIPPED
[INFO] tutorial: Cayenne Tutorial ......................... SKIPPED
[INFO] tutorial-rop-client: Cayenne ROP Client Tutorial ... SKIPPED
[INFO] tutorial-rop-client-http2: Cayenne ROP HTTP/2 Client Tutorial SKIPPED
[INFO] tutorial-rop-server: Cayenne ROP Server Tutorial ... SKIPPED
[INFO] tutorial-rop-server-http2: Cayenne ROP HTTP/2 Server Tutorial SKIPPED
[INFO] cayenne-docs-parent: Cayenne Documentation Parent .. SKIPPED
[INFO] cayenne-doc: Cayenne Documentation ................. SKIPPED
[INFO] cayenne-asciidoc: Cayenne AsciiDoc Documentation parent SKIPPED
[INFO] cayenne-asciidoc-extension ......................... SKIPPED
[INFO] cayenne-guide: AsciiDoc - Cayenne Framework Guide .. SKIPPED
[INFO] getting-started-guide: AsciiDoc - Getting Started with Cayenne SKIPPED
[INFO] getting-started-db-first: AsciiDoc - Cayenne Database First tutorial SKIPPED
[INFO] getting-started-rop: AsciiDoc - Getting Started with Cayenne ROP (Remote Object Persistence)
SKIPPED
[INFO] upgrade-guide: Asciidoc - Cayenne New Features and Upgrade Guide SKIPPED
[INFO] cayenne-assembly: Cayenne Release Assembly ......... SKIPPED
[INFO] ------------------------------------------------------------------------
[INFO] BUILD FAILURE
[INFO] ------------------------------------------------------------------------
[INFO] Total time: 05:48 min
[INFO] Finished at: 2018-03-06T15:27:48Z
[INFO] Final Memory: 45M/356M
[INFO] ------------------------------------------------------------------------
[ERROR] Failed to execute goal org.apache.maven.plugins:maven-failsafe-plugin:2.20.1:verify
(integration-test) on project cayenne-server: There are test failures.
[ERROR] 
[ERROR] Please refer to <https://builds.apache.org/job/cayenne-master/cayenneTestConnection=derby,jdk=JDK%201.8%20(latest),slave=ubuntu/ws/cayenne-server/target/failsafe-reports>
for the individual test results.
[ERROR] Please refer to dump files (if any exist) [date]-jvmRun[N].dump, [date].dumpstream
and [date]-jvmRun[N].dumpstream.
[ERROR] -> [Help 1]
org.apache.maven.lifecycle.LifecycleExecutionException: Failed to execute goal org.apache.maven.plugins:maven-failsafe-plugin:2.20.1:verify
(integration-test) on project cayenne-server: There are test failures.

Please refer to <https://builds.apache.org/job/cayenne-master/cayenneTestConnection=derby,jdk=JDK%201.8%20(latest),slave=ubuntu/ws/cayenne-server/target/failsafe-reports>
for the individual test results.
Please refer to dump files (if any exist) [date]-jvmRun[N].dump, [date].dumpstream and [date]-jvmRun[N].dumpstream.
    at org.apache.maven.lifecycle.internal.MojoExecutor.execute (MojoExecutor.java:213)
    at org.apache.maven.lifecycle.internal.MojoExecutor.execute (MojoExecutor.java:154)
    at org.apache.maven.lifecycle.internal.MojoExecutor.execute (MojoExecutor.java:146)
    at org.apache.maven.lifecycle.internal.LifecycleModuleBuilder.buildProject (LifecycleModuleBuilder.java:117)
    at org.apache.maven.lifecycle.internal.LifecycleModuleBuilder.buildProject (LifecycleModuleBuilder.java:81)
    at org.apache.maven.lifecycle.internal.builder.singlethreaded.SingleThreadedBuilder.build
(SingleThreadedBuilder.java:51)
    at org.apache.maven.lifecycle.internal.LifecycleStarter.execute (LifecycleStarter.java:128)
    at org.apache.maven.DefaultMaven.doExecute (DefaultMaven.java:309)
    at org.apache.maven.DefaultMaven.doExecute (DefaultMaven.java:194)
    at org.apache.maven.DefaultMaven.execute (DefaultMaven.java:107)
    at org.apache.maven.cli.MavenCli.execute (MavenCli.java:955)
    at org.apache.maven.cli.MavenCli.doMain (MavenCli.java:290)
    at org.apache.maven.cli.MavenCli.main (MavenCli.java:194)
    at sun.reflect.NativeMethodAccessorImpl.invoke0 (Native Method)
    at sun.reflect.NativeMethodAccessorImpl.invoke (NativeMethodAccessorImpl.java:62)
    at sun.reflect.DelegatingMethodAccessorImpl.invoke (DelegatingMethodAccessorImpl.java:43)
    at java.lang.reflect.Method.invoke (Method.java:498)
    at org.codehaus.plexus.classworlds.launcher.Launcher.launchEnhanced (Launcher.java:289)
    at org.codehaus.plexus.classworlds.launcher.Launcher.launch (Launcher.java:229)
    at org.codehaus.plexus.classworlds.launcher.Launcher.mainWithExitCode (Launcher.java:415)
    at org.codehaus.plexus.classworlds.launcher.Launcher.main (Launcher.java:356)
Caused by: org.apache.maven.plugin.MojoFailureException: There are test failures.

Please refer to <https://builds.apache.org/job/cayenne-master/cayenneTestConnection=derby,jdk=JDK%201.8%20(latest),slave=ubuntu/ws/cayenne-server/target/failsafe-reports>
for the individual test results.
Please refer to dump files (if any exist) [date]-jvmRun[N].dump, [date].dumpstream and [date]-jvmRun[N].dumpstream.
    at org.apache.maven.plugin.surefire.SurefireHelper.throwException (SurefireHelper.java:240)
    at org.apache.maven.plugin.surefire.SurefireHelper.reportExecution (SurefireHelper.java:112)
    at org.apache.maven.plugin.failsafe.VerifyMojo.execute (VerifyMojo.java:188)
    at org.apache.maven.plugin.DefaultBuildPluginManager.executeMojo (DefaultBuildPluginManager.java:134)
    at org.apache.maven.lifecycle.internal.MojoExecutor.execute (MojoExecutor.java:208)
    at org.apache.maven.lifecycle.internal.MojoExecutor.execute (MojoExecutor.java:154)
    at org.apache.maven.lifecycle.internal.MojoExecutor.execute (MojoExecutor.java:146)
    at org.apache.maven.lifecycle.internal.LifecycleModuleBuilder.buildProject (LifecycleModuleBuilder.java:117)
    at org.apache.maven.lifecycle.internal.LifecycleModuleBuilder.buildProject (LifecycleModuleBuilder.java:81)
    at org.apache.maven.lifecycle.internal.builder.singlethreaded.SingleThreadedBuilder.build
(SingleThreadedBuilder.java:51)
    at org.apache.maven.lifecycle.internal.LifecycleStarter.execute (LifecycleStarter.java:128)
    at org.apache.maven.DefaultMaven.doExecute (DefaultMaven.java:309)
    at org.apache.maven.DefaultMaven.doExecute (DefaultMaven.java:194)
    at org.apache.maven.DefaultMaven.execute (DefaultMaven.java:107)
    at org.apache.maven.cli.MavenCli.execute (MavenCli.java:955)
    at org.apache.maven.cli.MavenCli.doMain (MavenCli.java:290)
    at org.apache.maven.cli.MavenCli.main (MavenCli.java:194)
    at sun.reflect.NativeMethodAccessorImpl.invoke0 (Native Method)
    at sun.reflect.NativeMethodAccessorImpl.invoke (NativeMethodAccessorImpl.java:62)
    at sun.reflect.DelegatingMethodAccessorImpl.invoke (DelegatingMethodAccessorImpl.java:43)
    at java.lang.reflect.Method.invoke (Method.java:498)
    at org.codehaus.plexus.classworlds.launcher.Launcher.launchEnhanced (Launcher.java:289)
    at org.codehaus.plexus.classworlds.launcher.Launcher.launch (Launcher.java:229)
    at org.codehaus.plexus.classworlds.launcher.Launcher.mainWithExitCode (Launcher.java:415)
    at org.codehaus.plexus.classworlds.launcher.Launcher.main (Launcher.java:356)
[ERROR] 
[ERROR] Re-run Maven using the -X switch to enable full debug logging.
[ERROR] 
[ERROR] For more information about the errors and possible solutions, please read the following
articles:
[ERROR] [Help 1] http://cwiki.apache.org/confluence/display/MAVEN/MojoFailureException
[ERROR] 
[ERROR] After correcting the problems, you can resume the build with the command
[ERROR]   mvn <goals> -rf :cayenne-server
Build step 'Invoke top-level Maven targets' marked build as failure
Recording test results
Not sending mail to unregistered user stariy95@gmail.com

Mime
View raw message