cayenne-commits mailing list archives

Site index · List index
Message view « Date » · « Thread »
Top « Date » · « Thread »
From Apache Jenkins Server <jenk...@builds.apache.org>
Subject Build failed in Jenkins: cayenne-master » derby,JDK 1.8 (latest),ubuntu #826
Date Wed, 18 Apr 2018 11:41:50 GMT
See <https://builds.apache.org/job/cayenne-master/cayenneTestConnection=derby,jdk=JDK%201.8%20(latest),slave=ubuntu/826/display/redirect?page=changes>

Changes:

[stariy95] Fix test failures on Oracle

------------------------------------------
[...truncated 9.69 MB...]
org.apache.cayenne.tools.DbImportIT > excludeRelDbTaskSuccess FAILED
    org.gradle.testkit.runner.InvalidRunnerConfigurationException: Unable to write to test
kit directory: /tmp/.gradle-test-kit-jenkins
        at org.gradle.testkit.runner.internal.DefaultGradleRunner.createTestKitDir(DefaultGradleRunner.java:314)
        at org.gradle.testkit.runner.internal.DefaultGradleRunner.run(DefaultGradleRunner.java:281)
        at org.gradle.testkit.runner.internal.DefaultGradleRunner.build(DefaultGradleRunner.java:234)
        at org.apache.cayenne.tools.DbImportIT.excludeRelDbTaskSuccess(DbImportIT.java:118)

org.apache.cayenne.tools.GradlePluginIT > testGradleVersionsCompatibility FAILED
    java.lang.AssertionError: Failed versions: 4.3 4.0 3.5 3.3 3.0 2.12 2.8
        at org.junit.Assert.fail(Assert.java:88)
        at org.junit.Assert.assertTrue(Assert.java:41)
        at org.apache.cayenne.tools.GradlePluginIT.testGradleVersionsCompatibility(GradlePluginIT.java:78)

org.apache.cayenne.tools.DbGenerateTaskIT > defaultConfigTaskSuccess FAILED
    org.gradle.testkit.runner.InvalidRunnerConfigurationException: Unable to write to test
kit directory: /tmp/.gradle-test-kit-jenkins
        at org.gradle.testkit.runner.internal.DefaultGradleRunner.createTestKitDir(DefaultGradleRunner.java:314)
        at org.gradle.testkit.runner.internal.DefaultGradleRunner.run(DefaultGradleRunner.java:281)
        at org.gradle.testkit.runner.internal.DefaultGradleRunner.build(DefaultGradleRunner.java:234)
        at org.apache.cayenne.tools.DbGenerateTaskIT.defaultConfigTaskSuccess(DbGenerateTaskIT.java:65)

org.apache.cayenne.tools.DbGenerateTaskIT > notConfiguredTaskFailure FAILED
    org.gradle.testkit.runner.InvalidRunnerConfigurationException: Unable to write to test
kit directory: /tmp/.gradle-test-kit-jenkins
        at org.gradle.testkit.runner.internal.DefaultGradleRunner.createTestKitDir(DefaultGradleRunner.java:314)
        at org.gradle.testkit.runner.internal.DefaultGradleRunner.run(DefaultGradleRunner.java:281)
        at org.gradle.testkit.runner.internal.DefaultGradleRunner.buildAndFail(DefaultGradleRunner.java:245)
        at org.apache.cayenne.tools.DbGenerateTaskIT.notConfiguredTaskFailure(DbGenerateTaskIT.java:43)

org.apache.cayenne.tools.DbGenerateTaskIT > customConfigTaskSuccess FAILED
    org.gradle.testkit.runner.InvalidRunnerConfigurationException: Unable to write to test
kit directory: /tmp/.gradle-test-kit-jenkins
        at org.gradle.testkit.runner.internal.DefaultGradleRunner.createTestKitDir(DefaultGradleRunner.java:314)
        at org.gradle.testkit.runner.internal.DefaultGradleRunner.run(DefaultGradleRunner.java:281)
        at org.gradle.testkit.runner.internal.DefaultGradleRunner.build(DefaultGradleRunner.java:234)
        at org.apache.cayenne.tools.DbGenerateTaskIT.customConfigTaskSuccess(DbGenerateTaskIT.java:91)

org.apache.cayenne.tools.CgenTaskIT > classGeneratingWithCustomConfigSuccess FAILED
    org.gradle.testkit.runner.InvalidRunnerConfigurationException: Unable to write to test
kit directory: /tmp/.gradle-test-kit-jenkins
        at org.gradle.testkit.runner.internal.DefaultGradleRunner.createTestKitDir(DefaultGradleRunner.java:314)
        at org.gradle.testkit.runner.internal.DefaultGradleRunner.run(DefaultGradleRunner.java:281)
        at org.gradle.testkit.runner.internal.DefaultGradleRunner.build(DefaultGradleRunner.java:234)
        at org.apache.cayenne.tools.CgenTaskIT.classGeneratingWithCustomConfigSuccess(CgenTaskIT.java:70)

org.apache.cayenne.tools.CgenTaskIT > classGeneratingWithDefaultConfigSuccess FAILED
    org.gradle.testkit.runner.InvalidRunnerConfigurationException: Unable to write to test
kit directory: /tmp/.gradle-test-kit-jenkins
        at org.gradle.testkit.runner.internal.DefaultGradleRunner.createTestKitDir(DefaultGradleRunner.java:314)
        at org.gradle.testkit.runner.internal.DefaultGradleRunner.run(DefaultGradleRunner.java:281)
        at org.gradle.testkit.runner.internal.DefaultGradleRunner.build(DefaultGradleRunner.java:234)
        at org.apache.cayenne.tools.CgenTaskIT.classGeneratingWithDefaultConfigSuccess(CgenTaskIT.java:48)

33 tests completed, 12 failed
:test FAILED

FAILURE: Build failed with an exception.

* What went wrong:
Execution failed for task ':test'.
> There were failing tests. See the report at: file:///home/jenkins/jenkins-slave/workspace/cayenne-master/cayenneTestConnection/derby/jdk/JDK%201.8%20(latest)/slave/ubuntu/cayenne-gradle-plugin/build/reports/tests/test/index.html

* Try:
Run with --stacktrace option to get the stack trace. Run with --info or --debug option to
get more log output.

* Get more help at https://help.gradle.org

BUILD FAILED in 1m 21s
11 actionable tasks: 11 executed
[ERROR] Command execution failed.
org.apache.commons.exec.ExecuteException: Process exited with an error: 1 (Exit value: 1)
    at org.apache.commons.exec.DefaultExecutor.executeInternal (DefaultExecutor.java:404)
    at org.apache.commons.exec.DefaultExecutor.execute (DefaultExecutor.java:166)
    at org.codehaus.mojo.exec.ExecMojo.executeCommandLine (ExecMojo.java:804)
    at org.codehaus.mojo.exec.ExecMojo.executeCommandLine (ExecMojo.java:751)
    at org.codehaus.mojo.exec.ExecMojo.execute (ExecMojo.java:313)
    at org.apache.maven.plugin.DefaultBuildPluginManager.executeMojo (DefaultBuildPluginManager.java:134)
    at org.apache.maven.lifecycle.internal.MojoExecutor.execute (MojoExecutor.java:208)
    at org.apache.maven.lifecycle.internal.MojoExecutor.execute (MojoExecutor.java:154)
    at org.apache.maven.lifecycle.internal.MojoExecutor.execute (MojoExecutor.java:146)
    at org.apache.maven.lifecycle.internal.LifecycleModuleBuilder.buildProject (LifecycleModuleBuilder.java:117)
    at org.apache.maven.lifecycle.internal.LifecycleModuleBuilder.buildProject (LifecycleModuleBuilder.java:81)
    at org.apache.maven.lifecycle.internal.builder.singlethreaded.SingleThreadedBuilder.build
(SingleThreadedBuilder.java:51)
    at org.apache.maven.lifecycle.internal.LifecycleStarter.execute (LifecycleStarter.java:128)
    at org.apache.maven.DefaultMaven.doExecute (DefaultMaven.java:309)
    at org.apache.maven.DefaultMaven.doExecute (DefaultMaven.java:194)
    at org.apache.maven.DefaultMaven.execute (DefaultMaven.java:107)
    at org.apache.maven.cli.MavenCli.execute (MavenCli.java:955)
    at org.apache.maven.cli.MavenCli.doMain (MavenCli.java:290)
    at org.apache.maven.cli.MavenCli.main (MavenCli.java:194)
    at sun.reflect.NativeMethodAccessorImpl.invoke0 (Native Method)
    at sun.reflect.NativeMethodAccessorImpl.invoke (NativeMethodAccessorImpl.java:62)
    at sun.reflect.DelegatingMethodAccessorImpl.invoke (DelegatingMethodAccessorImpl.java:43)
    at java.lang.reflect.Method.invoke (Method.java:498)
    at org.codehaus.plexus.classworlds.launcher.Launcher.launchEnhanced (Launcher.java:289)
    at org.codehaus.plexus.classworlds.launcher.Launcher.launch (Launcher.java:229)
    at org.codehaus.plexus.classworlds.launcher.Launcher.mainWithExitCode (Launcher.java:415)
    at org.codehaus.plexus.classworlds.launcher.Launcher.main (Launcher.java:356)
[INFO] ------------------------------------------------------------------------
[INFO] Reactor Summary:
[INFO] 
[INFO] cayenne-parent: Top-level parent of Cayenne modules  SUCCESS [  3.030 s]
[INFO] build-tools-parent: Cayenne Build Tools Parent ..... SUCCESS [  0.038 s]
[INFO] cayenne-legal: Cayenne License and Notice Bundle ... SUCCESS [  3.167 s]
[INFO] cayenne-test-utilities: Common Unit Test Utilities . SUCCESS [  1.965 s]
[INFO] cayenne-checkers: Cayenne Code Checkers ............ SUCCESS [  1.560 s]
[INFO] cayenne-di: Cayenne Dependency Injection Container . SUCCESS [  8.399 s]
[INFO] cayenne-server: Cayenne Server ..................... SUCCESS [07:38 min]
[INFO] cayenne-project: Cayenne Project ................... SUCCESS [  3.698 s]
[INFO] cayenne-dbsync: Database Synchronization Tools ..... SUCCESS [03:49 min]
[INFO] cayenne-cgen: Cayenne Class Generation Tools ....... SUCCESS [  3.376 s]
[INFO] cayenne-ant: Cayenne Ant Tasks ..................... SUCCESS [  7.438 s]
[INFO] cayenne-cache-invalidation: Cayenne Cache Invalidation SUCCESS [  3.168 s]
[INFO] cayenne-web: Cayenne Web Extensions ................ SUCCESS [  2.888 s]
[INFO] cayenne-rop-server ................................. SUCCESS [  3.995 s]
[INFO] cayenne-client: Cayenne ROP Client ................. SUCCESS [03:51 min]
[INFO] cayenne-client-jetty: Cayenne ROP Client (Jetty) ... SUCCESS [  5.138 s]
[INFO] cayenne-commitlog: Cayenne Commit Log Module ....... SUCCESS [  4.633 s]
[INFO] cayenne-maven-plugins-parent: Maven Plugins parent . SUCCESS [  2.496 s]
[INFO] cayenne-maven-plugin: Cayenne Maven Plugin ......... SUCCESS [ 29.734 s]
[INFO] cayenne-crypto: Cayenne Cryptography Extensions .... SUCCESS [  8.418 s]
[INFO] cayenne-dbcp2: Cayenne DBCP2 Extension ............. SUCCESS [  1.598 s]
[INFO] cayenne-gradle-plugin: Cayenne Gradle Plugin ....... FAILURE [01:23 min]
[INFO] cayenne-jcache: Cayenne JCache Integration ......... SKIPPED
[INFO] cayenne-joda: Cayenne Joda Extensions .............. SKIPPED
[INFO] cayenne-lifecycle: Cayenne Lifecycle Utilities ..... SKIPPED
[INFO] cayenne-project-compatibility ...................... SKIPPED
[INFO] cayenne-protostuff: Cayenne Protostuff Extension ... SKIPPED
[INFO] cayenne-velocity: Cayenne Velocity template processor SKIPPED
[INFO] cayenne-osgi ....................................... SKIPPED
[INFO] cayenne-jgroups: Cayenne JGroups Event bridge ...... SKIPPED
[INFO] cayenne-jms: Cayenne JMS Event bridge .............. SKIPPED
[INFO] cayenne-xmpp: Cayenne XMPP Event bridge ............ SKIPPED
[INFO] maven-cayenne-plugin: Deprecated Cayenne Maven Plugin SKIPPED
[INFO] cayenne-modeler-parent: Cayenne Modeler Parent ..... SKIPPED
[INFO] cayenne-wocompat: WebObjects Compatibility Library . SKIPPED
[INFO] cayenne-modeler: Cayenne Modeler Core .............. SKIPPED
[INFO] cayenne-modeler-generic-ext: Modeler Generic Extensions SKIPPED
[INFO] cayenne-modeler-maven-plugin: Cayenne Modeler Maven Plugin SKIPPED
[INFO] cayenne-tools-itest: Tools integration tests ....... SKIPPED
[INFO] cayenne-modeler-generic: Modeler Generic Assembly .. SKIPPED
[INFO] cayenne-modeler-mac-ext: Modeler MacOS Extensions .. SKIPPED
[INFO] cayenne-modeler-mac: Modeler MacOS Assembly ........ SKIPPED
[INFO] cayenne-modeler-win-ext: Modeler Win Extensions .... SKIPPED
[INFO] cayenne-modeler-win: Modeler Windows Assembly ...... SKIPPED
[INFO] cayenne-tutorials-parent: Cayenne Tutorials ........ SKIPPED
[INFO] tutorial: Cayenne Tutorial ......................... SKIPPED
[INFO] tutorial-rop-client: Cayenne ROP Client Tutorial ... SKIPPED
[INFO] tutorial-rop-client-http2: Cayenne ROP HTTP/2 Client Tutorial SKIPPED
[INFO] tutorial-rop-server: Cayenne ROP Server Tutorial ... SKIPPED
[INFO] tutorial-rop-server-http2: Cayenne ROP HTTP/2 Server Tutorial SKIPPED
[INFO] cayenne-docs-parent: Cayenne Documentation Parent .. SKIPPED
[INFO] cayenne-doc: Cayenne Documentation ................. SKIPPED
[INFO] cayenne-asciidoc: Cayenne AsciiDoc Documentation parent SKIPPED
[INFO] cayenne-asciidoc-extension ......................... SKIPPED
[INFO] cayenne-guide: AsciiDoc - Cayenne Framework Guide .. SKIPPED
[INFO] getting-started-guide: AsciiDoc - Getting Started with Cayenne SKIPPED
[INFO] getting-started-db-first: AsciiDoc - Cayenne Database First tutorial SKIPPED
[INFO] getting-started-rop: AsciiDoc - Getting Started with Cayenne ROP (Remote Object Persistence)
SKIPPED
[INFO] upgrade-guide: Asciidoc - Cayenne New Features and Upgrade Guide SKIPPED
[INFO] cayenne-assembly: Cayenne Release Assembly ......... SKIPPED
[INFO] ------------------------------------------------------------------------
[INFO] BUILD FAILURE
[INFO] ------------------------------------------------------------------------
[INFO] Total time: 18:20 min
[INFO] Finished at: 2018-04-18T11:41:45Z
[INFO] Final Memory: 64M/483M
[INFO] ------------------------------------------------------------------------
[ERROR] Failed to execute goal org.codehaus.mojo:exec-maven-plugin:1.6.0:exec (gradle) on
project cayenne-gradle-plugin: Command execution failed.: Process exited with an error: 1
(Exit value: 1) -> [Help 1]
org.apache.maven.lifecycle.LifecycleExecutionException: Failed to execute goal org.codehaus.mojo:exec-maven-plugin:1.6.0:exec
(gradle) on project cayenne-gradle-plugin: Command execution failed.
    at org.apache.maven.lifecycle.internal.MojoExecutor.execute (MojoExecutor.java:213)
    at org.apache.maven.lifecycle.internal.MojoExecutor.execute (MojoExecutor.java:154)
    at org.apache.maven.lifecycle.internal.MojoExecutor.execute (MojoExecutor.java:146)
    at org.apache.maven.lifecycle.internal.LifecycleModuleBuilder.buildProject (LifecycleModuleBuilder.java:117)
    at org.apache.maven.lifecycle.internal.LifecycleModuleBuilder.buildProject (LifecycleModuleBuilder.java:81)
    at org.apache.maven.lifecycle.internal.builder.singlethreaded.SingleThreadedBuilder.build
(SingleThreadedBuilder.java:51)
    at org.apache.maven.lifecycle.internal.LifecycleStarter.execute (LifecycleStarter.java:128)
    at org.apache.maven.DefaultMaven.doExecute (DefaultMaven.java:309)
    at org.apache.maven.DefaultMaven.doExecute (DefaultMaven.java:194)
    at org.apache.maven.DefaultMaven.execute (DefaultMaven.java:107)
    at org.apache.maven.cli.MavenCli.execute (MavenCli.java:955)
    at org.apache.maven.cli.MavenCli.doMain (MavenCli.java:290)
    at org.apache.maven.cli.MavenCli.main (MavenCli.java:194)
    at sun.reflect.NativeMethodAccessorImpl.invoke0 (Native Method)
    at sun.reflect.NativeMethodAccessorImpl.invoke (NativeMethodAccessorImpl.java:62)
    at sun.reflect.DelegatingMethodAccessorImpl.invoke (DelegatingMethodAccessorImpl.java:43)
    at java.lang.reflect.Method.invoke (Method.java:498)
    at org.codehaus.plexus.classworlds.launcher.Launcher.launchEnhanced (Launcher.java:289)
    at org.codehaus.plexus.classworlds.launcher.Launcher.launch (Launcher.java:229)
    at org.codehaus.plexus.classworlds.launcher.Launcher.mainWithExitCode (Launcher.java:415)
    at org.codehaus.plexus.classworlds.launcher.Launcher.main (Launcher.java:356)
Caused by: org.apache.maven.plugin.MojoExecutionException: Command execution failed.
    at org.codehaus.mojo.exec.ExecMojo.execute (ExecMojo.java:326)
    at org.apache.maven.plugin.DefaultBuildPluginManager.executeMojo (DefaultBuildPluginManager.java:134)
    at org.apache.maven.lifecycle.internal.MojoExecutor.execute (MojoExecutor.java:208)
    at org.apache.maven.lifecycle.internal.MojoExecutor.execute (MojoExecutor.java:154)
    at org.apache.maven.lifecycle.internal.MojoExecutor.execute (MojoExecutor.java:146)
    at org.apache.maven.lifecycle.internal.LifecycleModuleBuilder.buildProject (LifecycleModuleBuilder.java:117)
    at org.apache.maven.lifecycle.internal.LifecycleModuleBuilder.buildProject (LifecycleModuleBuilder.java:81)
    at org.apache.maven.lifecycle.internal.builder.singlethreaded.SingleThreadedBuilder.build
(SingleThreadedBuilder.java:51)
    at org.apache.maven.lifecycle.internal.LifecycleStarter.execute (LifecycleStarter.java:128)
    at org.apache.maven.DefaultMaven.doExecute (DefaultMaven.java:309)
    at org.apache.maven.DefaultMaven.doExecute (DefaultMaven.java:194)
    at org.apache.maven.DefaultMaven.execute (DefaultMaven.java:107)
    at org.apache.maven.cli.MavenCli.execute (MavenCli.java:955)
    at org.apache.maven.cli.MavenCli.doMain (MavenCli.java:290)
    at org.apache.maven.cli.MavenCli.main (MavenCli.java:194)
    at sun.reflect.NativeMethodAccessorImpl.invoke0 (Native Method)
    at sun.reflect.NativeMethodAccessorImpl.invoke (NativeMethodAccessorImpl.java:62)
    at sun.reflect.DelegatingMethodAccessorImpl.invoke (DelegatingMethodAccessorImpl.java:43)
    at java.lang.reflect.Method.invoke (Method.java:498)
    at org.codehaus.plexus.classworlds.launcher.Launcher.launchEnhanced (Launcher.java:289)
    at org.codehaus.plexus.classworlds.launcher.Launcher.launch (Launcher.java:229)
    at org.codehaus.plexus.classworlds.launcher.Launcher.mainWithExitCode (Launcher.java:415)
    at org.codehaus.plexus.classworlds.launcher.Launcher.main (Launcher.java:356)
Caused by: org.apache.commons.exec.ExecuteException: Process exited with an error: 1 (Exit
value: 1)
    at org.apache.commons.exec.DefaultExecutor.executeInternal (DefaultExecutor.java:404)
    at org.apache.commons.exec.DefaultExecutor.execute (DefaultExecutor.java:166)
    at org.codehaus.mojo.exec.ExecMojo.executeCommandLine (ExecMojo.java:804)
    at org.codehaus.mojo.exec.ExecMojo.executeCommandLine (ExecMojo.java:751)
    at org.codehaus.mojo.exec.ExecMojo.execute (ExecMojo.java:313)
    at org.apache.maven.plugin.DefaultBuildPluginManager.executeMojo (DefaultBuildPluginManager.java:134)
    at org.apache.maven.lifecycle.internal.MojoExecutor.execute (MojoExecutor.java:208)
    at org.apache.maven.lifecycle.internal.MojoExecutor.execute (MojoExecutor.java:154)
    at org.apache.maven.lifecycle.internal.MojoExecutor.execute (MojoExecutor.java:146)
    at org.apache.maven.lifecycle.internal.LifecycleModuleBuilder.buildProject (LifecycleModuleBuilder.java:117)
    at org.apache.maven.lifecycle.internal.LifecycleModuleBuilder.buildProject (LifecycleModuleBuilder.java:81)
    at org.apache.maven.lifecycle.internal.builder.singlethreaded.SingleThreadedBuilder.build
(SingleThreadedBuilder.java:51)
    at org.apache.maven.lifecycle.internal.LifecycleStarter.execute (LifecycleStarter.java:128)
    at org.apache.maven.DefaultMaven.doExecute (DefaultMaven.java:309)
    at org.apache.maven.DefaultMaven.doExecute (DefaultMaven.java:194)
    at org.apache.maven.DefaultMaven.execute (DefaultMaven.java:107)
    at org.apache.maven.cli.MavenCli.execute (MavenCli.java:955)
    at org.apache.maven.cli.MavenCli.doMain (MavenCli.java:290)
    at org.apache.maven.cli.MavenCli.main (MavenCli.java:194)
    at sun.reflect.NativeMethodAccessorImpl.invoke0 (Native Method)
    at sun.reflect.NativeMethodAccessorImpl.invoke (NativeMethodAccessorImpl.java:62)
    at sun.reflect.DelegatingMethodAccessorImpl.invoke (DelegatingMethodAccessorImpl.java:43)
    at java.lang.reflect.Method.invoke (Method.java:498)
    at org.codehaus.plexus.classworlds.launcher.Launcher.launchEnhanced (Launcher.java:289)
    at org.codehaus.plexus.classworlds.launcher.Launcher.launch (Launcher.java:229)
    at org.codehaus.plexus.classworlds.launcher.Launcher.mainWithExitCode (Launcher.java:415)
    at org.codehaus.plexus.classworlds.launcher.Launcher.main (Launcher.java:356)
[ERROR] 
[ERROR] Re-run Maven using the -X switch to enable full debug logging.
[ERROR] 
[ERROR] For more information about the errors and possible solutions, please read the following
articles:
[ERROR] [Help 1] http://cwiki.apache.org/confluence/display/MAVEN/MojoExecutionException
[ERROR] 
[ERROR] After correcting the problems, you can resume the build with the command
[ERROR]   mvn <goals> -rf :cayenne-gradle-plugin
Build step 'Invoke top-level Maven targets' marked build as failure
Recording test results
Not sending mail to unregistered user stariy95@gmail.com

Mime
View raw message